##TITLE=$$ Begin of the data block
##JCAMP-DX=5.00 $$ ACD/SpecManager v 10.08
##SPECTROMETER/DATA SYSTEM=Alpha
##DATE=29 Dec 2014 15:06:02
##DATA TYPE=INFRARED SPECTRUM
##DATA CLASS=XYDATA
##ORIGIN=
##OWNER=
##NPOINTS=1765
##FIRSTX=399.76428223
##LASTX=3997.64306641
##MAXX=3997.64306641
##MINX=399.76428223
##MAXY=0.84255069
##MINY=0.30843225
##XFACTOR=1.0000000000
##YFACTOR=1.000000000000000e-9
##FIRSTY=0.58081746
##DELTAX=2.03961372
##XUNITS=1/CM
##YUNITS=ARBITRARY UNITS
##XYDATA=(X++(Y..Y))
$$ plain form
399.8 580817461 575273991 570791960 567778409 566998661 568286896 570443988 572404981 573791564 574787199
418.1 574787199 574663579 573116958 571048737 568632364 566005766 563512087 560883164 558007598 555937529
436.5 555937529 555774271 557907760 562077224 566556215 569830120 572151005 574052751 575150311 575017452
454.8 575017452 574294925 573096633 571266890 569247961 566789210 563484073 559895515 556827724 554233134
473.2 554233134 551784933 549605966 547870398 546867847 546839535 547275245 547419727 547074318 546403885
491.5 546403885 545338869 543670535 541507781 539153993 537024915 535053313 532595336 529495358
507.9 529495358 526072681 522555113 519095898 515596747 511759937 507943273 504953861 503309548
524.2 503309548 502928913 502954543 503050447 504005551 506606698 510791063 515804648 520953000 525686979
$$ packed form
399.8E80817461n543470m482031l013551p79748J288235K157092J960993J386583R95635
418.1E74787199j23620j546621k068221k416373k626598k493679k628923k875566k070069
436.5E55937529j63258K133489M169464M478991L273905K320885J901746J097560j32859
454.8E75017452p22527j198292j829743k018929k458751l305137l588558l067791k594590
473.2E54233134k448201k178967j735568j002551k8312M35710J44482l45409o70433
491.5E46403885j065016j668334k162754k353788k129078j971602k457977l099978
507.9E29495358l422677l517568l459215l499151l836810l816664k989412j644313
524.2E03309548l80635K5630R5904R55104K601147M184365N013585N148352M733979
$$ plain form
542.5 525686979 529431224 531704485 532292604 531492114 529891074 527891874 525421202 522130311 518082738
560.9 518082738 513533235 508489311 502934456 497082949 491874844 488761753 488496572 490638316 494415343
579.3 494415343 499514133 505674481 512352049 518621504 523419678 526299775 527618647 528184175 528369844
597.6 528369844 528138280 527598441 527013302 526838958 527293622 528086007 528967857 530108154 531931520
616 531931520 534723103 538132012 541605532 545066178 548582554 551921666 554718971 556909800 558701456
634.3 558701456 560371220 562002003 563423455 564552963 565518856 566517532 567781031 569140792 570137978
652.7 570137978 570892155 571912169 573200285 574292362 574811518 574828029 575861931 578639746 580072463
671 580072463 580700040 581844866 583295345 584843159 586508155 588051617 589150965 589868963 590324461
$$ packed form
542.5E25686979L744245K273261N88119q00490j601040j999200k470672l290891m047573
560.9E18082738m549503n043924n554855n851507n208105l113091k65181K141744L777027
579.3D94415343N098790O160348O677568O269455M798174K880097J318872N65528J85669
597.6E28369844k31564n39839n85139j74344M54664P92385Q81850J140297J823366
616E31931520K791583L408909L473520L460646L516376L339112K797305K190829J791656
634.3E58701456J669764J630783J421452J129508R65893R98676J263499J359761R97186
652.7E70137978P54177J020014J288116J092077N19156J6511J033902K777815J432717
671E80072463O27577J144826J450479J547814J664996J543462J099348P17998M55498
$$ plain form
689.4 590324461 590425491 589912713 588540733 586400926 583844185 581164360 578659952 576613963 575339079
707.7 575339079 575285077 576655030 579272449 582784355 586948276 591787338 597221255 602943599 608560145
726.1 608560145 613657892 618125916 622117162 625672877 628643513 630813301 632144570 632713258 632447660
744.5 632447660 631036699 628325284 624590635 620293021 615794301 611270010 606896281 603088558
760.8 603088558 600418031 599333346 600062549 602632105 606907010 612751663 620013237 628174841 636352777
779.1 636352777 643864930 650520086 656414866 661608040 666011214 669664502 673012078 676554918
795.4 676554918 680442810 684492528 688343406 691656053 694304347 696316063 697627485 698260546 698509991
813.8 698509991 698682606 698787391 698659539 698100984 696897924 694955111 692221224 688567042 683973253
$$ packed form
689.4E90324461J01030n12778j371980k139807k556741k679825k504408k045989j274884
707.7E75339079n4002J369953K617419L511906M163921M839062N433917N722344N616546
726.1F08560145N097747M468024L991246L555715K970636K169788J331269N68688k65598
744.5F32447660j410961k711415l734649m297614m498720m524291m373729l807723
760.8F03088558k670527j084685P29203K569556M274905N844653P261574Q161604Q177936
779.1F36352777P512153O655156N894780N193174M403174L653288L347576L542840
795.4F76554918L887892M049718L850878L312647K648294K011716J311422O33061K49445
813.8F98509991J72615J04785j27852n58555j203060j942813k733887l654182m593789
$$ plain form
832.2 683973253 678812742 673625529 668684125 663931549 659269631 654798090 650684237 646852612
848.5 646852612 642914534 638543248 633746028 628704607 624126792 621747315 623393953 629406929
864.8 629406929 638593316 649491370 660836160 671270967 679609954 685191870 687776446 687402129
881.1 687402129 684471905 679758847 674088418 668054342 661999643 656098604 650513470 645352423
897.4 645352423 640410364 635227859 629428744 622877896 615522444 607243240 597945750 587866902
913.7 587866902 577695012 568287134 560420096 554606020 550931275 549084723 548554182 548971415 550233483
932.1 550233483 552280128 555047452 558569968 562765837 566958904 569653034 569164991 564638674 556254387
950.5 556254387 544809163 531284571 516529977 501151681 485424608 469312072 452772498
$$ packed form
832.2F83973253n160511n187213m941404m752576m661918m471541m113853l831625
848.5F46852612l938078m371286m797220n041421m577815k379477J646638O012976
864.8F29406929R186387J0898054J1344790J0434807Q338987N581916K584576l74317
881.1F87402129k930224m713058n670429o034076o054699n901039n585134n161047
897.4F45352423m942059n182505n799115o550848p355452q279204r297490j0078848
913.7E87866902j0171890r407878p867038n814076l674745j846552n30541M17233J262068
932.1E50233483K046645K767324L522516M195869M193067K694130m88043m526317q384287
950.5E56254387j1445224j3524592j4754594j5378296j5727073j6112536j6539574
$$ plain form
964.7 452772498 435934007 418991178 402140707 385589480 369622469 354757667 341609776
979 341609776 330588013 321894169 315582365 311491132 309249580 308432251 308644950 309522450 310786307
997.4 310786307 312265307 313785344 315116614 316001832 316322088 316223472 315995544 315941334 316268384 317084700
1017.8 317084700 318473995 320483148 323038459 325989753 329145670 332320750 335393250 338124454
1034.1 338124454 340166092 341368526 341953725 342298061 342681617 343262643 344236165 345994025 349018753
1052.4 349018753 353499055 359170139 365738750 373186707 381565243 390319675 397526711 400245517
1068.8 400245517 396738261 388556391 379600108 373058200 369815171 369304270 370767266 373627752
1085.1 373627752 377380669 381736070 386644363 391931474 397122294 401536167 404609770 406267643
$$ packed form
964.7D52772498j6838491j6942829j6850471j6551227j5967011j4864802j3147891
979C41609776j1021763q693844o311804m091233k241552q17329K12699Q77500J263857
997.4C10786307J479000J520037J331270Q85218L20256r8616k27928n4210L27050Q16316
1017.8C17084700J389295K009153K555311K951294L155917L175080L072500K731204
1034.1C38124454K041638J202434N85199L44336L83556N81026R73522J757860L024728
1052.4C49018753M480302N671084O568611P447957Q378536Q754432P207036K718806
1068.8D00245517l507256q181870q956283o541908l243029n10901J462996K860486
1085.1C73627752L752917M355401M908293N287111N190820M413873L073603J657873
$$ plain form
1101.4 406267643 407020420 407739133 409200341 411711305 415124983 419032276 422929853 426343888 428996623
1119.8 428996623 430970341 432675153 434676975 437482715 441312551 445714176 449558020 451570332
1136.1 451570332 450872481 447360396 441690415 434880763 427851021 421235383 415463686 410900295
1152.4 410900295 407744855 405912042 405232430 405684650 407480061 410916448 416165352 423190624 431787997
1170.7 431787997 441712648 452720463 464438766 476427734 488397300 500179827 511537075
1185 511537075 522041321 531152964 538510084 544149339 548350811 551424026 553654850 555377543
1201.3 555377543 557006598 558946729 561473489 564660907 568489313 572898149 577671349 582346797
1217.7 582346797 586298704 589063168 590576351 591036797 590667009 589631259 588103056 586348295 584660709
$$ packed form
1101.4D06267643P52777P18713J461208K510964L413678L907293L897577L414035K652735
1119.8D28996623J973718J704812K001822K805740L829836M401625L843844K012312
1136.1D51570332o97851l512085n669981o809652p029742o615638n771697m563391
1152.4D10900295l155440j832813o79612M52220J795411L436387N248904P025272Q597373
1170.7D31787997R924651J1007815J1718303J1988968J1969566J1782527J1357248
1185E11537075J0504246R111643P357120N639255M201472L073215K230824J722693
1201.3E55377543J629055J940131K526760L187418L828406M408836M773200M675448
1217.7E82346797L951907K764464J513183M60446l69788j035750j528203j754761j687586
$$ plain form
1236 584660709 583217263 582042396 581192851 580897629 581403255 582725644 584579110 586528301 588303626
1254.4 588303626 589898705 591306627 592431962 593299866 594240546 595699787 597827017 600259066 602323532
1272.7 602323532 603634179 604293406 604509354 604370832 603933215 603325725 602711380 602105796 601348341
1291.1 601348341 600224912 598629236 596709609 594714403 592720926 590669692 588540137 586415052
1307.4 586415052 584528267 583080947 581930220 580787063 579652429 578545034 577075779 574715137
1323.7 574715137 571138620 566488028 561378002 556416810 551940501 548265934 545806468 544603705
1340 544603705 544148922 544109762 544387400 544726193 544912696 544878840 544587672 543912351 542818010 541753173
1360.4 541753173 541128755 540508270 539652169 538977325 538661838 539087594 540289044 541269422 541830659
$$ packed form
1236E84660709j443446j174867q49545k95222N05626J322389J853466J949191J775325
1254.4E88303626J595079J407922J125335Q67904R40680J459241K127230K432049K064466
1272.7F02323532J310647O59227K15948j38522m37617o07490o14345o05584p57455
1291.1F01348341j123429j595676j919627j995206j993477k051234k129555k125085
1307.4E86415052j886785j447320j150727j143157j134634j107395j469255k360642
1323.7E74715137l576517m650592n110026m961192m476309l674567k459466j202763
1340E44603705m54783l9160K77638L38793J86503l3856k91168o75321j094341j064837
1360.4E41753173o24418o20485q56101o74844l15487M25756J201450R80378N61237
$$ plain form
1378.8 541830659 542443097 543428421 545508325 549373388 553543568 556221068 558118761 559624553 559971929
1397.1 559971929 559274733 557920814 556372523 554938316 553176880 551063299 548968792 546950758
1413.5 546950758 545088530 544048011 543896914 543446898 543168545 543498635 544153333 545362353 546569884
1431.8 546569884 547587335 549920201 552860796 554265320 555236876 556327820 557278454 557865381 557376683
1450.2 557376683 555732429 553815603 552985489 552758694 551454246 550766766 552514195 555786490 558985770
1468.5 558985770 563930213 572982430 583010495 590994179 597913563 604626238 611161113 617057860
1484.9 617057860 623025417 629800916 635969818 639924765 643599570 648627341 653170943 655966997
1501.2 655966997 657874048 661098361 666773260 670125067 671464264 672994077 675141931 677711964
$$ packed form
1378.8E41830659O12438R85324K079904L865063M170180K677500J897693J505792L47376
1397.1E59971929o97196j353919j548291j434207j761436k113581k094507k018034
1413.5E46950758j862228j040519j51097m50016k78353L30090O54698J209020J207531
1431.8E46569884J017451K332866K940595J404524R71556J090944R50634N86927m88698
1450.2E57376683j644254j916826q30114k26795j304448o87480J747429L272295L199280
1468.5E58985770M944443R052217J0028065P983684O919384O712675O534875N896747
1484.9F17057860N967557O775499O168902L954947L674805N027771M543602K796054
1501.2F55966997J907051L224313N674899L351807J339197J529813K147854K570033
$$ plain form
1517.5 677711964 680248916 683195889 685538709 687126875 688783169 689993858 691314697 693008602
1533.8 693008602 693791628 694443583 696698725 698480427 698567748 698274076 698063612 698052347 697901368 697423398
1554.2 697423398 696898341 697254002 696818411 694671273 692517936 690639913 688981235 687108636 684804916
1572.6 684804916 682722032 680707932 678146780 675548553 673098624 670642555 668160439 665723145
1588.9 665723145 663309574 660955906 658619285 656199157 653747976 651355922 648974955 646477580
1605.2 646477580 643920541 641268909 638350844 635324180 632731259 630284607 627430439 624852657
1621.5 624852657 622690260 620365202 617910147 615433991 613095164 611922681 612513185 612689316 611947894
1639.9 611947894 611518145 611915708 614175379 616853416 617667973 620392442 626422167 629153192 630681753
$$ packed form
1517.5F77711964K536952K946973K342820J588166J656294J210689J320839J693905
1533.8F93008602P83026O51955K255142J781702Q7321k93672k10464j1265j50979m77970
1554.2F97423398n25057L55661m35591k147138k153337j878023j658678j872599k303720
1572.6F84804916k082884k014100k561152k598227k449929k456069k482116k437294
1588.9F65723145k413571k353668k336621k420128k451181k392054k380967k497375
1605.2F46477580k557039k651632k918065l026664k592921k446652k854168k577782
1621.5F24852657k162397k325058k455055k476156k338827j172483N90504J76131p41422
1639.9F11947894m29749L97563K259671K678037Q14557K724469O029725K731025J528561
$$ plain form
1658.2 630681753 633497775 637788832 642103374 645449579 649824083 655345559 659636855 664195836
1674.5 664195836 669391215 673392177 676837444 681583822 688443840 693309724 696494937 699770153
1690.9 699770153 702605784 706051111 709955156 713430524 716842830 718728960 720153153 721907318
1707.2 721907318 723231971 724298298 725454390 727106690 729457855 731040835 731658757 732497692 733786404
1725.5 733786404 735274553 736892819 738610804 741026640 743161082 744507372 746409178 748583436
1741.9 748583436 750485599 752533317 755104125 758315563 761370480 763689280 766107798 768824458
1758.2 768824458 771458745 774062872 776071548 777738869 779634058 781686664 783706248 785083711
1774.5 785083711 785975933 787068546 788385928 789575100 790588558 791442990 792295814 793528259 794899821
$$ packed form
1658.2F30681753K816022M291057M314542L346205M374504N521476M291296M558981
1674.5F64195836N195379M000962L445267M746378O860018M865884L185213L275216
1690.9F99770153K835631L445327L904045L475368L412306J886130J424193J754165
1707.2G21907318J324653J066327J156092J652300K351165J582980O17922Q38935J288712
1725.5G33786404J488149J618266J717985K415836K134442J346290J901806K174258
1741.9G48583436J902163K047718K570808L211438L054917K318800K418518K716660
1758.2G68824458K634287K604127K008676J667321J895189K052606K019584J377463
1774.5G85083711Q92222J092613J317382J189172J013458Q54432Q52824J232445J371562
$$ plain form
1792.8 794899821 795707762 796289146 797158003 798253417 799185932 799820125 800406814 801209986 802185774
1811.2 802185774 802989364 803597629 804183602 804800272 805484414 806262493 806949377 807438970 807983339 808554113
1831.6 808554113 809048653 809481204 809770942 809990466 810434997 811155498 811602712 811625004 811646998 811884105
1852 811884105 812259972 812584996 812743485 812825501 813007176 813341916 813749611 814070523 814161718 814249575
1872.4 814249575 814583361 814970732 815192282 815358520 815675735 816149890 816645086 817025721 817201853 817368329
1892.8 817368329 817729175 818114161 818283021 818298578 818385839 818664193 818999946 819151461 819084227 819038451
1913.2 819038451 819251716 819627464 819818497 819789171 819802940 819991171 820273519 820431292 820409179 820415199
1933.6 820415199 820595264 820864558 821042478 821073651 821072102 821230054 821516693 821731091 821818292 821888864
$$ packed form
1792.8G94899821Q07941N81384Q68857J095414R32515O34193N86689Q03172R75788
1811.2H02185774Q03590O08265N85973O16670O84142P78079O86884M89593N44369N70774
1831.6H08554113M94540M32551K89738K19524M44531P20501M47214K2292K1994K37107
1852H11884105L75867L25024J58489Q2016J81675L34740M07695L20912R1195Q7857
1872.4H14249575L33786L87371K21550J66238L17215M74155M95196L80635J76132J66476
1892.8H17368329L60846L84986J68860J5557Q7261K78354L35753J51515o7234m5776
1913.2H19038451K13265L75748J91033k9326J3769J88231K82348J57773k2113O020
1933.6H20415199J80065K69294J77920L1173j549J57952K86639K14398Q7201P0572
$$ plain form
1954 821888864 822079062 822384119 822645903 822748244 822825432 823059380 823388159 823626697 823695242 823666692
1974.4 823666692 823717415 823930085 824164808 824260354 824228942 824211419 824309766 824491203 824595153 824569106 824549854
1996.8 824549854 824613154 824700058 824691236 824535728 824325860 824200392 824142218 824003696 823731303 823379695
2017.2 823379695 822982669 822562873 822053015 821474254 821145594 821090102 821008742 820806205 820504367 820134342
2037.6 820134342 819779217 819504797 819302022 819113493 818880200 818647444 818512022 818486929 818509638 818514705
2058 818514705 818504274 818544209 818682969 818841934 818929374 818964481 819020331 819141567 819288731 819372118 819372535
2080.4 819372535 819382429 819486082 819677174 819851995 819938004 820007861 820156515 820370317 820577264 820722282
2100.8 820722282 820833743 821018219 821270823 821471512 821580946 821672499 821813226 821987092 822113037 822138548
$$ packed form
1954H21888864J90198L05057K61784J02341P7188K33948L28779K38538O8545k8550
1974.4H23666692N0723K12670K34723R5546l1412j7523R8347J81437J03950k6047j9252
1996.8H24549854O3300Q6904q822j55508k09868j25468n8174j38522k72393l51608
2017.2H23379695l97026m19796n09858n78761l28660n5492q1360k02537l01838l70025
2037.6H20134342l55125k74420k02775j88529k33293k32756j35422k5093K2709N067
2058H18514705j0431L9935J38760J58965Q7440L5107N5850J21236J47164Q3387M17
2080.4H19372535R894J03653J91092J74821Q6009O9857J48654K13802K06947J45018
2100.8H20722282J11461J84476K52604K00689J09434R1553J40727J73866J25945K5511
$$ plain form
2121.2 822138548 822128057 822184741 822306633 822402954 822414279 822389245 822432458 822560370 822681367 822700262 822647750
2143.7 822647750 822656989 822780669 822952390 823071897 823133409 823258400 823517680 823825419 824077189 824274421
2164.1 824274421 824517727 824881852 825356722 825860977 826288462 826687217 827182949 827741861 828223109 828586638
2184.5 828586638 828955352 829421043 829903185 830280185 830550373 830828488 831216991 831682742 832106054 832425177
2204.8 832425177 832721651 833112955 833572268 833978593 834282160 834560812 834913433 835315824 835656583 835887074
2225.2 835887074 836082399 836357892 836701691 836993575 837190390 837346137 837554514 837850928 838133693 838307738
2245.6 838307738 838409305 838544130 838781536 839034677 839170456 839249611 839405000 839647830 839884937 840044200
2266 840044200 840166926 840351164 840622842 840901613 841084242 841157079 841249049 841481268 841782272 841967702
$$ packed form
2121.2H22138548j0491N6684J21892R6321J1325k5034M3213J27912J20997J8895n2512
2143.7H22647750R239J23680J71721J19507O1512J24991K59280L07739K51770J97232
2164.1H24274421K43306L64125M74870N04255M27485L98755M95732N58912M81248L63529
2184.5H28586638L68714M65691M82142L77000K70188K78115L88503M65751M23312L19123
2204.8H32425177K96474L91304M59313M06325L03567K78652L52621M02391L40759K30491
2225.2H35887074J95325K75493L43799K91884J96815J55747K08377K96414K82765J74045
2245.6H38307738J01567J34825K37406K53141J35779P9155J55389K42830K37107J59263
2266H40044200J22726J84238K71678K78771J82629P2837R1970K32219L01004J85430
$$ plain form
2286.4 841967702 841990888 841988862 842091084 842257619 842337251 842313826 842307210 842389524 842510462 842550695 842458606
2308.9 842458606 842340589 842342317 842441738 842499554 842446566 842313170 842171729 842095435 842077136 842015922 841845334
2331.3 841845334 841630101 841483533 841393530 841194451 840895057 840832770 840952456 840848625 840571284 840293288
2351.7 840293288 840025187 839833736 839737892 839557409 839315057 839177430 839142978 839126348 839053452 838917553
2372.1 838917553 838829100 838844597 838886738 838855386 838719070 838557482 838441849 838338315 838169038 837922633
2392.5 837922633 837669790 837464035 837293208 837095439 836792171 836384356 835995734 835715652 835462749 835093617
2412.9 835093617 834619939 834178507 833796382 833390236 832908452 832362771 831801295 831270993 830758750 830217898
2433.3 830217898 829649687 829085529 828544438 828021705 827477872 826864839 826198876 825570524 825036407 824536026
$$ packed form
2286.4H41967702K3186k026J02222J66535P9632k3425o616Q2314J20938M0233r2089
2308.9H42458606j18017J728R9421N7816n2988j33396j41441p6294j8299o1214j70588
2331.3H41845334k15233j46568r0003j99079k99394o2287J19686j03831k77341k77996
2351.7H40293288k68101j91451r5844j80483k42352j37627l4452j6630p2896j35899
2372.1H38917553q8453J5497M2141l1352j36316j61588j15633j03534j69277k46405
2392.5H37922633k52843k05755j70827j97769l03268m07815l88622k80082k52903l69132
2412.9H35093617m73678m41432l82125m06146m81784n45681n61476n30302n12243n40852
2433.3H30217898n68211n64158n41091n22733n43833o13033o65963o28352n34117n00381
$$ plain form
2453.7 824536026 824009776 823454857 822877705 822323143 821812272 821284354 820719898 820191801 819723427 819276333
2474.1 819276333 818818629 818286061 817690969 817164004 816759706 816396236 815983236 815518320 815089107 814780772
2494.5 814780772 814531922 814218283 813840568 813486099 813220382 812991977 812683940 812284708 811892569 811572254
2514.9 811572254 811285794 810956299 810502470 809964240 809503019 809107780 808622479 808016896 807393074 806837499
2535.3 806837499 806325316 805755138 805091143 804413736 803818285 803306341 802754998 802063406 801336110 800727606
2555.6 800727606 800218284 799681008 799028099 798335373 797740638 797246814 796743393 796140015 795459270 794810057
2576 794810057 794266820 793776572 793232977 792616367 792018056 791510940 791061282 790613472 790174842 789782763
2596.4 789782763 789409101 788996518 788525879 788023293 787527442 787015021 786435664 785773456 785040617 784258425
$$ packed form
2453.7H24536026n26250n54919n77152n54562n10871n27918n64456n28097m68374m47094
2474.1H19276333m57704n32568n95092n26965m04298l63470m13000m64916m29213l08335
2494.5H14780772k48850l13639l77715l54469k65717k28405l08037l99232l92139l20315
2514.9H11572254k86460l29495m53829n38230m61221l95239m85301o05583o23822n55575
2535.3H06837499n12183n70178o63995o77407n95451n11944n51343o91592p27296o08504
2555.6H00727606n09322n37276o52909o92726n94735m93824n03421o03378o80745o49213
2576G94810057n43237m90248n43595o16610n98311n07116m49658m47810m38630l92079
2596.4G89782763l73662m12583m70639n02586m95851n12421n79357o62208p32839p82192
$$ plain form
2616.8 784258425 783452809 782624364 781738937 780781806 779772878 778760552 777743936 776674092 775558472
2635.2 775558472 774443269 773354590 772263467 771140575 770027399 768964410 767934322 766893208
2651.5 766893208 765821159 764720380 763624609 762586892 761590779 760583162 759565175 758582354 757664561
2669.9 757664561 756792068 755907178 754983962 754079282 753238022 752430856 751615167 750758350 749885142 749049842
2690.3 749049842 748219728 747319221 746326089 745297670 744313180 743360162 742366433 741300166 740167797
2708.6 740167797 739041269 738018811 737065077 736070216 735033035 734051764 733165681 732326269 731491923
2727 731491923 730643332 729825675 729113042 728479505 727800727 727025688 726260245 725598395 724989891 724302649
2747.4 724302649 723515928 722769678 722167373 721654296 721113682 720501304 719889641 719368815 718886495 718338788
$$ packed form
2616.8G84258425q05616q28445q85427r57131j008928j012326j016616j069844j115620
2635.2G75558472j115203j088679j091123j122892j113176j062989j030088j041114
2651.5G66893208j072049j100779j095771j037717r96113j007617j017987r82821r17793
2669.9G57664561q72493q84890r23216r04680q41260q07166q15689q56817q73208q35300
2690.3G49049842q30114r00507r93132j028419r84490r53018r93729j066267j132369
2708.6G40167797j126528j022458r53734r94861j037181r81271q86083q39412q34346
2727G31491923q48591q17657p12633o33537o78778p75039p65443o61850o08504o87242
2747.4G24302649p86721p46250o02305n13077n40614o12378o11663n20826m82320n47707
$$ plain form
2767.8 718338788 717693150 716973782 716262639 715562880 714778066 713898122 712969065 712024391 711087823 710089982
2788.2 710089982 708936691 707659483 706364453 705084562 703711092 702139139 700457394 698823571
2804.5 698823571 697247982 695603073 693792045 691856742 689886987 687915206 685910463 683817625
2820.8 683817625 681620419 679362059 677079558 674754202 672312558 669729412 667084157 664421737
2837.1 664421737 661640942 658581316 655208349 651615500 647912145 644225121 640725136 637552559
2853.4 637552559 634746790 632258296 629869401 627246201 624172866 620590270 616544664 612173319
2869.7 612173319 607599437 602826953 597940683 593228877 588937640 585207403 582125127 579683185
2886.1 579683185 577817202 576471925 575591385 575007975 574471295 573859215 573188901 572419703 571433544
$$ packed form
2767.8G18338788o45638p19368p11143o99759p84814q79944r29057r44674r36568r97841
2788.2G10089982j153291j277208j295030j279891j373470j571953j681745j633823
2804.5F98823571j575589j644909j811028j935303j969755j971781k004743k092838
2820.8F83817625k197206k258360k282501k325356k441644k583146k645255k662420
2837.1F64421737k780795l059626l372967l592849l703355l687024l499985l172577
2853.4F37552559k805769k488494k388895k623200l073335l582596m045606m371345
2869.7F12173319m573882m772484m886270m711806m291237l730237l082276k441942
2886.1E79683185j865983j345277q80540n83410n36680o12080o70314p69198r86159
$$ plain form
2904.4 571433544 570129216 568480730 566507638 564128339 561220288 557845712 554255366 550739646
2920.7 550739646 547564507 544941962 543035209 541940689 541721225 542519748 544431508 547359824 551122546
2939.1 551122546 555560768 560478568 565624475 570784032 575924039 581163704 586507261 591837466
2955.4 591837466 597057045 602105260 606932938 611478925 615694344 619534194 623035192 626407564
2971.7 626407564 629797041 633159220 636488020 639739931 642714918 645350516 647767723 649990201
2988 649990201 651983142 653732836 655179322 656327903 657206774 657750428 657960117 657959402 657817006 657489002
3008.4 657489002 656936824 656110525 654967129 653585732 652030408 650291979 648446798 646542251 644524276
3026.8 644524276 642449558 640387595 638266683 635990500 633616745 631333351 629083693 626641512
$$ packed form
2904.4E71433544j304328j648486j973092k379299k908051l374576l590346l515720
2920.7E50739646l175139k622545j906753j094520k19464P98523J911760K928316L762722
2939.1E51122546M438222M917800N145907N159557N140007N239665N343557N330205
2955.4E91837466N219579N048215M827678M545987M215419L839850L500998L372372
2971.7F26407564L389477L362179L328800L251911K974987K635598K417207K222478
2988F49990201J992941J749694J446486J148581Q78871N43654K09689p15j42396l28004
3008.4F57489002n52178q26299j143396j381397j555324j738429j845181j904547k017975
3026.8F44524276k074718k061963k120912k276183k373755k283394k249658k442181
$$ plain form
3043.1 626641512 624027312 621424973 618915200 616388440 613758326 611114323 608506143 605894089
3059.4 605894089 603297651 600768864 598312020 595811605 593146741 590407252 587783575 585375011
3075.7 585375011 583098948 580726504 578168154 575509548 572809994 570166826 567616343 565003455
3092.1 565003455 562305987 559713364 557361305 555108368 552664995 550094903 547675908 545354187
3108.4 545354187 542938471 540576994 538436830 536303222 533942938 531361401 528704405 526177943
3124.7 526177943 523891747 521726727 519489229 517186105 514979362 512946606 510931671 508713067
3141 508713067 506376445 504127681 501970708 499968559 498177737 496299446 494114071 491845250 489715993
3159.4 489715993 487748653 485874146 483981252 482052773 480159283 478343397 476568341 474809915
$$ packed form
3043.1F26641512k614200k602339k509773k526760k630114k644003k608180k612054
3059.4F05894089k596438k528787k456844k500415k664864k739489k623677k408564
3075.7E85375011k276063k372444k558350k658606k699554k643168k550483k612888
3092.1E65003455k697468k592623k352059k252937k443373k570092k418995k321721
3108.4E45354187k415716k361477k140164k133608k360284k581537k656996k526462
3124.7E26177943k286196k165020k237498k303124k206743k032756k014935k218604
3141E08713067k336622k248764k156973k002149j790822j878291k185375k268821k129257
3159.4D89715993j967340j874507j892894j928479j893490j815886j775056j758426
$$ plain form
3175.7 474809915 473079890 471341074 469596297 467924774 466322303 464703113 463051558 461413115
3192 461413115 459783345 458164185 456592917 455045998 453545600 452119410 450681925 449194103 447728485
3210.3 447728485 446387678 445139974 443830222 442448258 441084117 439747304 438423812 437149078
3226.7 437149078 435991228 434971482 433966815 432770878 431412011 430088907 428857237 427814931
3243 427814931 426989079 426083535 424929976 423744023 422776461 421965569 421065301 420058995 419086695
3261.3 419086695 418192476 417406142 416763455 416163623 415431231 414573431 413702667 412827194 411948174 411096752
3281.7 411096752 410283566 409534663 408907920 408415645 407888860 407149196 406267643 405349404 404456347 403754205
3302.1 403754205 403240651 402625144 401701927 400547385 399376482 398310900 397306740 396314621 395332873
$$ packed form
3175.7D74809915j730025j738816j744777j671523j602471j619190j651555j638443
3192D61413115j629770j619160j571268j546919j500398j426190j437485j487822j465618
3210.3D47728485j340807j247704j309752j381964j364141j336813j323492j274734
3226.7D37149078j157850j019746j004667j195937j358867j323104j231670j042306
3243D27814931q25852r05544j153559j185953r67562q10892r00268j006306r72300
3261.3D19086695q94219p86334o42687n99832p32392q57800q70764q75473q79020q51422
3281.7D11096752q13186p48903o26743m92275n26785p39664q81553r18239q93057p02142
3302.1D03754205n13554o15507r23217j154542j170903j065582j004160r92119r81748
$$ plain form
3320.5 395332873 394387335 393488944 392490506 391308337 390113175 389054775 388188034 387431800 386495650
3338.8 386495650 385306448 384079307 382865787 381729573 380786061 379747957 378395975 377021074
3355.2 377021074 375853419 374838591 373821199 372776449 371929437 371207267 370181829 368754953 367312431
3373.5 367312431 366144150 365145147 364173293 363200694 362315238 361594975 361046106 360725105 360377252
3391.9 360377252 359599829 358732730 358339816 358151138 357583463 356667280 355919242 355523735 355225503 354847819
3412.3 354847819 354340553 353759140 353397608 353341401 353267074 353092492 353076011 353276819 353511542 353790611
3432.7 353790611 354158551 354310989 354101151 353954375 354115129 354584515 355342716 355902880 356199980 356646657
3453.1 356646657 357251972 357966125 358814061 359628588 360405654 361464649 362715244 363544732 363835603
$$ packed form
3320.5C95332873r45538q98391r98438j182169j195162j058400q66741p56234r36150
3338.8C86495650j189202j227141j213520j136214r43512j038104j351982j374901
3355.2C77021074j167655j014828j017392j044750q47012p22170j025438j426876j442522
3373.5C67312431j168281r99003r71854r72599q85456p20263n48869l21001l47853
3391.9C60377252p77423q67099l92914j88678n67675r16183p48038l95507k98232l77684
3412.3C54847819n07266n81413l61532n6207p4327j74582j6481K00808K34723K79069
3432.7C53790611L67940J52438k09838j46776J60754M69386P58201N60164K97100M46677
3453.1C56646657O05315P14153Q47936Q14527P77066J058995J250595Q29488K90871
$$ plain form
3471.4 363835603 364225239 365025163 366025329 367120713 368119687 368870229 369704664 370758176 371738732
3489.8 371738732 372617781 373637408 374823689 375809669 376730770 378175318 379554421 380189180 380958319
3508.1 380958319 382328600 383686095 384727895 385597199 386497438 387637734 389195502 390739113 391968727
3526.5 391968727 393247247 394476801 395580143 397019953 398658484 399861872 400912613 402528286
3542.8 402528286 404790819 406751543 407837391 409152091 411088407 412786961 414305240 416148096
3559.1 416148096 417886645 419218659 421721369 426108092 429382384 430827111 432498753 434998930
3575.4 434998930 437894344 440908879 443597823 445920080 449315727 454165488 457751006 459939152
3591.7 459939152 462950200 466772407 470526338 474363655 477878153 480569303 483596414 487892896
$$ packed form
3471.4C63835603L89636P99924J000166J095384R98974P50542Q34435J053512R80556
3489.8C71738732Q79049J019627J186281R85980R21101J444548J379103O34759P69139
3508.1C80958319J370281J357495J041800Q69304R00239J140296J557768J543611J229614
3526.5C91968727J278520J229554J103342J439810J638531J203388J050741J615673
3542.8D02528286K262533J960724J085848J314700J936316J698554J518279J842856
3559.1D16148096J738549J332014K502710M386723L274292J444727J671642K500177
3575.4D34998930K895414L014535K688944K322257L395647M849761L585518K188146
3591.7D59939152L011048L822207L753931L837317L514498K691150L027111M296482
$$ plain form
3608.1 487892896 492245942 496143997 499713004 503000736 507673740 513004363 516105354 517526329
3624.4 517526329 520166755 526435792 532483637 535573363 538605750 542033911 545415759 548758209
3640.7 548758209 551499367 553849220 557767630 564529061 570020974 572082639 574589610 578757763
3657 578757763 582304478 585005224 587475002 589572072 592061996 595983148 599406064 601984680 606261253
3675.4 606261253 610014260 611901224 613564491 615102708 616939187 620374382 624597967 627050519
3691.7 627050519 628365040 629812121 631433904 633446455 635882139 637591898 638520181 639873922
3708 639873922 642456532 645378828 646944463 647744715 648744285 650048137 651489317 653033257 654378057
3726.4 654378057 655117393 655865967 657532930 660146058 662462890 663106501 662871063 663809538 665905893
$$ packed form
3608.1D87892896M353046L898055L569007L287732M673004N330623L100991J420975
3624.4E17526329K640426O269037O047845L089726L032387L428161L381848L342450
3640.7E48758209K741158K349853L918410O761431N491913K061665K506971M168153
3657E78757763L546715K700746K469778K097070K489924L921152L422916K578616M276573
3675.4F06261253L753007J886964J663267J538217J836479L435195M223585K452552
3691.7F27050519J314521J447081J621783K012551K435684J709759R28283J353741
3708F39873922K582610K922296J565635Q00252R99570J303852J441180J543940J344800
3726.4F54378057P39336P48574J666963K613128K316832O43611k35438R38475K096355
$$ plain form
3744.7 665905893 666869938 667935729 670314729 671761930 672006726 672708154 674112737 675147474 675822556
3763.1 675822556 676794946 678012908 679471016 680604219 681029856 681439877 682486892 683892190 684780478
3781.4 684780478 685415447 686258495 687089026 687822163 688378334 688940704 689696610 690309107 691367149
3799.8 691367149 692821801 693473756 694235027 695198596 695388317 695393622 696110725 697220445 697963536 699136615
3820.2 699136615 700278640 700527132 700703323 700990081 701447725 702095747 702815950 703852296 704836547
3838.5 704836547 705375612 705975294 706497252 706396520 705877721 706076801 708130062 709914505 709768414
3856.9 709768414 709414303 709657550 710409701 710917771 711124122 711834013 712722063 713312507 713541031 713563979
3877.3 713563979 714032292 714597702 715172529 715972543 716192186 716348290 717000723 717266142 717127621 717310190
$$ packed form
3744.7F65905893R64045J065791K379000J447201K44796P01428J404583J034737O75082
3763.1F75822556R72390J217962J458108J133203M25637M10021J047015J405298Q88288
3781.4F84780478O34969Q43048Q30531P33137N56171N62370P55906O12497J058042
3799.8F91367149J454652O51955P61271R63569J89721N305P17103J109720P43091J173079
3820.2F99136615J142025K48492J76191K86758M57644O48022P20203J036346R84251
3838.5G04836547N39065N99682N21958j00732n18799J99080K053261J784443j46091
3856.9G09768414l54111K43247P52151N08070K06351P09891Q88050N90444K28524K2948
3877.3G13563979M68313N65410N74827Q00014K19643J56104O52433K65419j38521J82569
$$ plain form
3897.7 717310190 717880785 718653679 719463527 719862938 719865859 719878912 719978452 720220506 720740616 721240222
3918.1 721240222 721384704 721488357 721814811 722025573 722083986 722391725 722923696 723279834 723345220 723350465
3938.5 723350465 723575175 723947346 724177837 724420726 724800646 725069821 725204885 725383222 725625038 725885212
3958.9 725885212 726164043 726387084 726501882 726630211 726840913 727086782 727346301 727589607 727793872 727969408
3979.3 727969408 728168905 728388309 728570938 728749871 728954792 729131043 729257166 729401171 729597390
3997.6 729597390
$$ packed form
3897.7G17310190N70595P72894Q09848L99411K921J3053R9540K42054N20110M99606
3918.1G21240222J44482J03653L26454K10762N8413L07739N31971L56138O5386N245
3938.5G23350465K24710L72171K30491K42889L79920K69175J35064J78337K41816K60174
3958.9G25885212K78831K23041J14798J28329K10702K45869K59519K43306K04265J75536
3979.3G27969408J99497K19404J82629J78933K04921J76251J26123J44005J96219
3997.6G29597390
##END=$$ End of the data block
