##TITLE=$$ Begin of the data block
##JCAMP-DX=5.00 $$ ACD/SpecManager v 10.08
##SPECTROMETER/DATA SYSTEM=Alpha
##DATE=29 Dec 2014 15:06:02
##DATA TYPE=INFRARED SPECTRUM
##DATA CLASS=XYDATA
##ORIGIN=
##OWNER=
##NPOINTS=1765
##FIRSTX=399.76428223
##LASTX=3997.64306641
##MAXX=3997.64306641
##MINX=399.76428223
##MAXY=0.84308571
##MINY=0.30809706
##XFACTOR=1.0000000000
##YFACTOR=1.000000000000000e-9
##FIRSTY=0.57642514
##DELTAX=2.03961372
##XUNITS=1/CM
##YUNITS=ARBITRARY UNITS
##XYDATA=(X++(Y..Y))
399.8 576425135 571542084 567979991 565547585 564752400 565636218 567504704 569507658 570804775 571612895
418.1 571612895 571694016 570338488 568221509 565864205 563544035 561202049 558784604 556522787 554695249
436.5 554695249 554310143 556204021 560056150 564649701 568353534 570611060 572251499 573580444 573900938
454.8 573900938 572962046 571124792 569219589 567380667 564987600 561825395 558323860 555129409 552431405
473.2 552431405 550029218 547964334 546378136 545333624 545003593 545266747 545516193 545304775 544634819
491.5 544634819 543742180 542537570 540648520 538241923 535955906 533911347 531497836 528353512 524812520
509.9 524812520 521309495 517908454 514364302 510435939 506537437 503608584 502144456 501797438 501772404
528.3 501772404 501964211 503033698 505527616 509559274 514612079 519795895 524480402 528287053 530712962
546.6 530712962 531289816 530270696 528564513 526759088 524560452 521360636 517222047 512628734 507643938
565 507643938 502064586 496172458 491003126 487848490 487404346 489371687 493100941 498242915 504465222
583.3 504465222 511195242 517540157 522422254 525322735 526669800 527359784 527729928 527518749 526771605
601.7 526771605 526076674 525964499 526506543 527380764 528315067 529520869 531439722 534282863 537679911
620 537679911 541091919 544478893 547989428 551415145 554314077 556508183 558209121 559844851 561591744
638.4 561591744 563112915 564136088 564953804 565949559 567298591 568780005 569856465 570537150 571401060
656.8 571401060 572617590 573784053 574435532 574448705 575280011 577995718 579625785 580354571 581446230
675.1 581446230 582893431 584614575 586372137 587773800 588726640 589445829 589990437 590210855 589812994
693.5 589812994 588494539 586325467 583694637 580966771 578444719 576384962 575094163 574984133 576336384
711.8 576336384 579032779 582598567 586793840 591687024 597061276 602652133 608232498 613346934
728.1 613346934 617845774 621901929 625555277 628620982 630783677 632021129 632510960 632192433 630782783
746.5 630782783 628117383 624363840 619998693 615476787 610984981 606655121 602864981 600189149
762.8 600189149 599092126 599798083 602324128 606589556 612476170 619765460 627943575 636154592 643667996
781.2 643667996 650289476 656203568 661458611 665860116 669423759 672711015 676317096 680295885
797.5 680295885 684337437 688103676 691361725 694038033 696100235 697369576 697879195 698083639 698324323
815.8 698324323 698505044 698427916 697861075 696610868 694709420 692026675 688330472 683729947 678592622
834.2 678592622 673361659 668361306 663552105 658815563 654344022 650358438 646629691 642664611
850.5 642664611 638216972 633348703 628285229 623771906 621474266 623150945 629164279 638361156
866.8 638361156 649257720 660575747 670997977 679316580 684831917 687367797 687019169 684129775
883.2 684129775 679400265 673688471 667616665 661520243 655628383 650108576 644988537 640018940
899.5 640018940 634773433 628933370 622366607 614996135 606700659 597401977 587340891 577193856
915.8 577193856 567806959 559959054 554186285 550571322 548742414 548172772 548569560 549836338 551870763
934.1 551870763 554654360 558214962 562401712 566554070 569218636 568696260 564131737 555768430 544379175
952.5 544379175 530854881 516072154 500692904 484954864 468801171 452247441 435430020
966.8 435430020 418496460 401637703 385073900 369105667 354261398 341150582 330182135
981.1 330182135 321537435 315256417 311173469 308906734 308097064 308392674 309329093 310590297 312074959
999.4 312074959 313598454 314910322 315788209 316103995 315986454 315740824 315665245 315968007 316792667 318209022
1019.8 318209022 320233762 322794706 325731695 328881621 332080871 335186541 337930381 339944422
1036.1 339944422 341133177 341726273 342030346 342360795 342941344 343953341 345768809 348832875 353321701
1054.5 353321701 358998567 365519524 372878164 381231159 390026122 397283345 400002629 396451682
1070.8 396451682 388255328 379345119 372875065 369649649 369101733 370517612 373341113 377096504
1087.1 377096504 381457210 386353523 391657948 396874547 401284456 404355049 406047225 406849116
1103.4 406849116 407571286 409003913 411502123 414908171 418805242 422701240 426120877 428767711
1119.8 428767711 430729687 432429969 434442580 437291354 441140503 445489675 449284405 451319337
1136.1 451319337 450671107 447191477 441545069 434741825 427708507 421106994 415354460 410763860
1152.4 410763860 407553196 405741483 405144155 405607551 407353163 410781652 416046172 423054665 431609422
1170.7 431609422 441486269 452479213 464238822 476282001 488268465 500034750 511379242
1185 511379242 521886289 531014442 538391113 544021785 548197329 551253319 553477645 555211008
1201.3 555211008 556870878 558832109 561356962 564549446 568384409 572782457 577548206 582232475
1217.7 582232475 586192131 588950276 590446770 590889513 590509772 589477241 587960124 586223185 584547818
1236 584547818 583083570 581877649 581022620 580743194 581277788 582624853 584475875 586427927 588228703
1254.4 588228703 589814365 591197908 592340708 593242526 594204783 595660329 597742915 600115120 602166414
1272.7 602166414 603513896 604209006 604449034 604332805 603894889 603272498 602664292 602072656 601309419
1291.1 601309419 600161552 598550498 596641123 594659150 592671752 590628088 588502347 586383760
1307.4 586383760 584523141 583093643 581919372 580755770 579636693 578539670 577059507 574685991
1323.7 574685991 571095586 566440344 561347246 556409776 551953614 548298180 545848727 544652164
1340 544652164 544222057 544218838 544502318 544796407 544933617 544891715 544611335 543931127 542830467 541787088
1360.4 541787088 541196048 540565073 539658189 538973331 538706660 539163947 540333271 541243851 541759074
1378.8 541759074 542377591 543398380 545513213 549387217 553530395 556183457 558089137 559605241
1395.1 559605241 559933424 559202075 557815135 556259871 554828346 553051710 550944328 548873186 546874642
1413.5 546874642 545057714 544078052 543952763 543498099 543206334 543514252 544162333 545389712 546628594
1431.8 546628594 547664344 549967527 552853465 554228544 555191159 556282759 557233751 557819366 557340324
1450.2 557340324 555710018 553800404 552982450 552771032 551455736 550751746 552502632 555774808 558957696
1468.5 558957696 563906074 572982967 583001316 590941310 597813189 604506373 611073434 617012858
1484.9 617012858 623012483 629828632 636005998 639933884 643585801 648601413 653161764 655990720
1501.2 655990720 657925367 661186397 666902423 670275092 671623051 673161507 675339043 677957654
1517.5 677957654 680528998 683475375 685780644 687330604 688979387 690208077 691542566 693207502
1533.8 693207502 693948865 694605649 696911335 698730648 698812842 698488951 698268473 698267400 698094845 697597861
1554.2 697597861 697099388 697453022 696955740 694806516 692673981 690803707 689165473 687278152 684905887
1572.6 684905887 682763100 680733860 678204298 675614595 673139811 670665145 668167233 665717781
1588.9 665717781 663315296 660950661 658560991 656104207 653645039 651249409 648891151 646446705
1605.2 646446705 643903255 641203761 638261020 635271966 632721186 630276859 627423763 624862075
1621.5 624862075 622694373 620331705 617844641 615356088 613028288 611894786 612535655 612755120 612068653
1639.9 612068653 611703634 612141967 614406705 617095113 617930710 620672941 626771271 629557431 631092966
1658.2 631092966 633936346 638284683 642627835 645984173 650386751 655922830 660196006 664744318
1674.5 664744318 669951379 673966408 677426159 682200730 689072788 693908930 697043359 700270116
1690.9 700270116 703100860 706571639 710485160 713963568 717384458 719262242 720665455 722395062
1707.2 722395062 723702431 724747241 725880206 727555573 729949474 731495857 732060969 732873499 734136879
1725.5 734136879 735627532 737289846 739065766 741505444 743580580 744873524 746747971 748894930
1741.9 748894930 750819206 752945244 755573511 758767247 761761248 764034092 766442716 769172609
1758.2 769172609 771816909 774430573 776454866 778140843 780043006 782093346 784125268 785495222
1774.5 785495222 786363721 787476540 788834214 789997578 790948331 791794002 792682290 793933570 795289159
1792.8 795289159 796081424 796664834 797554910 798668027 799584210 800197601 800789773 801610351 802581251
1811.2 802581251 803349972 803906500 804454863 805082500 805810571 806637883 807354689 807852447 808400273 808948755
1831.6 808948755 809406638 809830189 810134828 810354292 810792446 811521411 811967492 811982810 812003553 812232435
1852 812232435 812576771 812843204 812984526 813131988 813383579 813748181 814164937 814457715 814504743 814588130
1872.4 814588130 814926445 815298438 815510511 815672755 815982640 816473305 816984773 817345142 817498326 817664742
1892.8 817664742 818045199 818457127 818641126 818667948 818770528 819042623 819341958 819458425 819368005 819311202
1913.2 819311202 819550753 819981158 820200026 820172250 820193172 820378006 820635498 820778191 820758402 820749700
1933.6 820749700 820900381 821149826 821348846 821452975 821488202 821613133 821865916 822058678 822126031 822200179
1954 822200179 822416484 822745204 823025525 823141694 823214471 823425174 823724091 823930085 823980451 823966563
1974.4 823966563 824039161 824245870 824458122 824544489 824535847 824559271 824680328 824861348 824941456 824884117 824864030
1996.8 824864030 824955642 825072527 825073302 824915051 824697077 824541271 824452996 824314535 824046969 823693216
2017.2 823693216 823309064 822903454 822398007 821828127 821492732 821404994 821300507 821101964 820813537 820459783
2037.6 820459783 820133865 819884181 819667161 819436789 819189012 818984270 818889797 818890393 818907142 818887055 818859696
2060 818859696 818914294 819082260 819246411 819315612 819331527 819387257 819531739 819703102 819794297 819800735 819826007
2082.5 819826007 819944799 820132554 820286095 820358813 820428014 820584178 820810974 821015120 821142018 821246624
2102.9 821246624 821435750 821710825 821956754 822077870 822124958 822217822 822375596 822513461 822566330 822583616
2123.3 822583616 822651327 822779536 822884977 822889209 822863162 822946489 823118508 823241174 823240936 823183179 823198795
2145.7 823198795 823318481 823467076 823576987 823654711 823772788 824008822 824317157 824558914 824728429 824970961
2166.1 824970961 825359762 825839937 826311946 826721668 827159762 827695668 828222871 828644812 828993857 829389274
2186.5 829389274 829900920 830420256 830811918 831099987 831398368 831772327 832197964 832607150 832936645 833234131
2206.9 833234131 833621740 834093273 834512174 834803522 835081041 835470736 835898638 836236477 836466908 836659253
2227.3 836659253 836922050 837254643 837539792 837728083 837882340 838104188 838396370 838646710 838796377 838912368
2247.7 838912368 839068472 839282513 839517951 839677334 839775860 839955449 840233564 840470076 840579212 840650976
2268.1 840650976 840824723 841103613 841370165 841532350 841619968 841755450 842001379 842265904 842426300 842486978
2288.5 842486978 842546523 842683733 842853725 842929423 842903435 842886686 842947245 843045354 843080640 843005717 842921674
2310.9 842921674 842952251 843054533 843085706 842959642 842733681 842599511 842642784 842665613 842489600 842202902
2331.3 842202902 841991603 841919720 841844738 841606259 841344655 841329396 841426432 841307998 841016471 840722084
2351.7 840722084 840474665 840307236 840219736 840021849 839686632 839486420 839491904 839499056 839416385 839311421 839288950
2374.1 839288950 839353442 839400947 839356244 839221835 839068115 838952541 838851571 838674724 838407278 838162720
2394.5 838162720 837994993 837839127 837618828 837296128 836909354 836558044 836278319 835996568 835622132 835162759
2414.9 835162759 834721386 834340334 833927333 833416402 832852781 832286477 831755280 831266522 830753326 830176353
2435.3 830176353 829599023 829077959 828571498 828018486 827411175 826782644 826178133 825616598 825073719 824525952
2455.7 824525952 823950291 823361635 822833419 822363317 821855903 821278691 820707142 820209920 819791555 819375336
2476.1 819375336 818858206 818282723 817779183 817361534 816956103 816511631 816041052 815626204 815312386 815041244
2496.5 815041244 814736962 814367473 813981235 813686907 813451588 813133657 812739789 812369645 812045336 811734855
2516.9 811734855 811383188 810935378 810455084 810045719 809663713 809173942 808547556 807926118 807410359 806926310
2537.3 806926310 806345880 805651426 804947555 804327190 803808153 803283334 802614272 801870406 801229656 800719976
2557.7 800719976 800205469 799572647 798891902 798295856 797792017 797274172 796654940 795978129 795347273 794792891
2578.1 794792891 794286549 793787599 793254673 792693198 792142332 791624486 791144609 790700316 790311933 789975345
2598.5 789975345 789597392 789115608 788593173 788100421 787605882 787026703 786345482 785607398 784833074 784031749
2618.9 784031749 783194780 782290459 781324208 780320823 779314876 778314114 777269125 776168704 775050282
2637.2 775050282 773941636 772852302 771763504 770671189 769588649 768506646 767448664 766415775
2653.5 766415775 765339315 764241993 763186157 762147427 761127889 760156572 759212613 758272529 757348061
2671.9 757348061 756441116 755537391 754655600 753807425 752984822 752161503 751280963 750370860 749528468 748728096
2692.3 748728096 747866452 746912837 745906353 744906962 743929327 742932856 741887033 740792334 739696026
2710.7 739696026 738658547 737661600 736644447 735625446 734664738 733777046 732931018 732083082 731233239
2729 731233239 730431437 729704320 729027927 728332758 727566242 726806581 726140678 725513518 724828720 724086165
2749.4 724086165 723386645 722794175 722253501 721681595 721073210 720521688 720051348 719530404 718909800 718235075
2769.8 718235075 717534542 716861784 716197908 715431273 714525521 713553548 712586045 711628020 710613072
2788.2 710613072 709471703 708234608 706969917 705665708 704258204 702717185 701087296 699452639
2804.5 699452639 697837770 696156561 694338143 692421377 690472543 688529372 686555743 684467435
2820.8 684467435 682255387 679988086 677697122 675336897 672856033 670269847 667641103 664970160
2837.1 664970160 662137091 659025490 655637026 652058542 648406684 644780993 641282558 638053119
2853.4 638053119 635195494 632690907 630321443 627717733 624610245 620978236 616948724 612628698
2869.7 612628698 608058155 603245258 598301947 593525708 589213431 585499048 582411945 579967082
2886.1 579967082 578133643 576826930 575969696 575393796 574841619 574197948 573513448 572760761 571775794
2904.4 571775794 570452094 568791628 566806376 564423919 561523974 558140397 554536402 551039994
2920.7 551039994 547885239 545261085 543360054 542265892 542024493 542796075 544686377 547594607 551347136
2939.1 551347136 555793881 560718238 565851212 571009040 576177537 581437051 586773992 592083514
2955.4 592083514 597293615 602379620 607292950 611901641 616112411 619954228 623484671 626868427
2971.7 626868427 630284369 633676589 636972487 640165567 643144906 645849049 648347914 650640845
2988 650640845 652677894 654448152 655909896 657089114 657977879 658485830 658677340 658685505 658549011 658243775
3008.4 658243775 657729566 656920671 655787945 654418766 652848601 651095748 649248362 647329271 645311415
3026.8 645311415 643262446 641222894 639130890 636883020 634490788 632171035 629929721 627513945
3043.1 627513945 624893546 622268379 619746566 617200494 614562094 611962616 609383643 606749654
3059.4 606749654 604142070 601618469 599150419 596619427 593934655 591189563 588553607 586143136
3075.7 586143136 583871722 581485808 578913569 576250017 573543906 570892632 568344712 565745056
3092.1 565745056 563071609 560500801 558106184 555772126 553274632 550660670 548219740 545925975
3108.4 545925975 543543100 541174829 539020121 536897123 534578085 532050312 529415727 526867926
3124.7 526867926 524510741 522240400 519955814 517676175 515449166 513335288 511254847 509015918
3141 509015918 506677806 504428983 502311230 500371635 498587519 496677101 494482756 492204249 490047425
3159.4 490047425 488066673 486202925 484320313 482378662 480457783 478612751 476826906 475070953
3175.7 475070953 473295212 471479982 469710320 468048632 466434717 464789212 463102371 461400837
3192 461400837 459738523 458155364 456594348 455023557 453526527 452114940 450690120 449200660 447705090
3210.3 447705090 446308821 444990635 443657488 442332268 441028446 439689279 438338280 437058330
3226.7 437058330 435875237 434801042 433770031 432578266 431228876 429930836 428742200 427680522
3243 427680522 426765382 425785303 424594551 423420519 422484487 421684772 420811981 419859469 418927193 418041348
3263.4 418041348 417200834 416470408 415871948 415190399 414312005 413376749 412448972 411570489 410775572 409988672
3283.8 409988672 409207195 408523738 407970399 407435447 406752050 405894458 404945880 404043794 403331846 402766049
3304.2 402766049 402133733 401255757 400118709 398906171 397794545 396791995 395825088 394826472 393849045
3322.5 393849045 392941386 391938984 390758365 389579028 388521552 387586653 386747211 385796398 384638786
3340.9 384638786 383431882 382193655 381021500 380071998 379027843 377651513 376271904 375104874
3357.2 375104874 374059081 373017997 371966213 371087700 370308638 369237423 367818236 366400510 365215898
3375.5 365215898 364193380 363216639 362238497 361312032 360523403 359925032 359564424 359215677 358516574
3393.9 358516574 357748926 357418954 357265472 356663138 355625212 354803145 354418933 354157835 353850693
3412.3 353850693 353407621 352838963 352478892 352429211 352331400 352138072 352152377 352385998 352608711 352853894
3432.7 352853894 353209078 353376389 353172094 352988124 353124976 353644192 354462653 355025589 355278730 355673611
3453.1 355673611 356253445 356958538 357797951 358637154 359449297 360484242 361703128 362553686 362875432
3471.4 362875432 363244385 363978863 364942610 366048187 367093295 367929816 368845195 369913250 370830625
3489.8 370830625 371675253 372758687 374021024 375029117 375917494 377300471 378617764 379213035 380004108
3508.1 380004108 381437361 382838160 383910000 384832531 385753870 386852890 388414621 390013486 391247898
3526.5 391247898 392510831 393772811 394920141 396360129 397985190 399217695 400297046 401931763
3542.8 401931763 404250234 406239390 407293379 408608168 410604030 412341028 413875163 415745944
3559.1 415745944 417463034 418733239 421267360 425820291 429233491 430692106 432327360 434812337
3575.4 434812337 437692881 440663815 443330318 445702851 449197203 454117358 457728505 459971070
3591.7 459971070 463070542 466926634 470650554 474482685 478037685 480756819 483811557 488201380
3608.1 488201380 492662311 496614873 500226557 503547549 508181453 513431013 516553104 518130839
3624.4 518130839 520930052 527224720 533243895 536325693 539333463 542762816 546157777 549498379
3640.7 549498379 552273333 554655313 558554292 565284073 570762217 572847784 575401843 579589069
3657 579589069 583133876 585862815 588366449 590453923 592910171 596816301 600251615 602841914 607101142
3675.4 607101142 610813797 612680495 614380658 615995824 617876053 621296406 625448227 627802193
3691.7 627802193 629087329 630564749 632195234 634194791 636627614 638372958 639397323 640839458
3708 640839458 643430829 646269619 647685111 648393333 649424911 650821745 652343154 653906345 655233383
3726.4 655233383 655984521 656734467 658412158 661088526 663374245 663927257 663695097 664700210 666870296
3744.7 666870296 667876780 668887675 671175838 672586620 672827721 673584282 675065756 676088095 676662922
3763.1 676662922 677523553 678684831 680159509 681332648 681805909 682316542 683455110 684835851 685653925
3781.4 685653925 686246276 687032402 687799096 688501656 689087987 689731598 690544069 691170037 692252874
3799.8 692252874 693667650 694198549 694932938 695939779 696126401 696129739 696891129 698039770 698805392
3818.1 698805392 700010300 701116860 701303244 701480806 701816738 702316403 702956676 703665912 704742312
3836.5 704742312 705747068 706230044 706775546 707252026 707115650 706642449 706954241 709071517 710821569
3854.8 710821569 710646689 710286140 710533977 711276412 711762905 712014914 712803960 713694632 714223146 714403570
3875.2 714403570 714395463 714858532 715500891 716166377 716958940 717096388 717191219 717834055 718079567 717890620
3895.6 717890620 718048275 718659520 719553888 720479548 720841527 720711231 720662236 720776021 720985711 721439898
3916 721439898 721973598 722212136 722363532 722698212 722906709 722972155 723291278 723797262 724115133 724217534
3936.4 724217534 724275410 724472046 724779844 724983871 725258768 725683570 725965381 726078749 726255417 726524532
3956.8 726524532 726774752 727029085 727234542 727311611 727414846 727654696 727925837 728151321 728347182 728571892
3977.2 728571892 728846729 729111850 729310334 729419291 729518175 729739726 730004907 730143070 730237901 730447412
3997.6 730447412
##END=$$ End of the data block
