##TITLE=$$ Begin of the data block
##JCAMP-DX=5.00 $$ ACD/SpecManager v 10.08
##SPECTROMETER/DATA SYSTEM=Alpha
##DATE=29 Dec 2014 15:06:02
##DATA TYPE=INFRARED SPECTRUM
##DATA CLASS=XYDATA
##ORIGIN=
##OWNER=
##NPOINTS=1765
##FIRSTX=399.76428223
##LASTX=3997.64306641
##MAXX=3997.64306641
##MINX=399.76428223
##MAXY=0.80556208
##MINY=0.13294283
##XFACTOR=1.0000000000
##YFACTOR=1.000000000000000e-9
##FIRSTY=0.42709988
##DELTAX=2.03961372
##XUNITS=1/CM
##YUNITS=ARBITRARY UNITS
##XYDATA=(X++(Y..Y))
399.8D27099884m622162l796488l322333j913756K98083K291590L086835K362370L03567
$$ 427099884 422477722 418681234 415358901 413445145 413743228 416034818 419121653 421484023 421787590
418.1D21787590j906932k142340k247035l015667l509790l733188l502458k718687
$$ 421787590 419880658 417738318 415491283 412475616 408965826 405232638 401730180 399011493
434.4C99011493j632661J80364K258420L862798N014181N473435M738897K988815J221061
$$ 399011493 397378832 397559196 399817616 403680414 408694595 414168030 418906927 421895742 423116803
452.8D23116803M9681o86527j194745j560241k323419l273755l787458l608882l247232
$$ 423116803 423166484 422479957 421285212 419724971 417401552 414127797 410340339 406731457 403484225
471.2D03484225l297925l384739l113121k245038r91673J8567K78533k07246p43448
$$ 403484225 400186300 396801561 393688440 391443402 390451729 390470296 390748829 390541583 389798135
489.5C89798135r15021q90911j068413j629829k398074l050089l108770k761691k873093
$$ 389798135 388883114 387992203 386923790 385293961 382895887 379845798 376737028 373975337 371102244
507.9C71102244l571838m395426m774689m715592m638255m390329l811091k849430
$$ 371102244 367530406 363134980 358360291 353644699 349006444 344616115 340805024 337955594
524.2C37955594j513421k95014M94540J200676K175540L645658N423457O566822O144464
$$ 337955594 336442173 336147159 336641699 337842375 340017915 343663573 349087030 355653852 361798316
542.5C61798316M251838J837164l3438j005828j594425k209037l101051m390091n471080
$$ 361798316 366050154 367887318 367853880 366848052 365253627 363044590 359943539 355553448 350082368
560.9C50082368n934418o334483p021100p246524o270885m120916j257897J856625
$$ 350082368 344147950 337813467 330792367 323545843 317274958 313154042 311896145 313752770
577.2C13752770M707993O654858P534295P624925P144898O027877M321188K314329
$$ 313752770 318460763 325115621 332649916 340274841 347419739 353447616 357768804 360083133
593.5C60083133O20246k13087k43574o2257j29700k40117m0591N97030J448840K205074
$$ 360083133 360703379 360490292 360246718 360184461 360054761 359814644 359774053 360371083 361819923 364024997
613.9C64024997K788216L168255L434807L847569M376292M585624M212409L361136
$$ 364024997 366813213 369981468 373416275 377263844 381640136 386225760 390438169 393799305
630.2C93799305K446890K054632K242744K289682J788139J121313Q66771J134961J590610
$$ 393799305 396246195 398300827 400543571 402833253 404621392 405742705 406609476 407744437 409335047
648.6D09335047J837432J593650J078993P84278R62436J417249J616598J437127J335144
$$ 409335047 411172479 412766129 413845122 414629400 415591836 417009085 418625683 420062810 421397954
667D21397954J157105J138002J813382K313524K033443J479297J294464J558811J801878
$$ 421397954 422555059 423693061 425506443 427819967 429853410 431332707 432627171 434185982 435987860
685.3D35987860J469135M92692n04225j091302j489788k082318k947718l727704l854960
$$ 435987860 437456995 437949687 437445462 436354160 434864372 432782054 429834336 426106632 422251672
703.7D22251672l026635j435816L53366J840830K950787L991127N182773O488770P438928
$$ 422251672 419225037 417789221 418142587 419983417 422934204 426925331 432108104 438596874 446035802
722D46035802P557810P029563O259680N701452N487472N122334M133582K692521J399546
$$ 446035802 453593612 460623175 466882855 472584307 478071779 483194113 487327695 490020216 491419762
740.4D91419762M70370m24593j684279l293633m927993o000072o178408n765707n137860
$$ 491419762 491890132 491465539 489781260 486487627 481559634 475559562 469381154 463615447 458477587
758.7D58477587m471362l625691k019703O54429L886610O840557Q813292R844213J0525972
$$ 458477587 454006225 450380534 448360831 449015260 452901870 459742427 468555719 478399932 488925904
777.1D88925904J0903686J0558307R331108P507920N711436M698575M712164N224288
$$ 488925904 499829590 510387897 519719005 527226925 532938361 537636936 542349100 547573388
793.4E47573388N451321N199254M894018M869103M989744M796624L913700K499760
$$ 547573388 553024709 558223963 563117981 567987084 572976828 577773452 581687152 584186912
809.7E84186912J399397J139164J360476J320422N23865r88543k524078l416299l906072
$$ 584186912 585586309 586725473 588085949 589406371 589930236 588941693 586417615 583001316 579095244
828.1E79095244m671871n960644p235050p718324p218302o238281n445660n187213
$$ 579095244 574423373 568462729 561227679 553509355 546291053 540052772 534607112 529419899
844.4E29419899n193174n076826m859745m829764n314231o082893n964815l297568
$$ 529419899 524226725 519149899 514290154 509460390 504146159 498063266 492098451 488800883
860.7D88800883K285183Q542001J2882054J4912665J5262186J4099717J1645437Q284449
$$ 488800883 491086066 499628067 512510121 527422786 542684972 556784689 568430126 576714575
877E76714575M180432l20256m303932o939590q051276q149624q077503q103549p880688
$$ 576714575 580895007 580574751 576270819 569331229 561279953 553130329 545052826 536949277 529068589
895.4E29068589p268667o513357o168664o811022q276016r796649j0841280j1461348
$$ 529068589 521799922 515286565 509117901 502306879 494030863 484234214 473392934 461931586
911.7D61931586j1989206j2364149j2018323j0448932p697136m485309j921624n35935
$$ 461931586 449942380 437578231 425559908 415110976 407413840 402928531 401006907 400470972
928D00470972K61873J283646K683967M129916N270839N902231N634129L785491J88321
$$ 400470972 400732845 402016491 404700458 408830374 414101213 420003444 425637573 429423064 429611385
946.4D29611385m420310r042234j2934982j5719891j7307311j7975241j8314362j8724143
$$ 429611385 425191075 416148841 403213859 387493968 370186657 352211416 333897054 315172911
962.7C15172911j9206554j9526869j9468129j9062683j8419131j7507658j6198039
$$ 315172911 295966357 276439488 256971359 237908676 219489545 201981887 185783848
977A85783848j4388084j2116000r576440p056564m807517k950698j503274m42445L21507
$$ 185783848 171395764 159279764 149703324 142646760 137839243 134888545 133385271 132942826 133264333
995.3A33264333Q74788J229658J291901J043558O32301K36020k9519j66104j26689
$$ 133264333 134139121 135368779 136660680 137704238 138336539 138572559 138543040 138376936 138250247
1013.7A38250247J52275O43521J253769J871660K395481K757907K934784K991676K965689
$$ 138250247 138402522 139046043 140299812 142171472 144566953 147324860 150259644 153251320 156217009
1032A56217009K698898K126530J400188P74428M46588M88877Q14155J314133K060458
$$ 156217009 158915907 161042437 162442625 163217053 163663641 164152518 164966673 166280806 168341264
1050.4A68341264L092036M293322N500123O656856P831469Q941591R306907P586673
$$ 168341264 171433300 175726622 181226745 187883601 195715070 204656661 213963568 221550241
1066.7B21550241K786324l838808q818537r676501p174224l692463p30678J436755
$$ 221550241 224336565 220497757 211679220 202002719 194828495 191136032 190405354 191842109
1083A91842109K965808L943622M581690N167827N648434N646721M842311L366172J750678
$$ 191842109 194807917 198751539 203333229 208501056 214149490 219796211 224638522 228004694 229755372
1101.4B29755372P45475Q10281J740187K919495L730878L948957L759503L362060K811462
$$ 229755372 230500847 231311128 233051315 235970810 239701688 243650645 247410148 250772208 253583670
1119.8B53583670K177238J714081J901239K896100M173577M829705M075706J751959
$$ 253583670 255760908 257474989 259376228 262272328 266445905 271275610 275351316 277103275
1136.1B77103275j431525m393279o489754p609814p876411p417500o369308m930869
$$ 277103275 275671750 271278471 264788717 257178903 249302492 241884992 235515684 230584815
1152.4B30584815l331035j781851m11064Q23811K197281L962934O090164Q269205J0170639
$$ 230584815 227253780 225471929 225060865 225884676 228081957 232044891 238135055 246404260 256574899
1170.7B56574899J1677653J2859672J3769388J4464945J4851540J4620662J3754904
$$ 256574899 268252552 281112224 294881612 309346557 324198097 338818759 352573663
1185C52573663J2462020J0896087R161830P245391N191475L382266K285868K027064
$$ 352573663 365035683 375931770 385093600 392338991 397530466 400912732 403198600 405225664
1201.3D05225664K337248K839505L354192L935277M736484N706697O393105O242663
$$ 405225664 407562912 410402417 413756609 417691886 422428370 428135067 434528172 440770835
1217.7D40770835N094886L359198J693517M76629l51519j048565j751899k276659k333701
$$ 440770835 445865721 449224919 450918436 451395065 451043546 449994981 448243082 445966423 443632722
1236D43632722j933396j328438p17313j29818N60432J399547K212524K745182K760917
$$ 443632722 441699326 440370888 439653575 439523757 440084189 441483736 443696260 446441442 449202359
1254.4D49202359K228439J496374J078993J208961J709402K249092K547651K483130
$$ 449202359 451430798 452927172 454006165 455215126 456924528 459173620 461721271 464204401
1270.7D64204401K119869J587033R23753J24574o64711j144469j153022q80927p37310
$$ 464204401 466324270 467911303 468835056 468959630 468294919 467150450 465997428 465116501 464379191
1289D64379191j013696j638442k248854k515643k399713k165049k148122k410412k600551
$$ 464379191 463365495 461727053 459478199 456962556 454562843 452397794 450249672 447839260 445238709
1307.4D45238709k328604j750886j330942j295239j629084k050549k408952l072351
$$ 445238709 442910105 441159219 439828277 438533038 436903954 434853405 432444453 429372102
1323.7D29372102m263878n609274o468415o445885n566507m172623k754748j628667
$$ 429372102 425108224 419498950 413030535 406584650 401018143 396845520 394090772 392462105
1340C92462105p64430r4384M05908O08712L30806k74748r06467j262278j241982j078426
$$ 392462105 391697675 391603291 392009199 392617911 392948717 392673969 391767502 390505224 389263242 388184816
1360.4C88184816j024068r80556q85010o80059m7207P90537J334756J296968J031667
$$ 388184816 387160748 386180192 385295182 384615123 384567916 385358453 386693209 387990177 389021844
1378.8C89021844J071989J713395K938867M366577M702478L584326K324491J231462
$$ 389021844 390093833 391807228 394746095 399112672 403815150 407399476 409723967 410955429
1395.1D10955429K41458o56813j302153j742780k138168k081900j924664k071411k107888
$$ 410955429 411196887 410540074 409237921 407495141 405356973 403275073 401350409 399278998 397171110
1413.5C97171110j815856j536458j114786k26647M22240O80864R17941J299709J738042
$$ 397171110 395355254 393818796 392704010 392477363 392899603 393580467 394498408 395798117 397536159
1431.8C97536159K032667K299190K322554J990438J927912J839936J416176N22107
$$ 397536159 399568826 401868016 404190570 406181008 408108920 409948856 411365032 411887139
1448.1D11887139n58793j268179j579672k231151k356916o00219P70330K120972L890097
$$ 411887139 411328346 410060167 408480495 406249344 403892428 403292209 404062539 406183511 410073608
1466.5D10073608N374760P430553J0873973J1887521J0371357R550572R426087R207844
$$ 410073608 415448368 422878921 433752894 445640415 456011772 465562344 474988431 484196275
1482.8D84196275Q182198P423938P422447P308364O180405N625010N749524M996061
$$ 484196275 492378473 499802411 507224858 514533222 520713627 526338637 532088161 537084222
1499.1E37084222M044413L580034L931165M833698L800392K671063K497912K706825
$$ 537084222 541128635 544708669 548639834 553473532 557273924 559944987 562442899 565149724
1515.4E65149724L099025L011048K718389K275705K036452K242327K206326J946449
$$ 565149724 568248749 571259797 573978186 576253891 578290343 580532670 582738996 584685445
1531.8E84685445J537859J152277J016736J134813J110196Q39889N24402K45750J31071
$$ 584685445 586223304 587375581 588392317 589527130 590637326 591477215 592001617 592247367 592378438
1550.1E92378438K34842L41713J56343p98404j658678p01189m36306o54280j130104
$$ 592378438 592613280 592954993 593111336 592312932 590654254 589953065 589516759 588862479 587732375
1568.5E87732375j718045j466989j335442j813114j625538j413107j829743k113104
$$ 587732375 586014330 584547341 583211899 581398785 579773247 578360140 576530397 574417293
1584.8E74417293k105236k011299k086282k361596k750635k991616k992750l042519
$$ 574417293 572312057 570300758 568214476 565852880 563102245 560110629 557117879 554075360
1601.1E54075360l246665l573179m022479m494369m452765m016876m469872n564451
$$ 554075360 550828695 547255516 543233037 538738668 534285903 530269027 525799155 520234704
1617.4E20234704m534006l758550m321456m065394l648937l563404k917707k532422
$$ 520234704 515700698 511942148 507620692 503555298 499906361 496342957 493425250 490892828
1633.7D90892828k818257j886904o96421l11315o7413L03149J088798J676739K250790
$$ 490892828 488074571 486187667 485491246 485179931 485112518 485415667 486504465 488181204 490431994
1652.1D90431994L206134L069252L083139L693611M555344M946411M538655M895747
$$ 490431994 493638128 496707380 499790519 503484130 508039474 512985885 517524540 522420287
1668.4E22420287N762220N609512O114960O716191N933524N404532O152629Q089781
$$ 522420287 528182507 533792019 539906979 546623170 552556694 557961226 564113855 572203636
1684.7E72203636P238686N884767N777836N122006N165934N407751N006671M962921
$$ 572203636 579442322 585327089 591104925 596226931 601392865 606800616 611807287 616770208
1701.1F16770208L740609K908647L012955K995372K937615K840161K803862L162086
$$ 616770208 620510817 623419464 626432419 629427791 632365406 635205567 638009429 641171515
1717.4F41171515L285527L018618L001571K999484K745330K606154K625108L096997
$$ 641171515 644457042 647475660 650477231 653476715 656222045 658828199 661453307 664550304
1733.7F64550304L204644K560794K448440K641738K888679L155053L310084L460527
$$ 664550304 667754948 670315742 672764182 675405920 678294599 681449652 684759736 688220263
1750F88220263L452181L122807L114104L247857K992034K700865K312303K060890K085686
$$ 688220263 691672444 694795251 697909355 701157212 704149246 706850111 709162414 711223304 713308990
1768.4G13308990K110481K069891J805961J473665J425982J587391J660585J520693
$$ 713308990 715419471 717489362 719295323 720768988 722194970 723782361 725442946 726963639
1784.7G26963639J293659J118482J117169J396001J514435J306951J053631J002967
$$ 726963639 728257298 729375780 730492949 731888950 733403385 734710336 735763967 736766934
1801G36766934J192749J341820J297354J081407Q93176Q80778J012921J117826J093685
$$ 736766934 737959683 739301503 740598857 741680264 742573440 743454218 744467139 745584965 746678650
1819.4G46678650R21607P20323O72042P61628Q73625R08494P75993N73278N15461N79238
$$ 746678650 747600257 748320580 748992622 749754250 750627875 751536369 752312362 752885640 753401101 753980339
1839.8G53980339N53548M27246M02331M38273M23193M41432M66168M37618L42965K68578
$$ 753980339 754533887 754961133 755363464 755801737 756224930 756666362 757132530 757570148 757913113 758181691
1860.2G58181691K70486L15785L01779K72155L67224M74095M75288M54485N01156N29349
$$ 758181691 758452177 758767962 759069741 759341896 759709120 760183215 760658503 761112988 761614144 762143493
1880.5G62143493N12182M87805M57585M43816M90069M97639M08352L56138L43322L21567
$$ 762143493 762655675 763143480 763601065 764044881 764534950 765032589 765440941 765797079 766140401 766461968
1900.9G66461968K86520K53320J93715J42038J60455J80662J79887K00212K38657J99079
$$ 766461968 766748488 767001808 767195523 767337561 767498016 767678678 767858565 768058777 768297434 768496513
1921.3G68496513J59264K29776L16322L15249K17259J09493R4533J70529K32995K22027
$$ 768496513 768655777 768885553 769201875 769517124 769734383 769843876 769938409 770108938 770341933 770563960
1941.7G70563960J78814J74701J89185K66314L92020M23968L20971J68621J45555K82466
$$ 770563960 770742774 770917475 771106660 771372974 771764994 772188962 772509933 772678554 772824109 773106575
1962.1G73106575L94046L50476K41458J49310J24156K20239L15190K66373J21534N6863
$$ 773106575 773500621 773851097 774092555 774241865 774366021 774586260 774901450 775167823 775289357 775346220
1982.5G75346220R6023J54614J85847J46151K7776m5598J9014J27554J34706n662j76668
$$ 775346220 775442243 775596857 775782704 775928855 775956631 775911033 775930047 776057601 776192307 776186645 776009977
2005G76009977k81036k83420k06471j88112l46959n49852o12378n74172n75900n90026
$$ 776009977 775728941 775445521 775239050 775050938 774703979 774154127 773541749 772967577 772391677 771801651
2025.4G71801651m71950m06623m63009m27902l78131m55618n44429n30422m61936l53098
$$ 771801651 771329701 770923078 770460069 770032167 769654036 769198418 768653989 768123567 767661631 767308533
2045.8G67308533k38716j89722j96517j79588j05739p212O5267P0095M6253M9412J01030
$$ 767308533 767069817 766880095 766683578 766503990 766398251 766391039 766456306 766526401 766572654 766622066 766723096
2068.2G66723096J49608J44184R9063N3525L5643M0531O6459J17958J64211J73867
$$ 766723096 766872704 767016888 767115951 767169476 767205119 767245650 767312109 767430067 767594278 767768145
2088.6G67768145J68085J53660J62006K17020K63155K40445J95205K04444K35617K41638
$$ 767768145 767936230 768089890 768251896 768468916 768732071 768972516 769167721 769372165 769607782 769849420
2109G69849420K10762J56283Q9765M7504O8665J24455J33574N0604k9922J014P1585
$$ 769849420 770060182 770216465 770306230 770353734 770422399 770546854 770680428 770731032 770701110 770702124 770773709
2131.4G70773709Q0049O4611L2544%K8074J14680J67012J14977N6744O4015J23322
$$ 770773709 770853758 770918369 770950913 770950913 770978987 771093667 771260679 771375656 771432400 771496415 771619737
2153.9G71619737K28763L16560L34263L29256L43919L95119N15461O62446P07388O28948
$$ 771619737 771848500 772165060 772499323 772828579 773172498 773567617 774083078 774745524 775452912 776081860
2174.3G76081860N79834O32465P11918P47680O99938O06715N60701N72145O10292O31929
$$ 776081860 776661694 777294159 778006077 778753757 779453695 780060410 780621111 781193256 781803548 782435477
2194.6G82435477N84721N06342M68790N00858N80728O28829N94318N39482N24401N31912
$$ 782435477 783020198 783526540 783995330 784496188 785076916 785705745 786300063 786839545 787363946 787895858
2215G87895858N59330N68509M89414L98576M08233M55439M68075M51624L97146L27349
$$ 787895858 788455188 789023697 789513111 789911687 790319920 790775359 791243434 791695058 792092204 792419553
2235.4G92419553L01301L32475L67224L59714L12209K59042K53797L17335L63648L30210
$$ 792419553 792720854 793053329 793420553 793780267 794092476 794351518 794605315 794922650 795286298 795616508
2255.8G95616508K79307K61545K76327L06845L33667L38852L18170K96950K87831K68578
$$ 795616508 795895815 796157360 796433687 796740532 797074199 797413051 797731221 798028171 798316002 798584580
2276.2G98584580K48552K38657K42352K88129L40998L34800K65657K24770K42173K12372
$$ 798584580 798833132 799071789 799314141 799602270 799943268 800278068 800543725 800768495 801010668 801223040
2296.6H01223040J43170J53065K53617L41356L46482K85387K65420K77578K49982K63393
$$ 801223040 801366210 801519275 801772892 802114248 802460730 802746117 803011537 803289115 803539097 803802490
2317H03802490L25322L59297K90215J92046K29776K67983R4950j20163j66357r7215
$$ 803802490 804127812 804487109 804777324 804969370 805199146 805467129 805562079 805441916 805275559 805178344
2337.4H05178344j3351j04785m55082r13024q68141j72258N71967Q96215P42674L61919
$$ 805178344 805164993 805060208 804605126 803692102 802823961 802651703 803223670 804119885 804862559 805224478
2357.8H05224478o6280l43502n15997p10189q92282j034856j013279q75115q22187
$$ 805224478 805158198 804814696 804298699 803588510 802696228 801661372 800648093 799772978 798950791
2376.2G98950791p90417p34746o67930n11825l29733k48670k59519l25084l81350l30210
$$ 798950791 798160374 797425628 796757698 796245873 795916140 795667470 795407951 795082867 794701517 794371307
2396.6G94371307k33531k43664l71992m83335m86135m36008m14729m67956n71370o69360
$$ 794371307 794137776 793894112 793522120 793038785 792552650 792116642 791701913 791233957 790662587 789993227
2417G89993227p06852o59764o17623o55592p37428p88927p98643p64549p21574p66754
$$ 789993227 789286375 788626611 788008988 787353396 786615968 785827041 785028398 784263849 783542275 782775521
2437.4G82775521q60333q91566q66175q21889p67350p72238q40663q67546q23200p55668
$$ 782775521 781915188 781023622 780157447 779335558 778568208 777795970 776955307 776087761 775264561 774508893
2457.8G74508893p10845p20202p68900q00431p60615o72162o38544o79672p51853p90357
$$ 774508893 773798048 773077846 772308946 771508515 770747900 770075738 769437194 768757522 768005669 767215312
2478.1G67215312p20621n98251n40197n78940o52135o29902m91619m05311m32015m68850
$$ 767215312 766494691 765896440 765356243 764777303 764125168 763495266 763003647 762598336 762166321 761697471
2498.5G61697471m94599n14865m61578l77834l72529m01497m31717m93467n31911n24581
$$ 761697471 761202872 760688007 760226429 759848595 759476066 759074569 758642852 758149385 757617474 757092893
2518.9G57092893n29170n83768o82354p25508o84082o97136p88331q61287q83162q91924
$$ 757092893 756563723 755979955 755297601 754572093 753888011 753190875 752402544 751541257 750658095 749766171
2539.3G49766171r09030q85010q42035q51214q74937q66055q45850q40783q60035q95619
$$ 749766171 748857141 747972131 747130096 746278882 745403945 744537890 743692040 742851257 741991222 741095603
2559.7G41095603q96693q56638q37326q21829p88569p90894q39591q61466q11577p51853
$$ 741095603 740198910 739342272 738504946 737683117 736894548 736103654 735264063 734402597 733591020 732839167
2580.1G32839167p27713p41661p70151p57396o82295n97298n66065n60582n57125n80549
$$ 732839167 732111454 731369793 730599642 729842246 729159951 728562653 727996588 727436006 726878881 726298332
2600.5G26298332o17683o33657o41226p21992q78870j002908j046598j064598j129270
$$ 726298332 725680649 725046992 724405766 723683774 722804904 721801996 720755398 719690800 718561530
2618.9G18561530j240253j306594j320481j359999j427770j490474j550138j628518
$$ 718561530 717321277 716014683 714694202 713334203 711906433 710415959 708865821 707237303
2635.2G07237303j668513j603365j539587j563371j591325j585483j561523j497983
$$ 707237303 705568790 703965425 702425838 700862467 699271142 697685659 696124136 694626153
2651.5F94626153j472295j536429j583278j559317j503468j433551j386940j390458
$$ 694626153 693153858 691617429 690034151 688474834 686971366 685537815 684150875 682760417
2667.8F82760417j407980j398981j326799j218260j174986j213789j251996j246094
$$ 682760417 681352437 679953456 678626657 677408397 676233411 675019622 673767626 672521532
2684.1F72521532j197637j142025j165688j258850j334190j376271j385689j365960
$$ 672521532 671323895 670181870 669016182 667757332 666423142 665046871 663661182 662295222
2700.5F62295222j388251j477182j560688j558721j476884j407504j411915j435519
$$ 662295222 660906971 659429789 657869101 656310380 654833496 653425992 652014077 650578558
2716.8F50578558j413345j357973j302719j264751j213193j154124j141906j115978
$$ 650578558 649165213 647807240 646504521 645239770 644026577 642872453 641730547 640614569
2733.1F40614569j015901r27270r48608j019180j026153r91523r71497r38236r06408
$$ 640614569 639598668 638671398 637722790 636703610 635677457 634685934 633714437 632776201 631869793
2751.4F31869793r17554q81731p74265p20203p46250p86304q13246q37445q56996q69513
$$ 631869793 630952239 630070508 629296243 628576040 627829790 627043486 626230240 625392795 624535799 623666286
2771.8F23666286r13679j013041j128494j202286j226246j258731j365244j542569
$$ 623666286 622752607 621739566 620611072 619408786 618182540 616923809 615558565 614015996
2788.2F14015996j686394j711011j685142j737952j880825k021074k133727k240181
$$ 614015996 612329602 610618591 608933449 607195497 605314672 603293598 601159871 598919690
2804.5E98919690k305270k341866k417386k518415k608001k699554k789319k863407
$$ 598919690 596614420 594272554 591855168 589336753 586728752 584029198 581239879 578376472
2820.8E78376472k952218l091991l217697l261626l297210l388047l550649l791868
$$ 578376472 575424254 572332263 569114566 565852940 562555730 559167683 555617034 551825166
2837.1E51825166m016996m197895m440725m754901n034983n053044m652082m036367
$$ 551825166 547808170 543610275 539169550 534414649 529379666 524326622 519674540 515638173
2853.4E15638173l515840l274441l353178l694833m211068m776150n332291n847812
$$ 515638173 512122333 508847892 505494714 501799881 497588813 492812663 487480372 481632560
2869.7D81632560o226480o416022o422252o210893n704284m938900m111052l297508
$$ 481632560 475406080 468990058 462567806 456356913 450652629 445713729 441602677 438305169
2886.1D38305169k488434j786023j239002q75741p54267p99507r05782j078516j346320
$$ 438305169 435816735 434030712 432791710 431915969 431161702 430362195 429456413 428377897 427031577
2904.4D27031577j713753k178550k731323l328711l895730m307836m432499m278034
$$ 427031577 425317824 423139274 420407951 417079240 413183510 408875674 404443175 400165141
2920.7D00165141l904492l299236k430648j384646k72601R64075K316147L601700M686475
$$ 400165141 396260649 392961413 390530765 389146119 388873518 389837593 392153740 395755440 400441915
2939.1D00441915N522519O089837O431102O618589O743908O873399O933779O878316
$$ 400441915 405964434 412054271 418485373 425103962 431847870 438721269 445655048 452533364
2955.4D52533364O804109O733209O557345O195247N718291N290628M952490M717648
$$ 452533364 459337473 466070682 472628027 478823274 484541565 489832193 494784683 499502331
2971.7D99502331M605085M533827M457116M303932L999234L656864L358781L009856
$$ 499502331 504107416 508641243 513098359 517402291 521401525 525058389 528417170 531427026
2988E31427026K625942K259016J869679J521766J227796Q73744M29511k3663m12225
$$ 531427026 534052968 536311984 538181663 539703429 540931225 541804969 542234480 542210817 541798592
3006.4E41798592o97315r14455j185953j536012j882374k154470k316951k421380k543330
$$ 541798592 541101277 540186822 539000869 537464857 535582483 533428013 531111062 528689682 526146352
3024.7E26146352k668321k784669k903760k975464l035426l097951l103554l162265
$$ 526146352 523478031 520693362 517789602 514814138 511778712 508680761 505577207 502414942
3041.1E02414942l312052l410756l424376l410131l411532l416538l422200l463656
$$ 502414942 499102890 495692134 492267758 488857627 485446095 482029557 478607357 475143701
3057.4D75143701l472209l414810l373086l381402l436684l472269l427177l353686
$$ 475143701 471671492 468256682 464883596 461502194 458065510 454593241 451166064 447812378
3073.7D47812378l256678l185988l283500l412545l399342l361583l333747l307134
$$ 447812378 444555700 441369712 438086212 434673667 431274325 427912742 424578995 421271861
3090D21271861l354401l372788l250331l072202l070533l226430l201604l010630k928883
$$ 421271861 417917460 414544672 411294341 408222139 405151606 401925176 398723572 395712942 392784059
3108.4C92784059k995312k998620k882570k856225k939165l051072l133565l077329
$$ 392784059 389788747 386790127 383907557 381051332 378112167 375061095 371927530 368850201
3124.7C68850201k900540k728701k698571k769500k741932k624602k589285k680182
$$ 368850201 365949661 363220960 360522389 357752889 355010957 352386355 349797070 347116888
3141C47116888k725035k643854k558946k431989k288491k335995k473801k465845k405524
$$ 347116888 344391853 341747999 339189053 336757064 334468573 332132578 329658777 327192932 324787408
3159.4C24787408k372175k277851k187700k170085k158702k123684k087771k041996
$$ 324787408 322415233 320137382 317949682 315779597 313620895 311497211 309409440 307367444
3175.7C07367444j985252j924604j893133j911521j902312j818150j749724j755506
$$ 307367444 305382192 303457588 301564455 299652934 297750622 295932472 294182748 292427242
3192B92427242j766056j749396j715333j662790j606405j552493j503378j490086j500309
$$ 292427242 290661186 288911790 287196457 285533667 283927262 282374769 280871391 279381305 277880996
3210.3B77880996j463115j381069j335532j351893j364946j342982j297861j229555
$$ 277880996 276417881 275036812 273701280 272349387 270984441 269641459 268343598 267114043
3226.7B67114043j161217j079649j036465j171649j314878j255066j123577j040280
$$ 267114043 265952826 264873177 263836712 262665063 261350185 260095119 258971542 257931262
3243B57931262r94950r95219j030833r92089q78036q54641r25660r28998q71599q37371
$$ 257931262 256936312 255941093 254910260 253918171 253040135 252185494 251259834 250330836 249459237 248621866
3263.4B48621866p86543o72057n90876p14496q93682q98778q19996p53537p07135o94811
$$ 248621866 247835323 247163266 246572390 245857894 244964212 244065434 243245438 242491901 241784766 241089955
3283.8B41089955o79284o27771n63577n50613o09323o99133p71508p16701n47737m47139
$$ 241089955 240410671 239782900 239219323 238668710 238059387 237360254 236588746 235872045 235324308 234877169
3304.2B34877169n41299p78929r53585r34779q14423p49737p11680o75589o88821p20218
$$ 234877169 234335870 233556941 232603356 231668577 230854154 230104417 229392737 228717148 228028327 227308109
3324.6B27308109p86513q43525q17299p50571o73339o20588o79821q23796q98644q47951
$$ 227308109 226521596 225678071 224860772 224110201 223436862 222816274 222136453 221312657 220414013 219566062
3345B19566062o94662n63175o80864r40457r69782p58290o29530o81236p04438n84244
$$ 219566062 218871400 218308225 217627361 216686904 215717122 214958832 214329302 213648066 212943628 212359384
3365.4B12359384n21630o89492r25854r40099p22766n65618n89192o43522o00204m86418
$$ 212359384 211837754 211148262 210222408 209282309 208559543 207993925 207404733 206761211 206161007 205674589
3385.7B05674589k74197n3018j77309n43937n69984j71364K5824l19376o61180n20781
$$ 205674589 205400392 205347374 205170065 204626128 204056144 203884780 203910604 203591228 202930048 202409267
3406.1B02409267k26825j30385j87576k80544k83420j54719p8008r7781q404J88842
$$ 202409267 202182442 202052057 201864481 201583937 201300517 201145798 201067790 200970009 200961605 201150447
3426.5B01150447L04833K46510K41235L05966J28120j35467j13666J34096L48329M02913
$$ 201150447 201455280 201701790 201943025 202248991 202377111 202241644 202127978 202262074 202610403 203013316
3446.9B03013316L57657L70473M30241M88639N76362O42509N69939N99027Q90106J003638
$$ 203013316 203370973 203741446 204171687 204660326 205236688 205879197 206449136 207048163 207938269 208941907
3467.3B08941907O63787K56210K76551N66468Q20383Q47012O24701O15284Q51199Q18178
$$ 208941907 209605694 209861904 210138455 210704923 211525306 212372318 212997019 213612303 214463502 215281680
3487.7B15281680O51777P74801R43929R42930R12041R52124R12398O94141O17087P78094
$$ 215281680 215933457 216708258 217652187 218595117 219507158 220459282 221371680 222065821 222682908 223461002
3508.1B23461002R50799J106247J065001Q34465Q41811J089007J270115J138285Q67918
$$ 223461002 224411801 225518048 226583049 227417514 228259325 229348332 230618447 231756732 232624650
3526.5B32624650Q32021J019061J225009J339391J269564J167566J355201J562536
$$ 232624650 233456671 234475732 235700741 237040132 238309696 239477262 240832463 242394999
3542.8B42394999J413881J132146J238853J451477J432881J535863J814454K010763
$$ 242394999 243808880 244941026 246179879 247631356 249064237 250600100 252414554 254425317
3559.1B54425317K033085J923561J805097K012223K458423K582580K497017K554745
$$ 254425317 256458402 258381963 260187060 262199283 264657706 267240286 269737303 272292048
3575.4B72292048K716720K908975L125846L212303K976805K719134L115088L490358
$$ 272292048 275008768 277917743 281043589 284255892 287232697 289951831 293066919 296557277
3591.7B96557277L475100L564924L754735L733039L714681L800124L688037L646791
$$ 296557277 300032377 303597301 307352036 311085075 314799756 318599880 322287917 325934708
3608.1C25934708L895909M115790M265457M242689M113584M331381M459321M240006
$$ 325934708 329830617 333946407 338211864 342454553 346568137 350899518 355358839 359598845
3624.4C59598845L912956L905505M544794M728020M556328M465282M418551M425288
$$ 359598845 363511801 367417306 371962100 376690120 381246448 385711730 390130281 394555569
3640.7C94555569M439801M316449M103780M227042M683465M664749M377365M497081
$$ 394555569 398995370 403311819 407415599 411642641 416326106 420990855 425368220 429865301
3657D29865301M663527M358858M010707L961205L819138L553390L784538L763467L291428
$$ 429865301 434528828 438887686 442898393 446859598 450678736 454232126 458016664 461780131 465071559
3675.4D65071559L554553L873110L743618L654629L535003L164679K645343K699912
$$ 465071559 468626112 472499222 476242840 479897469 483432472 486597151 489242494 491942406
3691.7D91942406K997875K963245K763390K461434K227902K429128K623558K343833
$$ 491942406 494940281 497903526 500666916 503128350 505356252 507785380 510408938 512752771
3708E12752771J831770J701713K271116K501785K252400J991272J837194J750827J786888
$$ 512752771 514584541 516286254 518557370 521059155 523311555 525302827 527140021 528890848 530677736
3726.4E30677736J997113J913846J552522J315057J501262J947105K003968J246512
$$ 530677736 532674849 534588695 536141217 537456274 538957536 540904641 542908609 544155121
3742.7E44155121N98967J419663J560152Q25345J270533J981497J744747J278460J437545
$$ 544155121 544754088 546173751 547733903 548559248 549829781 551811278 553556025 554834485 556272030
3761E56272030J668870J417399J212060J089216J186668J551688J585484J296222R53793
$$ 556272030 557940900 559358299 560570359 561659575 562846243 564397931 565983415 567279637 568233430
3779.4E68233430R75013J093805J060426J172722J289308J286387J093567Q36908R76265
$$ 568233430 569208443 570302248 571362674 572535396 573824704 575111091 576204658 577041566 578017831
3797.7E78017831Q56221M78565J019419J094102Q38161J311719J492083R41337M09424
$$ 578017831 578874052 579352617 580372036 581466138 582304299 583616018 585108101 586049438 586458862
3816.1E86458862P15196O92308O79254J256884J129329Q68678Q49903Q40008J038372
$$ 586458862 587174058 587866366 588545620 589802504 590931833 591800511 592650414 593490422 594528794
3834.4E94528794Q00729J98424M39465R35972J062989J099169J104415O75380n11706
$$ 594528794 595329523 595527947 595967412 596903384 597966373 599065542 600169957 600845337 600333631
3852.8F00333631k45631J356006J471639Q95619M03702M17412P29918M98712M29034
$$ 600333631 600088000 601444006 602915645 603811264 604214966 604632378 605362296 605861008 606290042
3871.2F06290042P95663R21786Q86082M58658L52025P08103N13852N50806O90937L80040
$$ 606290042 607085705 608007491 608893573 609352231 609704256 610412359 610926211 611477017 612167954 612547994
3891.6F12547994N28216Q54731N99801J91569N2631J38164N33760Q40008P18713N19275
$$ 612547994 613076210 613930941 614530742 614722311 614774942 614913106 615446866 616286874 617005587 617524862
3912F17524862L88325J53958J00851L93987M74751K70486L04103M76658L65079K65360
$$ 617524862 617913187 618067145 618167996 618561983 619036734 619307220 619611323 620087981 620453060 620718420
3932.3F20718420L95774M25637L62814K79188J78396L03627M15563L13103L09766L72231
$$ 620718420 621114194 621539831 621902645 622181833 622360229 622663856 623079419 623392522 623702288 624074519
3952.7F24074519L48806L32415L59953L00109K41816K83301K87414K76029K82287K60592
$$ 624074519 624423325 624755740 625115693 625415802 625657618 625940919 626228333 626504362 626786649 627047241
3973.1F27047241K19166K22206K77341L51071L49224K28047J12831J52231L06725L30687
$$ 627047241 627266407 627488613 627765954 628117025 628466249 628694296 628807127 628959358 629266083 629596770
3993.5F29596770K35975K26497
$$ 629596770 629832745 630059242
3997.6F30059242
$$ 630059242
##END=$$ End of the data block
