##TITLE=$$ Begin of the data block
##JCAMP-DX=5.00 $$ ACD/SpecManager v 10.08
##SPECTROMETER/DATA SYSTEM=Alpha
##DATE=29 Dec 2014 15:06:02
##DATA TYPE=INFRARED SPECTRUM
##DATA CLASS=XYDATA
##ORIGIN=
##OWNER=
##NPOINTS=1765
##FIRSTX=399.76428223
##LASTX=3997.64306641
##MAXX=3997.64306641
##MINX=399.76428223
##MAXY=0.80671042
##MINY=0.13276479
##XFACTOR=1.0000000000
##YFACTOR=1.000000000000000e-9
##FIRSTY=0.42399791
##DELTAX=2.03961372
##XUNITS=1/CM
##YUNITS=ARBITRARY UNITS
##XYDATA=(X++(Y..Y))
$$ plain form
399.8 423997909 419600964 415929228 412888020 411459059 411975890 414162159 417237341 419528961 419609398
418.1 419609398 417639583 415519714 413721204 411535531 408245504 403878063 399399400 396250337
434.4 396250337 395051450 395559907 397892565 402200818 407665789 413032949 417490363 420439303 421618968
452.8 421618968 421630055 421306163 420621842 419151068 416598856 413008183 408944994 405181915 401896983
471.2 401896983 398724556 395617127 392722040 390493631 389329493 389139026 389409810 389315844 388678551
489.5 388678551 387788236 386763424 385596871 383938432 381432116 378379077 375594258 373130530 370224059
507.9 370224059 366516203 362085640 357297838 352551967 347964823 343614280 339668870 336652637
524.2 336652637 335187018 335103899 335786939 337160319 339411557 342943102 348238260 354756147 360914767
$$ packed form
399.8D23997909m396945l671736l041208j428961N16831K186269L075182K291620Q0437
418.1D19609398j969815k119869j798510k185673l290027m367441m478663l149063
434.4C96250337j198887N08457K332658M308253N464971N367160M457414K948940J179665
452.8D21618968J1087l23892o84321j470774k552212l590673m063189l763079l284932
471.2D01896983l172427l107429k895087k228409j164138j90467K70784r3966o37293
489.5C88678551q90315j024812j166553j658439k506316l053039k784819k463728k906471
507.9C70224059l707856m430563m787802m745871m587144m350543l945410l016233
524.2C36652637j465619q3119O83040J373380K251238L531545N295158O517887O158620
$$ plain form
542.5 360914767 365234077 367138088 367098480 365943164 364227623 361990958 358896255 354746580 349621743
560.9 349621743 343786836 337449759 330481231 323157609 316709459 312499851 311313927 313287079
577.2 313287079 317984730 324640244 332307845 340102643 347354174 353351265 357498944 359630704
593.5 359630704 360214978 360060751 359848976 359858036 359908015 359778523 359632373 360046357 361474276 363759845
613.9 363759845 366461426 369501799 372983634 376916915 381342113 385988772 390230834 393591702
630.2 393591702 396066368 398086041 400212884 402483672 404427767 405742288 406641960 407701492 409318537
648.6 409318537 411242843 412822932 413802654 414507300 415467739 416917473 418563485 419986844 421245992
667 421245992 422504157 423826158 425627083 427836806 429799944 431279689 432681978 434357554 436168313
$$ packed form
542.5C60914767M319310J904011l9608j155316j715541k236665l094703m149675n124837
560.9C49621743n834907o337077o968528p323622o448150m209608j185924J973152
577.2C13287079M697651O655514P667601P794798P251531N997091M147679K131760
593.5C59630704N84274j54227k11775R060M9979j29492j46150M13984J427919K285569
613.9C63759845K701581L040373L481835L933281M425198M646659M242062L360868
630.2C93591702K474666K019673K126843K270788J944095J314521Q99672J059532J617045
648.6D09318537J924306J580089R79722P04646R60439J449734J646012J423359J259148
667D21245992J258165J322001J800925K209723J963138J479745J402289J675576J810759
$$ plain form
685.3 436168313 437597394 438080132 437563211 436426342 434871078 432713032 429765016 426109880 422245204
703.7 422245204 419128478 417651087 418041676 419995874 423073202 427061141 432189435 438702524 446180612
722 446180612 453769535 460854113 467170537 472895831 478403270 483527124 487585276 490187973 491537571
740.4 491537571 491960019 491542041 489940494 486641437 481560111 475413561 469250083 463613898 458557010
758.7 458557010 454088628 450470001 448478669 449156135 453060776 459881693 468674034 478549808 489091754
777.1 489091754 499954611 510476351 519823253 527367592 533108950 537812352 542486191 547675908
793.4 547675908 553147614 558410764 563366771 568261683 573249817 578022659 581913471 584444702
809.7 584444702 585836530 586851656 588131905 589483202 590000331 588954270 586464822 583181977 579334915
$$ packed form
685.3D36168313J429081M82738n16921j136869j555264k158046k948016l655136l864676
703.7D22245204l116726j477391L90589J954198L077328L987939N128294O513089P478088
722D46180612P588923P084578O316424N725294N507439N123854M058152K602697J349598
740.4D91537571M22448m17978j601547l299057n081326o146550o163478n636185n056888
758.7D58557010m468382l618627j991332O77466L904641O820917Q792341R875774J0541946
777.1D89091754J0862857J0521740R346902P544339N741358M703402M673839N189717
793.4E47675908N471706N263150M956007M894912M988134M772842L890812K531231
809.7E84444702J391828J015126J280249J351297N17129j046061k489448l282845l847062
$$ plain form
828.1 579334915 574592829 568589151 561325192 553462446 546108723 539875686 534475446 529300511
844.4 529300511 524097621 518990397 514105797 509292841 504031897 497968584 491977662 488673925
860.7 488673925 491001427 499598503 512471616 527317464 542571843 556733370 568380415 576585650
877 576585650 580671132 580259323 575888693 568926871 560864210 552673519 544582009 536502898 528625369
895.4 528625369 521345317 514782488 508551955 501769423 493589908 483885646 473067939 461538136
911.7 461538136 449501604 437169820 425186217 414744884 407057971 402544647 400551140 400017351
928 400017351 400362760 401693195 404370368 408477813 413730294 419625819 425234735 428990096 429164290
946.4 429164290 424727231 415644467 402633369 386896670 369687349 351804376 333499849 314736724
$$ packed form
828.1E79334915m742086o003678p263959p862746p353723o233037n400240n174935
844.4E29300511n202890n107224m884600m812956n260944o063313n990922l303737
860.7D88673925K327502Q597076J2873113J4845848J5254379J4161527J1647045Q205235
877E76585650M085482m11809m370630o961822q062661q190691q091510q079111p877529
895.4E28625369p280052o562829o230533o782532q179515r704262j0817707j1529803
911.7D61538136j2036532j2331784j1983603j0441333p686913m513324j993507n33789
928D00017351L45409J330435K677173M107445N252481N895525N608916L755361J74194
946.4D29164290m437059r082764j3011098j5736699j7209321j7882973j8304527j8763125
$$ plain form
962.7 314736724 295479417 275933951 256509811 237497732 219078153 201563194 185387433
977 185387433 171043277 159001186 149507716 142521754 137764946 134808734 133251548 132764786 133080110
995.3 133080110 133968920 135193393 136468291 137523964 138189137 138445258 138400391 138198465 138052359
1013.7 138052359 138212055 138884917 140149862 142002195 144391984 147159904 150116310 153120354 156054839
1032 156054839 158729091 160848811 162222803 162984192 163453743 163966864 164792910 166122690 168175086
1050.4 168175086 171240970 175533846 181054771 187741950 195588082 204500079 213733733 221250892
1066.7 221250892 224025950 220221832 211449698 201815292 194662094 190970674 190259755 191727027
1083 191727027 194662526 198516920 203051195 208259344 213956505 219615072 224455714 227806821 229560301
$$ packed form
962.7C14736724j9257307j9545466j9424140j9012079j8419579j7514959j6175761
977A85387433j4344156j2042091r493470o985962m756808k956212j557186m86762L15324
995.3A33080110Q88810J224473J274898J055673O65173K56121m4867k01926j46106
1013.7A38052359J59696O72862J264945J852333K389789K767920K956406L004044K934485
1032A56054839K674252K119720J373992P61389M69551N13121Q26046J329780K052396
1050.4A68175086L065884M292876N520925O687179P846132Q911997R233654P517159
1066.7B21250892K775058l804118q772134r634406p153198l691420p10919J467272
1083A91727027K935499L854394M534275N208149N697161N658567M840642L351107J753480
$$ plain form
1101.4 229560301 230349630 231207520 232955635 235824928 239497587 243438691 247232050 250630051 253432155
1119.8 253432155 255554080 257232845 259131283 262032390 266246408 271129072 275204331 276939094
1136.1 276939094 275512785 271078378 264522463 256921977 249116376 241763741 235408276 230472118
1152.4 230472118 227173597 225435168 225039706 225864857 228072360 232038707 238109693 246365279 256560713
1170.7 256560713 268255800 281073511 294816196 309301078 324145734 338750929 352519572
1185 352519572 364987254 375879765 385035843 392254144 397431552 400836676 403142929 405174345
1201.3 405174345 407505661 410330504 413684368 417640626 422403604 428123921 434500933 440704972
1217.7 440704972 445769399 449115247 450798094 451266319 450915456 449883759 448170722 445940882 443630964
$$ packed form
1101.4B29560301P89329Q57890J748115K869293L672659L941104L793359L398001K802104
1119.8B53432155K121925J678765J898438K901107M214018M882664M075259J734763
1136.1B76939094j426309m434407o555915p600486p805601p352635o355465m936158
1152.4B30472118l298521j738429l95462Q25151K207503L966347O070986Q255586J0195434
1170.7B56560713J1695087J2817711J3742685J4484882J4844656J4605195J3768643
1185C52519572J2467682J0892511R156078P218301N177408L405124K306253K031416
1201.3D05174345K331316K824843L353864L956258M762978N720317O377012O204039
1217.7D40704972N064427L345848J682847M68225l50863j031697j713037k229840k309918
$$ plain form
1236 443630964 441700488 440366596 439633757 439490497 440031290 441407919 443624735 446383238 449135929
1254.4 449135929 451361060 452881277 453984708 455201000 456912309 459167719 461705595 464158595
1270.7 464158595 466256082 467841059 468788981 468943566 468273461 467101753 465958178 465123683 464421034
1289 464421034 463421077 461789012 459543347 457020998 454597980 452405900 450256497 447867364 445261925
1307.4 445261925 442913264 441187620 439896256 438594669 436955631 434906274 432460338 429355323
1323.7 429355323 425115556 419524014 413024604 406571805 401051670 396902651 394124866 392496467
1340 392496467 391763449 391682088 392073601 392663985 393004864 392763168 391883790 390635669 389402479 388307512
1360.4 388307512 387215108 386168152 385300487 384709686 384724528 385487258 386746138 388008505 389054656
$$ packed form
1236D43630964j930476j333892p32839j43260N40793J376629K216816K758503K752691
1254.4D49135929K225131J520217J103431J216292J711309K255410K537876K453000
1270.7D64158595K097487J584977R47922J54585o70105j171708j143575q34495p02649
1289D64421034r99957j632065k245665k522349k423018k192080k149403k389133k605439
1307.4D45261925k348661j725644j291364j301587j639038k049357k445936l105015
1323.7D29355323m239767n591542o499410o452799n520135m149019k777785j628399
1340C92496467p33018q1361L91513N90384L40879k41696q79378j248121j233190j094967
1360.4C88307512j092404j046956q67665n90801J4842P62730J258880J262367J046151
$$ plain form
1378.8 389054656 390143991 391878039 394837528 399186760 403822452 407341808 409657091 410916150
1395.1 410916150 411170930 410531849 409240901 407487363 405341506 403249085 401313335 399251461 397153437
1413.5 397153437 395323634 393770069 392685026 392528802 392990917 393672466 394586056 395870864 397585213
1431.8 397585213 399586022 401868403 404240966 406280935 408218294 410063833 411497653 412027538
1448.1 412027538 411444902 410157114 408588290 406370878 404010564 403404295 404167533 406273425 410158485
1466.5 410158485 415575743 423087150 434012830 445885092 456237406 465769291 475167185 484392226
1482.8 484392226 492644966 500120401 507542014 514810205 520941317 526544690 532317340 537357986
1499.1 537357986 541420817 545003295 548971355 553843856 557614565 560269237 562784255 565512061
$$ packed form
1378.8C89054656J089335J734048K959489M349232M635692L519356K315283J259059
1395.1D10916150K54780o39081j290948j753538k145857k092421j935750k061874k098024
1413.5C97153437j829803j553565j085043j56224M62115O81549R13590J284808J714349
1431.8C97585213K000809K282381K372563K039969J937359J845539J433820N29885
1448.1D12027538n82636j287788j568824k217412k360314o06269P63238K105892L885060
1466.5D10158485N417258P511407J0925680J1872262J0352314R531885R397894R225041
1482.8D84392226Q252740P475435P421613P268191O131112N603373N772650N040646
1499.1E37357986M062831L582478L968060M872501L770709K654672K515018K727806
$$ plain form
1515.4 565512061 568630695 571690738 574461699 576712728 578699350 580922842 583133042 585101604
1531.8 585101604 586647570 587800145 588871717 590081573 591198802 592015505 592491508 592693090 592819989
1550.1 592819989 593064547 593384385 593502641 592724800 591094017 590350628 589883029 589248896 588167250
1568.5 588167250 586455822 584948421 583564878 581707001 580074489 578679383 576851666 574717999
1584.8 574717999 572587073 570556343 568457127 566084206 563320458 560330093 557359993 554351509
1601.1 554351509 551139355 547584057 543561518 539053977 534585714 530568659 526125848 520590484
1617.4 520590484 516047239 512287617 507992506 503931522 500255346 496676296 493786246 491316080
1633.7 491316080 488536686 486628830 485926509 485630780 485582560 485935092 487085909 488796741 491090864
$$ packed form
1515.4E65512061L118634L060043K770961K251029J986622K223492K210200J968562
1531.8E85101604J545966J152575J071572J209856J117229Q16703M76003K01582J26899
1550.1E92819989K44558L19838J18256p77841j630783p43389m67599o34133j081646
1568.5E88167250j711428j507401j383543j857877j632512j395106j827717k133667
1584.8E74717999k130926k030730k099216k372921k763748k990365k970100l008484
1601.1E54351509l212154l555298m022539m507541m468263m017055m442811n535364
1617.4E20590484m543245l759622m295111m060984l676176l579050k890050k470166
1633.7D91316080k779394j907856p02321k95729m8220L52532J150817J710832K294123
$$ plain form
1652.1 491090864 494335502 497383356 500442266 504157662 508790076 513790607 518300891 523147285
1668.4 523147285 528918028 534564316 540703058 547441185 553397477 558835506 565037310 573135495
1684.7 573135495 580323160 586163223 591907501 597023368 602239847 607703865 612694979 617588580
1701.1 617588580 621286452 624197245 627200127 630163252 633099735 635966063 638784230 641923428
1717.4 641923428 645154119 648139954 651151240 654175878 656935215 659546614 662182152 665284753
1733.7 665284753 668451607 670979857 673440754 676096916 678969681 682133615 685501814 688980401
1750 688980401 692372918 695459425 698589027 701849878 704833865 707529664 709846139 711917520 714009345
1768.4 714009345 716100454 718132079 719918013 721391261 722838461 724473953 726167917 727656722
$$ packed form
1652.1D91090864L244638L047854L058910L715396M632414N000531M510284M846394
1668.4E23147285N770743N646288O138742O738127N956292N438029O201804Q098185
1684.7E73135495P187665N840063N744278N115867N216479N464018M991114M893601
1701.1F17588580L697872K910793L002882K963125K936483K866328K818167L139198
1717.4F41923428L230691K985835L011286L024638K759337K611399K635538L102601
1733.7F65284753L166854K528250K460897K656162K872765L163934L368199L478587
1750F88980401L392517L086507L129602L260851K983987K695799K316475K071381K091825
1768.4G14009345K091109K031625J785934J473248J447200J635492J693964J488805
$$ plain form
1784.7 727656722 728881001 729987681 731157303 732589960 734111011 735441506 736529768 737526357
1801 737526357 738670588 739974856 741258621 742350459 743292809 744217515 745222986 746322870 747407258
1819.4 747407258 748306751 749006391 749675810 750453949 751341164 752238631 752989709 753530562 754023612 754606903
1839.8 754606903 755188346 755654931 756063700 756469786 756857276 757285297 757770300 758222759 758546412 758806825
1860.2 758806825 759098589 759423077 759728193 760020554 760398805 760860801 761330426 761802018 762310266 762819707
1880.5 762819707 763326049 763840139 764314950 764747322 765229344 765736639 766155064 766498148 766806245 767106771
1900.9 767106771 767398894 767670095 767878711 767999768 768113196 768282950 768509388 768781364 769057572 769242406
1921.3 769242406 769381225 769599259 769897699 770211518 770447195 770532668 770554781 770697594 770973861 771244824
$$ packed form
1784.7G27656722J224279J106680J169622J432657J521051J330495J088262R96589
1801G37526357J144231J304268J283765J091838R42350R24706J005471J099884J084388
1819.4G47407258Q99493O99640O69419P78139Q87215Q97467P51078N40853M93050N83291
1839.8G54606903N81443M66585M08769M06086L87490M28021M85003M52459L23653K60413
1860.2G58806825K91764L24488L05116K92361L78251M61996M69625M71592N08248N09441
1880.5G62819707N06342N14090M74811M32372M82022N07295M18425L43084L08097L00526
1900.9G67106771K92123K71201K08616J21057J13428J69754K26438K71976K76208J84834
1921.3G69242406J38819K18034K98440L13819K35677Q5473K2113J42813K76267K70963
$$ plain form
1941.7 771244824 771444917 771619737 771800220 772059679 772455454 772892237 773215950 773384035 773543775 773826003
1962.1 773826003 774188459 774522424 774773061 774922311 775043011 775281966 775628448 775915146 776036620 776063979
1982.5 776063979 776136339 776313305 776531339 776682198 776702225 776652396 776659906 776781559 776943445 776983440 776821077
2005 776821077 776516378 776232064 776048422 775860369 775521696 775011063 774409294 773795903 773169696 772547781
2025.4 772547781 772080064 771707416 771252751 770776987 770375073 769968331 769467950 768946111 768499851 768166006
2045.8 768166006 767921627 767696738 767467499 767278075 767178059 767199039 767296851 767378032 767428756 767497897
2066.2 767497897 767615438 767753243 767870128 767953515 768011630 768050790 768115938 768239260 768376172 768500268
2086.6 768500268 768623173 768774152 768960297 769156456 769362271 769610107 769868076 770081878 770284593 770505309
$$ packed form
1941.7G71244824K00093J74820J80483K59459L95775M36783L23713J68085J59740K82228
1962.1G73826003L62456L33965K50637J49250J20700K38955L46482K86698J21474K7359
1982.5G76063979P2360J76966K18034J50859K0027m9829P510J21653J61886L9995j62363
2005G76821077l04699k84314j83642j88053l38673n10633o01769o13391o26207o21915
2025.4G72547781m67717l72648m54665m75764m01914m06742n00381n21839m46260l33845
2045.8G68166006k44379k24889k29239j89424j00016K0980R7812Q1181N0724O9141
2066.2G67497897J17541J37805J16885Q3387N8115L9160O5148J23322J36912J24096
2086.6G68500268J22905J50979J86145J96159K05815K47836K57969K13802K02715K20716
$$ plain form
2106.9 770505309 770735323 770952880 771134913 771246910 771293998 771369815 771507859 771616995 771664739 771682322
2127.3 771682322 771671951 771674514 771731496 771827459 771897674 771916807 771955669 772062778 772194088 772300780 772386730
2149.8 772386730 772468567 772583783 772795618 773104906 773450971 773807287 774167180 774561405 775071859 775734723
2170.2 775734723 776457787 777105749 777678013 778276443 778976321 779749155 780481756 781078219 781576514 782107651
2190.6 782107651 782725155 783381939 783999145 784531116 785003662 785501659 786082029 786708832 787301242 787832141
2211 787832141 788350463 788909614 789507449 790078163 790553510 790946782 791358113 791828930 792312026 792759895
2231.4 792759895 793137133 793453693 793767452 794119298 794483006 794826388 795144260 795418978 795664310 795962036
2251.8 795962036 796310961 796626508 796907604 797181427 797466636 797794998 798164189 798529804 798852205 799129009
$$ packed form
2106.9G70505309K30014K17557J82033J11997M7088P5817J38044J09136M7744J7583
2127.3G71682322j0371K563N6982R5963P0215J9133L8862J07109J31310J06692Q5950
2149.8G72386730Q1837J15216K11835L09288L46065L56316L59893L94225N10454O62864
2170.2G75734723P23064O47962N72264N98430O99878P72834P32601N96463M98295N31137
2190.6G82107651O17504O56784O17206N31971M72546M97997N80370O26803N92410N30899
2211G87832141N18322N59151N97835N70714M75347L93272M11331M70817M83096M47869
2231.4G92759895L77238L16560L13759L51846L63708L43382L17872K74718K45332K97726
2251.8G95962036L48925L15547K81096K73823K85209L28362L69191L65615L22401K76804
$$ plain form
2272.2 799129009 799375176 799621224 799894810 800174713 800426543 800684392 801012933 801392853 801696777 801894248
2292.5 801894248 802085876 802275300 802423477 802584708 802838147 803168833 803484857 803747833 804021716 804323375
2312.9 804323375 804620385 804929137 805231094 805517733 805784047 806040823 806339085 806619644 806710422 806568682
2333.3 806568682 806366861 806234121 806147397 805965841 805529356 804703236 803906977 803780019 804369211 805231988
2353.7 805231988 805915833 806284010 806287229 805992365 805468023 804667711 803625047 802511692 801504493
2372.1 801504493 800663352 799926937 799212396 798498213 797834158 797328591 797019005 796809793 796580970 796256959
2392.5 796256959 795866966 795523643 795276403 795038104 794694602 794226348 793708444 793236494 792810738 792349041
2412.9 792349041 791789293 791127264 790437937 789784491 789139092 788474977 787784696 787043393 786259949 785484970
$$ packed form
2272.2G99129009K46167K46048K73586K79903K51830K57849L28541L79920L03924J97471
2292.5H01894248J91628J89424J48177J61231K53439L30686L16024K62976K73883L01659
2312.9H04323375K97010L08752L01957K86639K66314K56776K98262K80559R0778j41740
2333.3H06568682k01821j32740q6724j81556m36485q26120p96259j26958N89192Q62777
2353.7H05231988O83845L68177L219k94864n24342q00312j042664j113355j007199
2372.1H01504493q41141p36415p14541p14183o64055n05567l09586k09212k28823l24011
2392.5G96256959l89993l43323k47240k38299l43502m68254n17904m71950m25756m61697
2412.9G92349041n59748o62029o89327o53446o45399o64115o90281p41303p83444p74979
$$ plain form
2433.3 785484970 784736216 783965886 783111751 782187700 781291008 780495584 779751420 778963268 778108895 777214050
2453.7 777214050 776355267 775599241 774917305 774212837 773419738 772592306 771827340 771153092 770520389 769847274
2474.1 769847274 769099474 768338084 767660677 767090738 766532600 765921950 765292943 764675498 764134288 763698757
2494.5 763698757 763284206 762836933 762372255 761897385 761438787 761046410 760696471 760302901 759837568 759347379
2514.9 759347379 758859277 758343875 757771373 757152915 756494284 755806506 755114019 754388094 753598094 752751589
2535.3 752751589 751880884 751005292 750117183 749248147 748427033 747597873 746704042 745792449 744929910 744102538
2555.6 744102538 743265748 742390692 741493523 740628719 739808083 739009857 738207042 737363040 736481011 735618949
2576 735618949 734819174 734068573 733343184 732630372 731910229 731159687 730426252 729812264 729300022 728761256
$$ packed form
2433.3G85484970p48754p70330q54135r24051q96692p95424p44164p88152q54373q94845
2453.7G77214050q58783p56026o81936p04468p93099q27432p64966o74248o32703o73115
2474.1G69847274p47800p61390o77407n69939n58138o10650o29007o17445n41210m35531
2494.5G63698757m14551m47273m64678m74870m58598l92377l49939l93570m65333m90189
2514.9G59347379m88102n15402n72502o18458o58631o87778o92487p25925p90000q46505
2535.3G52751589q70705q75592q88109q69036q21114q29160q93831r11593q62539q27372
2555.6G44102538q36790q75056q97169q64804q20636p98226q02815q44002q82029q62062
2576G35618949p99775p50601p25389p12812p20143p50542p33435o13988n12242n38766
$$ plain form
2596.4 728761256 728136957 727487624 726876318 726277769 725645304 724918604 724027753 723014474 721991003
2614.8 721991003 720981538 719897330 718668461 717334569 715970516 714612722 713231921 711760402
2631.1 711760402 710180163 708526313 706864238 705273092 703744829 702190340 700580239 698968470
2647.4 698968470 697415173 695923746 694439471 692913532 691361487 689839661 688359678 686906338
2663.7 686906338 685488820 684092581 682676315 681277156 679966748 678741753 677552998 676332593
2680.1 676332593 675069094 673857212 672702014 671505749 670282900 669060707 667783439 666442096
2696.4 666442096 665062487 663658917 662230968 660741031 659178317 657616496 656140745 654750228
2712.7 654750228 653367937 651958108 650534689 649135470 647826314 646618247 645485818 644365728
$$ packed form
2596.4G28761256o24299o49333o11306n98549o32465p26700q90851j013279j023471
2614.8G21991003j009465j084208j228869j333892j364053j357794j380801j471519
2631.1G11760402j580239j653850j662075j591146j528263j554489j610101j611769
2647.4F98968470j553297j491427j484275j525939j552045j521826j479983j453340
2663.7F86906338j417518j396239j416266j399159j310408j224995j188755j220405
2680.1F76332593j263499j211882j155198j196265j222849j222193j277268j341343
2696.4F66442096j379609j403570j427949j489937j562714j561821j475751j390517
2712.7F54750228j382291j409829j423419j399219j309156j208067j132429j120090
$$ plain form
2729 644365728 643186271 642005920 640944362 640006900 639079511 638088703 637055635 636024594 635040820
2747.4 635040820 634112537 633200884 632284224 631407201 630615413 629865766 629119217 628353179 627539098 626706421
2767.8 626706421 625873268 625020206 624106228 623079538 621929109 620705009 619470119 618215203 616869688
2786.1 616869688 615374506 613740861 612037480 610321045 608554363 606657505 604631007 602494001
2802.4 602494001 600239158 597921491 595598519 593206108 590672016 588028133 585331738 582579911
2818.8 582579911 579724789 576739609 573632181 570433021 567182004 563861310 560429156 556870818
2835.1 556870818 553116679 549118280 544903696 540454388 535713136 530703127 525657713 520960450
2851.4 520960450 516848505 513262928 509956241 506623626 502955735 498748302 493950695 488569945
$$ packed form
2729F44365728j179457j180351j061558r37462r27389r90808j033068j031041r83774
2747.4F35040820r28283r11653r16660q77023p91788p49647p46549p66038q14081q32677
2767.8F26706421q33153q53062r13978j026690j150429j224100j234890j254916j345515
2786.1F16869688j495182j633645j703381j716435j766682j896858k026498k137006
2802.4F02494001k254843k317667k322972k392411k534092k643883k696395k751827
2818.8E82579911k855122k985180l107428l199160l251017l320694l432154l558338
2835.1E56870818l754139l998399m214584m449308m741252n010009n045414m697263
2851.4E20960450m111945l585577l306687l332615l667891m207433m797607n380750
$$ plain form
2867.7 488569945 482672244 476407558 469949722 463486254 457270086 451583743 446609318 442426950
2884 442426950 439102918 436623424 434856057 433636755 432750612 431961715 431146026 430248618 429170251
2902.4 429170251 427808195 426088184 423920274 421216667 417890429 413934022 409582108 405156583
2918.7 405156583 400880188 396979868 393710017 391301185 389914602 389642060 390603006 392886430 396451056
2937 396451056 401139647 406694084 412817895 419269353 425904304 432678133 439553440 446470171 453348249
2955.4 453348249 460149676 466906458 473510176 479747921 485522270 490865141 495857447 500601828
2971.7 500601828 505221069 509782612 514271140 518599212 522636592 526321650 529683411 532738328
2988 532738328 535461187 537794828 539684653 541193128 542416215 543313205 543772042 543769181 543385506
$$ packed form
2867.7D88569945n897701o264686o457836o463468o216168n686343m974425m182368
2884D42426950l324032k479494j767367j219302q86143p88897q15689q97408j078367
2902.4D29170251j362056j720011k167910k703607l326238l956407m351914m425525
2918.7D05156583m276395l900320l269851k408832j386583k72542R60946K283424L564626
2937C96451056M688591N554437O123811O451458O634951O773829O875307O916731O878078
2955.4D53348249O801427O756782O603718O237745N774349N342871M992306M744381
2971.7E00601828M619241M561543M488528M328072M037380L685058L361761L054917
2988E32738328K722859K333641J889825J508475J223087Q96990M58837k861l83675
$$ plain form
3006.4 543385506 542717397 541818380 540662885 539164901 537290812 535146475 532851934 530414820 527822971
3024.7 527822971 525111854 522308648 519411862 516459107 513440967 510321558 507167578 503985882
3041.1 503985882 500703871 497301161 493830889 490405798 487045825 483648360 480174482 476660937
3057.4 476660937 473176211 469795436 466475755 463110983 459656596 456134319 452634424 449260503
3073.7 449260503 446023554 442805052 439475328 436065286 432698727 429378390 426053941 422725797
3090 422725797 419363707 415982157 412707508 409605145 406509221 403278381 400056630 396992087 394016385
3108.4 394016385 390996844 387982368 385082394 382232487 379326224 376291037 373138398 370044917
3124.7 370044917 367144495 364363432 361568749 358744174 356009543 353423148 350844383 348130077
$$ packed form
3006.4E43385506o68109q99017j155495j497984j874089k144337k294541k437114k591849
3024.7E27822971k711117k803206k896786k952755l018140l119409l153980l181696
3041.1E03985882l282011l402710l470272l425091l359973l397465l473878l513545
3057.4D76660937l484726l380775l319681l364772l454387l522277l499895l373921
3073.7D49260503l236949l218502l329724l410042l366559l320337l324449l328144
3090D22725797l362090l381550l274649l102363l095924l230840l221751l064543k975702
3108.4C94016385l019541l014476k899974k849907k906263l035187l152639l093481
3124.7C70044917k900422k781063k794683k824575k734631k586395k578765k714306
$$ plain form
3141 348130077 345374018 342735410 340199649 337773263 335470498 333116859 330626994 328131735 325695604
3159.4 325695604 323332846 321054518 318823755 316647619 314504117 312335670 310175717 308121860
3175.7 308121860 306167573 304223150 302265137 300323576 298442870 296643466 294885904 293107718
3192 293107718 291303158 289526016 287808001 286153466 284576237 283065110 281566828 280026138 278481424
3210.3 278481424 277016699 275626719 274256587 272849351 271429837 270080894 268808365 267584622
3226.7 267584622 266404331 265288472 264219671 263074934 261831999 260611564 259451956 258354366
3243 258354366 257356316 256388366 255355626 254338712 253409028 252520263 251627058 250711560 249803111 248955280
3263.4 248955280 248201087 247546464 246941328 246218488 245346248 244500309 243723691 242980376 242239535 241486564
$$ packed form
3141C48130077k756059k638608k535761k426386k302765k353639k489865k495259k436131
3159.4C25695604k362758k278328k230763k176136k143502k168447k159953k053857
3175.7C08121860j954287j944423j958013j941561j880706j799404j757562j778186
3192B93107718j804560j777142j718015j654535j577229j511127j498282j540690j544714
3210.3B78481424j464725j389980j370132j407236j419514j348943j272529j223743
3226.7B67584622j180291j115859j068801j144737j242935j220435j159608j097590
3243B58354366r98050r67950j032740j016914r29684q88765q93205r15498r08449q47831
3263.4B48955280p54193o54623o05136p22840q72240q45939p76618p43315p40841p52971
$$ plain form
3283.8 241486564 240795031 240187392 239619583 239024565 238345578 237610117 236870065 236195579 235675678 235242203
3304.2 235242203 234666541 233843789 232872918 231938854 231148228 230406597 229654476 228954494 228295609 227612823
3324.6 227612823 226834670 225979120 225153759 224381968 223670036 223030776 222354144 221551016 220688283 219834566
3345 219834566 219086975 218476206 217769876 216854334 215902895 215074986 214392200 213754863 213120207 212588534
3365.4 212588534 212072402 211334676 210380375 209431753 208668068 208076179 207537800 206950173 206357613 205893740
3385.7 205893740 205635771 205545425 205315098 204754144 204203427 204014197 203991503 203664303 203027785 202539310
3406.1 202539310 202327758 202185318 202005044 201736093 201427117 201257169 201186284 201089635 201086193 201265767
3426.5 201265767 201535046 201753601 202008724 202363238 202508479 202344641 202227861 202410817 202819616 203213438
$$ packed form
3283.8B41486564o91533o07639n67809n95018o78987p35461p40052o74486n19901m33475
3304.2B35242203n75662q22752r70871r34064p90626p41631p52121o99982o58885o82786
3324.6B27612823p78153q55550q25361p71791p11932o39260o76632q03128q62733q53717
3345B19834566p47591o10769p06330r15542r51439q27909o82786o37337o34656n31673
3365.4B12588534n16132p37726r54301r48622p63685n91889n38379n87627n92560m63873
3385.7B05893740k57969r0346k30327n60954n50717j89230k2694l27200o36518m88475
3406.1B02539310k11552j42440j80274k68951l08976j69948p0885r6649l442J79574
3426.5B01265767K69279K18555K55123L54514J45241j63838j16780J82956M08799L93822
$$ plain form
3446.9 203213438 203468129 203747496 204172105 204711899 205361322 206073821 206648186 207179770 208021417 209022373
3467.3 209022373 209698513 209970042 210239813 210788384 211624920 212486014 213069692 213645637 214515179 215373352
3487.7 215373352 216038674 216809168 217763141 218718499 219632864 220572799 221446350 222120926 222750843 223533854
3508.1 223533854 224524319 225709856 226849079 227765054 228640392 229688376 230887771 231918082 232686996
3526.5 232686996 233513653 234637111 235983521 237335354 238542408 239718094 241153598 242764011
3542.8 242764011 244174987 245283723 246500194 247973800 249494582 251115084 252929032 254880339
3559.1 254880339 256867290 258791447 260633111 262648076 265096664 267733008 270272255 272812724
3575.4 272812724 275538236 278503478 281667382 284860373 287808955 290564865 293761671 297317296
$$ packed form
3446.9B03213438K54691K79367M24609N39794O49423P12499N74365N31584Q41647J000956
3467.3B09022373O76140K71529K69771N48571Q36536Q61094N83678N75945Q69542Q58173
3487.7B15373352O65322P70494R53973R55358R14365R39935Q73551O74576O29917P83011
3508.1B23533854R90465J185537J139223R15975Q75338J047984J199395J030311P68914
3526.5B32686996Q26657J123458J346410J351833J207054J175686J435504J610413
3542.8B42764011J410976J108736J216471J473606J520782J620502J813948J951307
3559.1B54880339J986951J924157J841664K014965K448588K636344K539247K540469
3575.4B72812724K725512K965242L163904L192991K948582K755910L196806L555625
$$ plain form
3591.7 297317296 300816476 304365426 308088005 311802685 315528750 319350600 323113471 326896876
3608.1 326896876 330863714 334960133 339162260 343351811 347508073 351931006 356428802 360710412
3624.4 360710412 364716649 368679196 373178601 377863288 382418215 386879563 391276032 395688057
3640.7 395688057 400151610 404546320 408751696 412990272 417578101 422181427 426552743 431060493
3657 431060493 435728401 440088719 444133550 448169202 452040732 455547363 459261805 463081449 466468424
3675.4 466468424 470041662 473929018 477688193 481305033 484794229 488000035 490709096 493381888
3691.7 493381888 496351272 499335289 502148092 504670501 506919742 509294569 511875629 514246762
3708 514246762 516098142 517787874 520089447 522623658 524867237 526844382 528666258 530358195 532083392
$$ packed form
3591.7B97317296L499180L548950L722579L714680L726065L821850L762871L783405
3608.1C26896876L966838M096419M202127M189551M156262M422933M497796M281610
3624.4C60710412M006237L962547M499405M684687M554927M461348M396469M412025
3640.7C95688057M463553M394710M205376M238576M587829M603326M371316M507750
3657D31060493M667908M360318M044831M035652L871530L506631L714442L819644L386975
3675.4D66468424L573238L887356L759175L616840L489196L205806K709061K672792
3691.7D93381888K969384K984017K812803K522409K249241K374827K581060K371133
3708E14246762J851380J689732K301573K534211K243579J977145J821876J691937J725197
$$ plain form
3726.4 532083392 534107685 536115110 537719429 539014697 540476918 542400956 544420958 545701087
3742.7 545701087 546280146 547627985 549195707 550161183 551564574 553592145 555353343 556587875 557894588
3761 557894588 559496641 560962677 562196434 563242018 564383447 565903306 567505181 568857849 569850624
3779.4 569850624 570859432 572012663 573098779 574197710 575385690 576647818 577807605 578723013
3795.7 578723013 579705536 580546916 581024349 582042217 583176374 584033012 585250556 586633265 587595582
3814.1 587595582 588161588 589020431 589711010 590242922 591390014 592532456 593450546 594361603 595328748
3832.4 595328748 596416533 597104967 597217619 597654641 598612905 599712729 600819647 601898372 602591872
3850.8 602591872 602163434 601924300 603233755 604678273 605547905 605968118 606437385 607165277 607649863
$$ packed form
3726.4E32083392K024293K007425J604319J295268J462221J924038K020002J280129
3742.7E45701087N79059J347839J567722R65476J403391K027571J761198J234532J306713
3761E57894588J602053J466036J233757J045584J141429J519859J601875J352668R92775
3779.4E69850624J008808J153231J086116J098931J187980J262128J159787R15408
3795.7E78723013R82523Q41380M77433J017868J134157Q56638J217544J382709R62317
3814.1E87595582N66006Q58843O90579N31912J147092J142442R18090R11057R67145
3832.4E95328748J087785O88434J12652M37022R58264J099824J106918J078725O93500
3850.8F02591872m28438k39134J309455J444518Q69632M20213M69267P27892M84586
$$ plain form
3869.1 607649863 608056426 608761013 609607935 610523462 611129045 611651361 612389565 612836719 613357723 614006221
3889.5 614006221 614268184 614716232 615599930 616261899 616470993 616503954 616627336 617186129 618062019 618767142
3909.9 618767142 619263470 619654417 619823813 619951069 620340943 620778382 621047616 621402383 621886969 622188747
3930.3 622188747 622398078 622789562 623287201 623763800 624090433 624211907 624418318 624749243 625017464 625361145
3950.7 625361145 625797629 626175165 626498938 626820624 627067804 627273917 627591133 627950191 628248274 628492892
3971.1 628492892 628707469 628941596 629238546 629565358 629860222 630091071 630298436 630532444 630793095 631065071
3991.5 631065071 631296992 631494999 631754279
3997.6 631754279
$$ packed form
3869.1F07649863M06563P04587Q46922R15527O05583N22316P38204M47154N21004O48498
3889.5F14006221K61963M48048Q83698O61969K09094L2961J23382N58793Q75890P05123
3909.9F18767142M96328L90947J69396J27256L89874M37439K69234L54767M84586L01778
3930.3F22188747K09331L91484M97639M76599L26633J21474K06411L30925K68221L43681
3950.7F25361145M36484L77536L23773L21686K47180K06113L17216L59058K98083K44618
3971.1F28492892K14577K34127K96950L26812K94864K30849K07365K34008K60651K71976
3991.5F31065071K31921J98007K59280
3997.6F31754279
##END=$$ End of the data block
