##TITLE=$$ Begin of the data block
##JCAMP-DX=5.00 $$ ACD/SpecManager v 10.08
##SPECTROMETER/DATA SYSTEM=Alpha
##DATE=29 Dec 2014 15:06:02
##DATA TYPE=INFRARED SPECTRUM
##DATA CLASS=XYDATA
##ORIGIN=
##OWNER=
##NPOINTS=1765
##FIRSTX=399.76428223
##LASTX=3997.64306641
##MAXX=3997.64306641
##MINX=399.76428223
##MAXY=0.80817783
##MINY=0.13322218
##XFACTOR=1.0000000000
##YFACTOR=1.000000000000000e-9
##FIRSTY=0.42835054
##DELTAX=2.03961372
##XUNITS=1/CM
##YUNITS=ARBITRARY UNITS
##XYDATA=(X++(Y..Y))
399.8D28350538n374551m059344l243059j799792L65972K315045L104537K480060M28736
418.1D22568142k034187k292871k187163k764493l247380l720612l870100l203779
434.4C99247557j802921J88231K268970M117400N291372N309224M437596L070324J479984
452.8D23607737N1588p71106j279205j769006k308488l074020l865480l822983l114938
471.2D03654099k899677l090620l107190k569169j262933P8052M27664j84447p86960
489.5C90258819q85815q83609j303255j930595k469211k974719l061772k731323k823979
507.9C71194541l545045m311949m593492m661381m714012m356355l739416k955169
524.2C38317722j812875m95792O02752J503080K435118L654629N307019O514967O134420
$$ y = [428350538, 422975987, 418916643, 415673584, 413873792, 414239764, 416554809, 419659346, 422139406, 422568142, 420533955, 418241084, 416053921, 413289428, 410042048, 406321436, 402451336, 399247557, 397444636, 397632867, 399901837, 404019237, 409310609, 414619833, 419057429, 422127753, 423607737, 423659325, 422888219, 421609014, 419840008, 417531520, 414457500, 410592020, 406769037, 403654099, 400754422, 397663802, 394556612, 391987443, 390724510, 390802562, 391230226, 391045779, 390258819, 389373004, 388489395, 387186140, 385255545, 382786334, 379811615, 376749843, 374018520, 371194541, 367649496, 363337547, 358744055, 354082674, 349368662, 345012307, 341272891, 338317722, 336504847, 336009055, 336611807, 338114887, 340550005, 344204634, 349511653, 356026620, 362161040]
542.5C62161040M307717J936257l8653j091302j679212k417534l315568m301191n135357
560.9C50426197n710363o277085o926417p308692o536662m222811j070410K062559
577.2C14436316M637361O519288P670790P855147P088870N708158M102289K364308
593.5C60382527P27177k60502l39002P6384J86830j12354j27852N10871J425386K201885
613.9C64671350K759277L136039L467083L972143M481584M589677M181266L308683
630.2C94567102K397657K085328K263158K262414J919061J327842Q56668J063943J700759
648.6D10443932J948982J546413R46850O71416R08226J402587J678258J520335J321137
667D22388136J134158J239627J937121K435476K079427J384825J224011J574099J825690
$$ y = [362161040, 366468757, 368405014, 368366361, 367275059, 365595847, 363178313, 359862745, 355561554, 350426197, 344715834, 338438749, 331512332, 324203640, 317666978, 313444167, 312373757, 314436316, 319073677, 325592965, 333263755, 341118902, 348207772, 353915930, 358018219, 360382527, 361109704, 360849202, 360510200, 360586584, 360773414, 360661060, 360533208, 361044079, 362469465, 364671350, 367430627, 370566666, 374033749, 378005892, 382487476, 387077153, 391258419, 394567102, 396964759, 399050087, 401313245, 403575659, 405494720, 406822562, 407679230, 408743173, 410443932, 412392914, 413939327, 414886177, 415557593, 416465819, 417868406, 419546664, 421066999, 422388136, 423522294, 424761921, 426699042, 429134518, 431213945, 432598770, 433822781, 435396880, 437222570]
685.3D37222570J502305N56261m53174j138002j571655k103597k959162l793508l950924
703.7D23311114l087997j423568M54277K004624L046929L940016N120933O542922P534354
722D47443604P570386O999910O307513N819678N587578N131632M041821K568036J311034
740.4D92781192M31746m19408j699626l402561n073935o118834o220043n692154n093604
758.7D59492773m550725l648937j900256P94888L997445O933510Q896470R882063J0476857
777.1D90374088J0826290J0545194R386242P529318N692661M703045M696011N188108
793.4E48940957N458414N247712M948139M879892M954875M787743L911972K447546
809.7E85577250J332044J079440J350165J362681M52936j159191k567351l328979l854156
$$ y = [437222570, 438724875, 439281136, 438827962, 437689960, 436118305, 434014708, 431055546, 427262038, 423311114, 420223117, 418799549, 419253826, 421258450, 424305379, 428245395, 433366328, 439909250, 447443604, 455013990, 462013900, 468321413, 474141091, 479728669, 484860301, 488902122, 491470158, 492781192, 493212938, 492793530, 491093904, 487691343, 482617408, 476498574, 470278531, 464586377, 459492773, 454942048, 451293111, 449392855, 450187743, 454185188, 461118698, 470015168, 479897231, 490374088, 501200378, 511745572, 521131814, 528661132, 534353793, 539056838, 543752849, 548940957, 554399371, 559647083, 564595222, 569475114, 574429989, 579217732, 583129704, 585577250, 586909294, 587988734, 589338899, 590701580, 591154516, 589995325, 587427974, 584098995, 580244839]
828.1E80244839m755378o118953p358432p854879p345676o242692n380035n133748
844.4E30055046n190670n140126m918873m821659n279541o067872n915522l188044
860.7D89532739K364635Q524269J2843669J4899313J5187562J3974249J1567652Q210004
877E77104092M028082m94838m417539o945252q022845q205652q150578q137345p905960
895.4E28852165p261038o509185o230056o885410q308112r796828j0824621j1439502
911.7D61597413j1960536j2322665j1983692j0417551p652342m458458j906305m87328
928D00408536L20494J281917K612204M077315N275697N871623N545915L744572J96844
946.4D29335117m442304r124398j3058633j5782058j7262131j7905116j8289298j8759370
$$ y = [580244839, 575489461, 569370508, 562012076, 554157197, 546811521, 540568829, 535188794, 530055046, 524864376, 519724250, 514805377, 509983718, 504704177, 498636305, 492720783, 489532739, 491897374, 500421643, 513265312, 528164625, 543352187, 557326436, 568894088, 577104092, 581132174, 580637336, 576219797, 569274545, 561251700, 553046048, 544895470, 536758125, 528852165, 521591127, 515081942, 508851886, 501966476, 493658364, 483861536, 473036915, 461597413, 449636877, 437314212, 425330520, 414912969, 407260627, 402802169, 400895864, 400408536, 400729030, 402010947, 404623151, 408700466, 413976163, 419847786, 425393701, 429138273, 429335117, 424892813, 415768415, 402709782, 386927724, 369665593, 351760477, 333471179, 314711809]
962.7C14711809j9243270j9502491j9400686j9004553j8397540j7475128j6104147
977A85583994j4264807j2026295r542391p017136m702538k847910j490593m70146L50356
995.3A33572534R39190J209110J199454J013011O75663K78414n4285k37957j54689
1013.7A38440445J87159O92412J250192J822025K365381K781584L008977L031358K919987
1032A56499520K652124K114668J389757P79316M72888N14582Q47116J358896K067462
1050.4A68696329L072187M300267N509168O659075P816613Q876249R206623P486612
1066.7B21623123K733051l805413q719504r588927p127166l663033p03648J444116
1083A92192599K921716L900125M571274N143225N611822N647719M876942L397718J799196
$$ y = [314711809, 295468539, 275966048, 256565362, 237560809, 219163269, 201688141, 185583994, 171319187, 159292892, 149750501, 142733365, 138030827, 135182917, 133692324, 133222178, 133572534, 134511724, 135720834, 136920288, 137933299, 138608962, 138887376, 138833091, 138595134, 138440445, 138627604, 139320016, 140570208, 142392233, 144757614, 147539198, 150548175, 153579533, 156499520, 159151644, 161266312, 162656069, 163435385, 163908273, 164422855, 165269971, 166628867, 168696329, 171768516, 176068783, 181577951, 188237026, 196053639, 204929888, 214136511, 221623123, 224356174, 220550761, 211831257, 202242330, 195115164, 191452131, 190748483, 192192599, 195114315, 199014440, 203585714, 208728939, 214340761, 219988480, 224865422, 228263140, 230062336]
1101.4B30062336P84307Q05527J737833K909497L712073L971651L790140L345058K766728
1119.8B53885150K135426J679867J868755K885193M208594M853219M038334J723438
1136.1B77277976j417070m411489o529153p589280p804439p354691o341547m900783
1152.4B30929524l275499j740783m00559Q43347K235353L988415O086215Q230224J0123849
1170.7B57020086J1653006J2838811J3768762J4489770J4849454J4599294J3739586
1185C52958769J2465387J0922998R164602P220089N192817L399461K268881K001315
1201.3D05594319K336979K849698L365845L973603M808605N734533O335765O147414
1217.7D41146761N012185L330797J709252M85480l52562j043587j749546k275228k316296
$$ y = [230062336, 230846643, 231652170, 233390003, 236299500, 240011573, 243983224, 247773364, 251118422, 253885150, 256020576, 257700443, 259569198, 262454391, 266662985, 271516204, 275554538, 277277976, 275860906, 271449417, 264920264, 257330984, 249526545, 242171854, 235830307, 230929524, 227654025, 225913242, 225512683, 226356030, 228591383, 232579798, 238666013, 246896237, 257020086, 268673092, 281511903, 295280665, 309770435, 324619889, 339219183, 352958769, 365424156, 376347154, 385511756, 392731845, 397924662, 401324123, 403593004, 405594319, 407931298, 410780996, 414146841, 418120444, 422929049, 428663582, 434999347, 441146761, 446158946, 449489743, 451198995, 451684475, 451331913, 450288326, 448538780, 446263552, 443947256]
1236D43947256j872361j258314p04497j46150N59896J401841K210886K754181K769202
1254.4D49661940K221585J493364J105517J253188J733214K247482K529860K442896
1270.7D64689046K077460J586169R56625J40220o79940j157045j126856q25435o99430
1289D64960814r98945j624256k240777k517730k409965k181142k156705k417207k623081
1307.4D45791006k349526j728177j275479j264453j632959k075225k451658l097684
1323.7D29915845m246324n585521o476373o447226n518645m118830k729684j611858
1340C93181384p51228r2536L87848N77986L15845k68370q81106j225501j231641j104027
1360.4C88908654j070559j040905q99732o32912j9968P68632J299977J284182J037568
$$ y = [443947256, 442074895, 440816581, 440112084, 439965934, 440525830, 441927671, 444138557, 446892738, 449661940, 451883525, 453376889, 454482406, 455735594, 457468808, 459716290, 462246150, 464689046, 466766506, 468352675, 469309300, 469449520, 468769580, 467612535, 466485679, 465660244, 464960814, 463961869, 462337613, 460096836, 457579106, 455169141, 452987999, 450831294, 448414087, 445791006, 443441480, 441713303, 440437824, 439173371, 437540412, 435465187, 433013529, 429915845, 425669521, 420084000, 413607627, 407160401, 401641756, 397522926, 394793242, 393181384, 392430156, 392337620, 392725468, 393303454, 393619299, 393350929, 392469823, 391244322, 390012681, 388908654, 387838095, 386797190, 385897458, 385264546, 385244578, 386013210, 387313187, 388597369, 389634937]
1378.8C89634937J072347J724899K955824M326433M598647L502131K325982J293629
1395.1D11434829K66344o94842j340776j750559k157420k131074j956374k064437k075105
1413.5C97530586j756728j445741j050204k16454M37886O93321R00060J273185J748621
1431.8C98114532K075881K325892K306939J958221J912862J857757J455784N44727
1448.1D12552595n72264j263917j512199k139926k363950o60241P53939K114386L863036
1466.5D10771459N396456P541746J0982424J1870831J0308623R512008R408533R226829
1482.8D85018909Q251607P519901P494271P289767O107629N589544N770326N014420
1499.1E38056374M028856L607333M097939M988074L703296K560139K482235K770365
$$ y = [389634937, 390707284, 392432183, 395388007, 399714440, 404313087, 407815218, 410141200, 411434829, 411701173, 411006331, 409665555, 407914996, 405757576, 403626502, 401670128, 399605691, 397530586, 395773858, 394328117, 393277913, 393061459, 393499345, 394192666, 395092726, 396365911, 398114532, 400190413, 402516305, 404823244, 406781465, 408694327, 410552084, 412007868, 412552595, 411980331, 410716414, 409204215, 407064289, 404700339, 404040098, 404794037, 406908423, 410771459, 416167915, 423709661, 434692085, 446562916, 456871539, 466383547, 475792080, 485018909, 493270516, 500790417, 508284688, 515574455, 521682084, 527271628, 533041954, 538056374, 542085230, 545692563, 549790502, 554778576, 558481872, 561042011, 563524246, 566294611]
1515.4E66294611L179550L070414K774536K278209J988947K188623K188445K000153
1531.8E85963488J590073J168787J144767J332998J076341O99937M21048J98185J39117
1550.1E93734741K74658L83079K14577o84023j737356q82864n11527o54280j097143
1568.5E89039862j728356j517653j332462j801848j685679j478196j865863k136052
1584.8E75493753k117455k013862k096474k371729k754569l002405l002882l025591
1601.1E55108786l229380l594041m039526m465997m398346l962100m413545n545556
1617.4E21460295m544676l726124m287482m071355l666460l593683k898902k390176
1633.7D92281437k674282j939922p67201k79099O3926N12779J215159J725615K383381
$$ y = [566294611, 569474161, 572544575, 575319111, 577597320, 579586267, 581774890, 583963335, 585963488, 587553561, 588722348, 589867115, 591200113, 592276454, 592976391, 593397439, 593595624, 593734741, 594009399, 594392478, 594607055, 593923032, 592185676, 591302812, 590791285, 590137005, 589039862, 587311506, 585793853, 584461391, 582659543, 580973864, 579495668, 577629805, 575493753, 573376298, 571362436, 569265962, 566894233, 564139664, 561137259, 558134377, 555108786, 551879406, 548285365, 544245839, 539779842, 535381496, 531419396, 527005851, 521460295, 516915619, 513189495, 508902013, 504830658, 501164198, 497570515, 494671613, 492281437, 489607155, 487667233, 486900032, 486620933, 486684859, 487197638, 488412797, 490138412, 492521793]
1652.1D92521793L208369K893805L008962L755689M693686N018771M527509M914284
1668.4E24542868N838692N673051O123781O668866N927980N513012O353260Q169472
1684.7E74810982P072866N722403N687535N119383N293429N561352N013466M789829
1701.1F19071245L592909K898514L008306K943158K903402K846300K852977L193974
1717.4F43310785L213406K933085K979040L003538K755105K646983K691090L128290
1733.7F66661322L123105K478003K430380K643227K890051L183007L355145L443718
1750F90207958L360331L072799L133296L257216K985894K692700K289295K092480K177120
1768.4G15269089K176702K057910J722276J389623J408159J619816J677036J500607
$$ y = [492521793, 495730162, 498623967, 501632929, 505388618, 510082304, 515101075, 519628584, 524542868, 530381560, 536054611, 542178392, 548847258, 554775238, 560288250, 566641510, 574810982, 581883848, 587606251, 593293786, 598413169, 603706598, 609267950, 614281416, 619071245, 622664154, 625562668, 628570974, 631514132, 634417534, 637263834, 640116811, 643310785, 646524191, 649457276, 652436316, 655439854, 658194959, 660841942, 663533032, 666661322, 669784427, 672262430, 674692810, 677336037, 680226088, 683409095, 686764240, 690207958, 693568289, 696641088, 699774384, 703031600, 706017494, 708710194, 710999489, 713091969, 715269089, 717445791, 719503701, 721225977, 722615600, 724023759, 725643575, 727320611, 728821218]
1784.7G28821218J245320J119673J216233J475155J492262J278460J066268J010358
1801G38724947J156449J294434J273036J087487R16779Q84593R90808J113653J107693
1819.4G48549879R25719P40469P06851Q02100Q99732Q45850O88135N63622N41925N83887
1839.8G55848169N98371N21601M19914L81053L75509M06861M34161M01258L00765K59638
1860.2G59947300L00169L64125L77953L32594L55839M23849M27008M41968N22673N23925
1880.5G64017403M88222N05090N16831N06342M99606M66168L79801L07619K92540L21329
1900.9G68300951L18944K82109K15232J27673J05202J58489K20180K66790K88785K10881
1921.3G70495236J41442K07484L06785L07440K04564P5161N3465J81616K91764K75791
$$ y = [728821218, 730066538, 731186211, 732402444, 733877599, 735369861, 736648321, 737714589, 738724947, 739881396, 741175830, 742448866, 743536353, 744453132, 745337725, 746328533, 747442186, 748549879, 749475598, 750216067, 750922918, 751725018, 752624750, 753470600, 754158735, 754722357, 755264282, 755848169, 756446540, 756968141, 757388055, 757769108, 758144617, 758551478, 758985639, 759386897, 759687662, 759947300, 760247469, 760611594, 760989547, 761322141, 761677980, 762101829, 762528837, 762970805, 763493478, 764017403, 764505625, 765010715, 765527546, 766033888, 766533494, 766999662, 767379463, 767687082, 767979622, 768300951, 768619895, 768902004, 769117236, 769244909, 769350111, 769508600, 769728780, 769995570, 770284355, 770495236, 770636678, 770844162, 771150947, 771458387, 771662951, 771738112, 771791577, 771973193, 772264957, 772540748]
1941.7G72540748J81317J32919J61648K63273L88146M28617L34620J92046J87219K91705
1962.1G75102258L70800L55065K44200J17004TK64645L51012K64287J06334L2485P4625
1984.6G77399719J75535K34187J67489J1981p1407P689J28329J37866N483j71303k81930
2007G77743638k66850j91331j94371l38852n16534n93543n83411o05523o22928m76480
2027.4G73353815l81827m50313m53949m07517m49300n28336n15699m31657l29375k39670
2047.8G69166172k06769k06172j64628p1824K6226Q6069R2149P4386O4970Q8572J24514
2070.2G69073665J35362J17600Q6904M9352L5942P7665J42991J72973J47283J35303
2090.6G70175040J58667J93775K38538K49088K08616J87456K15233K51949K65896K40028
$$ y = [772540748, 772722065, 772854984, 773016632, 773279905, 773668051, 774096668, 774431288, 774623334, 774810553, 775102258, 775473058, 775828123, 776072323, 776189327, 776306331, 776570976, 776921988, 777186275, 777292609, 777325094, 777399719, 777575254, 777809441, 777976930, 777988911, 777917504, 777925193, 778053522, 778191388, 778196871, 778025568, 777743638, 777476788, 777285457, 777091086, 776752234, 776235700, 775642157, 775058746, 774453223, 773830295, 773353815, 772971988, 772521675, 772067726, 771660209, 771210909, 770682573, 770166874, 769735217, 769405842, 769166172, 768959403, 768753231, 768588603, 768516779, 768543005, 768629074, 768721223, 768795609, 768860579, 768949151, 769073665, 769209027, 769326627, 769413531, 769462883, 769498825, 769576490, 769719481, 769892454, 770039737, 770175040, 770333707, 770527482, 770766020, 771015108, 771223724, 771411180, 771626413, 771878362, 772144258, 772384286]
2111G72384286J87874J17361N8890P1525J32382J23978L6657k1816r059L3617N9723
2133.5G73175418R8467J14560O2585K6226O4910J04427R7990Q9049Q6844J20104K16484
2155.9G74257064L19838L58522L52383L61085L97921N00381O49511P03931O30260N77151
2176.3G79108047O31810P47800Q02517P12096N74410N26488N75900O37651O37531N80489
2196.7G85534739N11587M76778N07474N75184O07908N92113N66482N47171N44786N63801
2217.1G91028023N56350M87029M22239M29035M61042M75704M63963L97801L06308K80917
2237.5G95308411L44098L88980L60429L11255K67744K52605L00646L22342K78651K71380
2257.9G98406541K83897K90573L24428L52621L66211L63648L07977K52187K47419K58863
$$ y = [772384286, 772572160, 772689521, 772748411, 772819936, 772952318, 773076296, 773112953, 773091137, 773082078, 773115695, 773175418, 773273885, 773388445, 773451030, 773477256, 773542166, 773646593, 773744583, 773833632, 773920476, 774040580, 774257064, 774576902, 774935424, 775287807, 775648892, 776046813, 776547194, 777196705, 777900636, 778530896, 779108047, 779739857, 780487657, 781290174, 782002270, 782576680, 783103168, 783679068, 784316719, 784954250, 785534739, 786046326, 786523104, 787030578, 787605762, 788213670, 788805783, 789372265, 789919436, 790464222, 791028023, 791584373, 792071402, 792493641, 792922676, 793383718, 793859422, 794323385, 794721186, 795027494, 795308411, 795652509, 796041489, 796401918, 796713173, 796980917, 797233522, 797534168, 797856510, 798135161, 798406541, 798690438, 798981011, 799305439, 799658060, 800024271, 800387919, 800695896, 800948083, 801195502, 801454365]
2278.3H01454365K76804K82169K61187K75433L16322K86818K39312K45512K32577J78456
2298.7H04048955J57118K33293L34501L50297K91526K53737K60055K57134K82884L26216
2319.1H06795716K96474K08974K12669L05295K85804P2897j68026k24709j02163J3113
2339.5H07696044r1970m28497q74043q55982j64151N85854Q54552O72698L59356k3425
2359.9H07730436k95937n18501p98285r80556j029968r56476q15689p49469p26461
2378.2H00859094o84142o21856m99665l46721k52723k53141l30568l90052l26515k24590
2398.6G96929121k57432l97683m92751m82083m18245l83377m38214n63144o94991p45058
2419G92056143o72042o08206o44803p22170p92980q09431p43747p09772p81536q67665
$$ y = [801454365, 801731169, 802013338, 802274525, 802549958, 802866280, 803153098, 803392410, 803637922, 803870499, 804048955, 804206073, 804439366, 804773867, 805124164, 805415690, 805669427, 805929482, 806186616, 806469500, 806795716, 807092190, 807301164, 807513833, 807819128, 808104932, 808177829, 808009803, 807785094, 807682931, 807696044, 807604074, 807175577, 806301534, 805445552, 805281401, 805867255, 806721807, 807394505, 807753861, 807730436, 807434499, 806915998, 806117713, 805137157, 804107189, 803150713, 802335024, 801585555, 800859094, 800174952, 799553096, 799053431, 798706710, 798453987, 798200846, 797870278, 797480226, 797153711, 796929121, 796671689, 796274006, 795781255, 795299172, 794880927, 794497550, 794059336, 793496192, 792801201, 792056143, 791384101, 790775895, 790131092, 789408922, 788615942, 787806511, 787062764, 786352992, 785571456, 784703791]
2439.4G84703791q78215q35180q04067p90774q14379q68499q88109q33988p39277o87420
2459.8G76563883p24018p94768p99775p30098o47366o35147p08580p72655p59601o85573
2480.2G69306302n89967n36501n76556o51181o46889n35011m30048m08828m33266m74930
2500.6G64023125m79460m33206l94583l65853l75033m50968n00620n02527n31494n78523
2521G59410858o09875o53922p05540p07448o93559p43330q39233r05097r21071r11414
2541.4G51720369q71539q20399q19683q68201q94844q76964q37445q06391q32439q70108
2561.8G43222356q72076q68797q37326p88331p88152q48353r02534q67963p78853p24793
2582.2G34945178o98447o82235p08222p24316o41763n36204n46634o11841n84543n33104
$$ y = [784703791, 783825576, 782990396, 782186329, 781395555, 780581176, 779712677, 778824568, 777990580, 777251303, 776563883, 775839865, 775045097, 774245322, 773515224, 772867858, 772232711, 771524131, 770751476, 769991875, 769306302, 768716335, 768179834, 767603278, 766952097, 766305208, 765770197, 765340149, 764931321, 764498055, 764023125, 763543665, 763110459, 762715876, 762350023, 761974990, 761524022, 761023402, 760520875, 759989381, 759410858, 758800983, 758147061, 757441521, 756734073, 756040514, 755297184, 754457951, 753552854, 752631783, 751720369, 750848830, 750028431, 749208748, 748340547, 747445703, 746568739, 745731294, 744924903, 744092464, 743222356, 742350280, 741481483, 740644157, 739855826, 739067674, 738219321, 737316787, 736448824, 735669971, 734945178, 734246731, 733564496, 732856274, 732131958, 731490195, 730953991, 730407357, 729795516, 729210973, 728677869]
2602.6G28677869n77390o75202p93814r11296r79781j008987j035214j126110j247764
2620.9G20322311j296461j313984j343429j402438j508355j586318j609266j603186
2637.2G08658874j561522j544655j610815j654446j613439j554906j507580j498640
2653.5F96112871j527726j535118j515091j488983j443684j401127j408994j425326
2669.9F84366822j390755j313090j218260j175940j209616j230002j222193j225591
2686.2F74381375j209676j187503j222253j286268j322925j332999j354813j433373
2702.5F64031565j514017j542569j549184j514435j443982j422524j436174j407325
2718.8F52201355j338840j278818j235962j185298j156508j169503j144946j038492
$$ y = [728677869, 728100479, 727425277, 726631463, 725720167, 724740386, 723731399, 722696185, 721570075, 720322311, 719025850, 717711866, 716368437, 714965999, 713457644, 711871326, 710262060, 708658874, 707097352, 705552697, 703941882, 702287436, 700673997, 699119091, 697611511, 696112871, 694585145, 693050027, 691534936, 690045953, 688602269, 687201142, 685792148, 684366822, 682976067, 681662977, 680444717, 679268777, 678059161, 676829159, 675606966, 674381375, 673171699, 671984196, 670761943, 669475675, 668152750, 666819751, 665464938, 664031565, 662517548, 660974979, 659425795, 657911360, 656467378, 655044854, 653608680, 652201355, 650862515, 649583697, 648347735, 647162437, 646005929, 644836426, 643691480, 642652988]
2735.1F42652988r42230r40740r87649j013219j001239r47297q83698q88229r41693
2753.5F34106994r15647q12113p54595p61569p79569q04245q34108q40008q43584r03428
2773.9F25858128j011312j127541j214147j237213j254678j364708j538157j646400
2790.2F15463972j673579j697004j756132j886546k041459k144158k221048k278984
2806.5E99765062k355158k475202k549768k604544k697944k769649k830029k940714
2822.8E78542054l094733l215849l261865l338933l471911l599703l785610m013300
2839.1E50760150m210472m442096m778385n080760n085647m716873m123270l566206
2855.5E14756441l291607l361523l699064m223407m838645n430639n932748o291390
$$ y = [642652988, 641710758, 640770018, 639782369, 638769150, 637767911, 636820614, 635936916, 635048687, 634106994, 633191347, 632379234, 631624639, 630863070, 630083501, 629279256, 628445148, 627605140, 626761556, 625858128, 624846816, 623719275, 622505128, 621267915, 620013237, 618648529, 617110372, 615463972, 613790393, 612093389, 610337257, 608450711, 606409252, 604265094, 602044046, 599765062, 597409904, 594934702, 592384934, 589780390, 587082446, 584312797, 581482768, 578542054, 575447321, 572231472, 568969607, 565630674, 562158763, 558559060, 554773450, 550760150, 546549678, 542107582, 537329197, 532248437, 527162790, 522445917, 518322647, 514756441, 511464834, 508103311, 504404247, 500180840, 495342195, 489911556, 483978808, 477687418]
2871.8D77687418o471157o480157o251514n725086n018294m217684l339618k516061
2888.1D37667847j817614j230896q42333p08788p68364r31143j133770j385033j732946
2906.5D27116960k188623k727002l308922l894955m353672m501700m306019l878444
2922.8C97957623l276139k428979j392991k83420R58503K318233L607660M687310N525201
2941.1D07673001O114334O465912O668329O825418O933391O957769O893009O820887
2957.4D61352050O793857O638795O257474N793989N389840N051940M803270M681528
2973.8E06762743M604518M506827M352450M082382L736436L406346L086329K739131
2990.1E37277162K362132J960039J567602J209259Q72672M89891N1319l30031n98669
$$ y = [477687418, 471216261, 464736104, 458484590, 452759504, 447741210, 443523526, 440183908, 437667847, 435850233, 434619337, 433777004, 433068216, 432299852, 431368709, 430234939, 428849906, 427116960, 424928337, 422201335, 418892413, 414997458, 410643786, 406142086, 401836067, 397957623, 394681484, 392252505, 390859514, 390576094, 391534597, 393852830, 397460490, 402147800, 407673001, 413787335, 420253247, 426921576, 433746994, 440680385, 447638154, 454531163, 461352050, 468145907, 474784702, 481042176, 486836165, 492226005, 497277945, 502081215, 506762743, 511367261, 515874088, 520226538, 524308920, 528045356, 531451702, 534538031, 537277162, 539639294, 541599333, 543166935, 544376194, 545248866, 545738757, 545790076, 545460045, 544861376]
3008.4E44861376q45134j186728j571000j882196k109706k261758k392411k574027
3024.7E30038416k733051k809585k884388k934038k984166l097475l169417l232837
3041.1E06193459l349662l440290l447682l388733l379226l439754l480732l502757
3057.4D78764623l477782l387332l334015l385216l506720l565192l470421l328115
3073.7D51309830l250331l255874l362864l455698l407747l339320l339708l355175
3090D24543113l380716l369600l273994l151059l145546l257215l226339l041953k963692
3108.4C95732999l032684l042549k960652k948165k978415l044784l147095l100485
3124.7C71478170k892434k746165k799154k868712k741277k573311k583325k715141
$$ y = [544861376, 544016242, 542829514, 541258514, 539376318, 537266612, 535004854, 532612443, 530038416, 527305365, 524495780, 521611392, 518677354, 515693188, 512595713, 509426296, 506193459, 502843797, 499403507, 495955825, 492567092, 489187866, 485748112, 482267380, 478764623, 475286841, 471899509, 468565494, 465180278, 461673558, 458108366, 454637945, 451309830, 448059499, 444803625, 441440761, 437985063, 434577316, 431237996, 427898288, 424543113, 421162397, 417792797, 414518803, 411367744, 408222198, 404964983, 401738644, 398696691, 395732999, 392700315, 389657766, 386697114, 383748949, 380770534, 377725750, 374578655, 371478170, 368585736, 365839571, 363040417, 360171705, 357430428, 354857117, 352273792, 349558651]
3141C49558651k771765k705395k598047k448261k318054k369195k514571k530277k453268
3159.4C26849818k369523k292931k249569k218276k193659k154530k091169k041966
3175.7C09238195k009779j971572j950354j945406j904339j819878j766742j787126
3192B94082999j800954j770616j738012j683205j596928j534938j531303j588792j568764
3210.3B79269487j444519j397878j409441j398504j372337j357854j343399j271278
3226.7B68274277j183241j111776j076728j172721j277894j225233j122534j047850
3243B59056300r91941j006275j071334j057148r61512r15617r37462r30100q71689
3261.3B50313222q23140p62239o52894n83202o79374q53106r09626q49814p61002p21470
$$ y = [349558651, 346786886, 344081491, 341483444, 339035183, 336717129, 334347934, 331833363, 329303086, 326849818, 324480295, 322187364, 319937795, 317719519, 315525860, 313371330, 311280161, 309238195, 307228416, 305256844, 303306490, 301361084, 299456745, 297636867, 295870125, 294082999, 292282045, 290511429, 288773417, 287090212, 285493284, 283958346, 282427043, 280838251, 279269487, 277824968, 276427090, 275017649, 273619145, 272246808, 270888954, 269545555, 268274277, 267091036, 265979260, 264902532, 263729811, 262451917, 261226684, 260104150, 259056300, 258064359, 257058084, 255986750, 254929602, 253968090, 253052473, 252115011, 251184911, 250313222, 249490082, 248727843, 248074949, 247491747, 246812373, 245959267, 245049641, 244199827, 243438825, 242717355]
3281.7B42717355p32332p11188o42404n65588n59077o22183o81728p49275p64355o34328
3302.1B36054897m73603n31555p92071r61169r19700q19236q02517q08924p53597o55636
3322.5B28536889o35549p83086r00299q38637p61479p27296o61463o62997p64087q38652
3342.9B20963344q66979p84606o39737p08893r23350r75743q21158o58706o59093o91116
3363.3B13233963n71788n05060o97896r28983q98793o97732o16789o52075o60821n87672
3383.7B06416354m54322k69189r7439k24814n41225m98623j45748m1187l68878o68243
3404.1B03106686n02288j91301j05903j80229l15681l35828j50621l6135p9632j9088
3424.5B01189980J72347L06517K58803K07826K54334J37373q6531n6773J99795L84211
$$ y = [242717355, 241985023, 241273835, 240631431, 240065843, 239506766, 238884583, 238202855, 237453580, 236689225, 236054897, 235581294, 235049739, 234257668, 233296499, 232376799, 231557563, 230755046, 229946122, 229192525, 228536889, 227901340, 227118254, 226217955, 225379318, 224617839, 223890543, 223229080, 222566083, 221801996, 220963344, 220096365, 219311759, 218672022, 217963129, 217039779, 216064036, 215242878, 214584172, 213925079, 213233963, 212662175, 212157115, 211459219, 210530236, 209631443, 208933711, 208316922, 207664847, 207004026, 206416354, 205962032, 205692843, 205595404, 205370590, 204829365, 204330742, 204184994, 204143807, 203774929, 203106686, 202604398, 202413097, 202307194, 202126965, 201811284, 201475456, 201324835, 201288700, 201209068, 201189980, 201362327, 201668844, 201927647, 202135473, 202389807, 202527180, 202440649, 202383876, 202583671, 202967882]
3444.9B02967882L62113K88531L54588M49628N01722N83530O48290N57959N53891Q30799
3465.3B08098933R76086O87465L13908L08156N39556Q34778R03562N92380N38335Q23497
3485.7B14616656Q09446O90326Q72791J007602R51275Q99643R43258R05663O85155
3504B22381815O47828Q23543R51007J098096J100242Q79169Q61749J118585J295984
3522.4B31158018J117468Q59871Q52198J033798J262977J394928J328900J231790J377627
3540.8B41617575J535341J425580J202002J282334J490802J526266J622349J809895
3557.1B53512144J943231K021879K005040J906425K088338K497137K584159K489180
3573.4B71047533K562433K737373K914131L120869L260106L107280K860278L158867
$$ y = [202967882, 203329995, 203618526, 203973114, 204422742, 204924464, 205507994, 206156284, 206714243, 207268134, 208098933, 209075019, 209762484, 210076392, 210384548, 210924104, 211758882, 212662444, 213254824, 213793159, 214616656, 215426102, 216116428, 216989219, 217996821, 218948096, 219847739, 220790997, 221696660, 222381815, 223029643, 223853186, 224804193, 225902289, 227002531, 227881700, 228743449, 229862034, 231158018, 232275486, 233135357, 233987555, 235021353, 236284330, 237679258, 239008158, 240239948, 241617575, 243152916, 244578496, 245780498, 247062832, 248553634, 250079900, 251702249, 253512144, 255455375, 257477254, 259482294, 261388719, 263477057, 265974194, 268558353, 271047533, 273609966, 276347339, 279261470, 282382339, 285642445, 288749725, 291610003, 294768870]
3589.7B94768870L490358L504783L599018L820300L843516L776163L795475L721982
3606C24320465L746748L975660M153073M275202M292697M252106M429013M472822M292220
3624.4C62210006M045724L998697M473150M655004M599779M549146M443616M408747
3640.7C97383869M454136M417747M283130M323661M602671M578352M358888M491359
3657D32893813M616558M344464M101634M070699L897995L637433L837287L849238L407985
3675.4D68657106L545821L813892L680885L581643L521026L209531K662182K662420
3691.7D95334506K968341K959103K767324K484918K276420K462387K645314K407491
3708E16305804J916290J709759K213836K471983K275169K030730J853764J705408J714528
$$ y = [294768870, 298259228, 301764011, 305363029, 309183329, 313026845, 316803008, 320598483, 324320465, 328067213, 332042873, 336195946, 340471148, 344763845, 349015951, 353444964, 357917786, 362210006, 366255730, 370254427, 374727577, 379382581, 383982360, 388531506, 392975122, 397383869, 401838005, 406255752, 410538882, 414862543, 419465214, 424043566, 428402454, 432893813, 437510371, 441854835, 445956469, 450027168, 453925163, 457562596, 461399883, 465249121, 468657106, 472202927, 476016819, 479697704, 483279347, 486800373, 490009904, 492672086, 495334506, 498302847, 501261950, 504029274, 506514192, 508790612, 511252999, 513898313, 516305804, 518222094, 519931853, 522145689, 524617672, 526892841, 528923571, 530777335, 532482743, 534197271]
3726.4E34197271K020359K029657J694858J417458J430691J811146K044976J442611
3742.7E48089027O98984J401007J637697R07958J201689J882673J702427J229227J350820
3761E60101509J634896J443744J215159J049042J111269J464308J571476J399100J084864
3779.4E72075367J007855J064300J051009J139879J224935J289368J196325R44674
3795.7E80993712J020253R29534N55039R55104J006842Q01384J270056J498163J042664
3814.1E90072751N60939Q44300P10309M98235J076519J150847R91642R76921R50455
3832.4E97832918R96590O52671J91807N34177R28521R79007J076221J166284P89464
3850.8F05147660m23908l75033J160324J418054R63688M99606M83155P56741N03838
$$ y = [534197271, 536217630, 538247287, 539942145, 541359603, 542790294, 544601440, 546646416, 548089027, 548788011, 550189018, 551826715, 552734673, 553936362, 555819035, 557521462, 558750689, 560101509, 561736405, 563180149, 564395308, 565444350, 566555619, 568019927, 569591403, 570990503, 572075367, 573083222, 574147522, 575198531, 576338410, 577563345, 578852713, 580049038, 580993712, 582013965, 582943499, 583498538, 584453642, 585460484, 586261868, 587531924, 589030087, 590072751, 590633690, 591477990, 592188299, 592686534, 593763053, 594913900, 595905542, 596882463, 597832918, 598829508, 599482179, 599673986, 600208163, 601136684, 602115691, 603191912, 604358196, 605147660, 604723752, 604348719, 605509043, 606927097, 607890785, 608390391, 608873546, 609630287, 610134125]
3869.1F10134125L90410P16865Q90911R51767N92470M35352O49810L96073M95136O65486
3889.5F16318405L02493M68195R01639P16150K81096J01447J30713M21047P04944O39796
3909.9F20985925N35488M91023K55406J27852L77178M43161K17974K80678M81844L41297
3930.3F24537826K20120L86595M77493M40061L32713K00033L12627M16100K92778K71618
3950.7F27887964L37065L80814M01377L32833K17855K23219L49343L72469K94209K18630
3971.1F31015778J65283J97232K67744K93017L51727L71694K63035J65642J71423K43961
3991.5F33506536K97308K87533K62916
3997.6F34354293
$$ y = [610134125, 610524535, 611241400, 612132311, 613084078, 613676548, 614111900, 614761710, 615157783, 615652919, 616318405, 616620898, 617089093, 617990732, 618706882, 618987978, 619089425, 619220138, 619641185, 620346129, 620985925, 621521413, 622012436, 622267842, 622395694, 622772872, 623216033, 623434007, 623714685, 624196529, 624537826, 624757946, 625144541, 625622034, 626062095, 626394808, 626594841, 626907468, 627323568, 627616346, 627887964, 628225029, 628605843, 629007220, 629340053, 629557908, 629781127, 630130470, 630502939, 630797148, 631015778, 631181061, 631378293, 631646037, 631939054, 632290781, 632662475, 632925510, 633091152, 633262575, 633506536, 633803844, 634091377, 634354293]
##END=$$ End of the data block
