##TITLE=$$ Begin of the data block
##JCAMP-DX=5.00 $$ ACD/SpecManager v 10.08
##SPECTROMETER/DATA SYSTEM=Alpha
##DATE=29 Dec 2014 15:06:02
##DATA TYPE=INFRARED SPECTRUM
##DATA CLASS=XYDATA
##ORIGIN=
##OWNER=
##NPOINTS=1765
##FIRSTX=399.76428223
##LASTX=3997.64306641
##MAXX=3997.64306641
##MINX=399.76428223
##MAXY=0.84520757
##MINY=0.23482457
##XFACTOR=1.0000000000
##YFACTOR=1.000000000000000e-9
##FIRSTY=0.55571377
##DELTAX=2.03961372
##XUNITS=1/CM
##YUNITS=ARBITRARY UNITS
##XYDATA=(X++(Y..Y))
399.8E55713773p456243m994154k430856L75807K168119J890480P16389j24991q37565
418.1E45020759q71658l79443r45270k431035l911198m742562m403294l021478r39489
436.5E23375332J295090K838373L543496L598035L536880L585994L518343L009319
452.8E48300862J577497m44770k232194k928078k639234j929283j808703k552510l742218
471.2E31601369m651129m112899k710104j262844j87635J17898j85907p89225j262605
489.5E16556919j291991r28342p83086j268029j954436k671004l266573l450036l349512
507.9D97593910l102303l222585l959328m887402n426585n093307l919482k390265
524.2D65592653r01312J37180L94553N39482J495301L293723N319208O463528N735487
$$ plain form
399.8 555713773 548257530 543263376 540832520 541208327 543376446 545266926 545983315 545858324 545020759
418.1 545020759 544149101 543769658 542824388 540393353 536482155 531739593 527336299 524314821 523375332
436.5 523375332 524670422 527508795 531052291 534650326 538187206 541773200 545291543 548300862
452.8 548300862 549878359 549433589 547201395 544273317 541634083 539704800 537896097 535343587 531601369
471.2 531601369 526950240 522837341 520127237 518864393 518676758 518794656 518608749 517819524 516556919
489.5 516556919 515264928 514336586 513553500 512285471 510331035 507660031 504393458 500943422 497593910
507.9 497593910 494491607 491269022 487309694 482422292 476995707 471902400 467982918 465592653
524.2 465592653 464691341 464828521 465223074 465762556 467257857 470551580 475870788 482334316 488069803
542.5D88069803L651320J559824N7042j026750j885056k477348k974659l807664m924625
560.9D76241887n963117o815732p409721p419974o321341m054874j280010J544565
577.2D38521683M193008O310076P583886P875264P150054N558908L752887K127558
593.5D83073324Q38488R2537j24902j36107j85222j24097J46956N89788J054227J499236
613.9D86724228K094000K830893L497511L970057M173726M027188L618538L067732
630.2E14003873K549648K166629J917899J777172J687407J576960J418054J200021
646.6E28297663J035392J054883J206100J414835J483381J318515J042008Q50856R69529
664.9E38673162J559556J893044J259028J319528J750708J759886J561940J487970
$$ plain form
542.5 488069803 491721123 493280947 493337989 492311239 490426183 487948835 484974176 481166512 476241887
560.9 476241887 470278770 463463038 456053317 448633343 442312002 438257128 436977118 438521683
577.2 438521683 442714691 449024767 456608653 464483917 471633971 477192879 480945766 483073324
593.5 483073324 483911812 484004349 483879447 483743340 483558118 483434021 483580977 484170765 485224992 486724228
613.9 486724228 488818228 491649121 495146632 499116689 503290415 507317603 510936141 514003873
630.2 514003873 516553521 518720150 520638049 522415221 524102628 525679588 527097642 528297663
646.6 528297663 529333055 530387938 531594038 533008873 534492254 535810769 536852777 537703633 538673162
664.9 538673162 540232718 542125762 543384790 544704318 546455026 548214912 549776852 551264822
681.2E51264822J478136J422107J155138N70178j09493q22366j606524k344787k890944
699.6E48116267l177524l095806k502441j460373j09017J419425K866745M079401N066872
717.9E51203549N833685O264389O362378O211102N789996N267977M737556M093349
734.3E95763981L396690K645135J724839O02067o32525j775980k747893l742814m633605
752.6E90599895n181194n440354n269170m514694l284753j575589N14150K718687M856348
771E73423326O612182P902503Q900344R416819R145915Q269012P197797N989433M825771
789.3F41683102M136026M037201M345775M793822M961431M482925L400565K283513
805.6F74124360J711726J528502J329601R97722N81860J41800k50399n73457q15391
$$ plain form
681.2 551264822 552742958 554165065 555320203 555890381 555780888 554958522 553351998 551007211 548116267
699.6 548116267 544938743 541842937 539340496 537880123 537771106 539190531 542057276 546136677 551203549
717.9 551203549 557037234 563301623 569664001 575875103 581665099 586933076 591670632 595763981
734.3 595763981 599160671 601805806 603530645 604132712 603500187 601724207 598976314 595233500 590599895
752.6 590599895 585418701 579978347 574709177 570194483 566909730 565334141 565848291 568566978 573423326
771 573423326 580035508 587938011 596838355 606255174 615401089 623670101 630867898 636857331 641683102
789.3 641683102 645819128 649856329 654202104 658995926 663957357 668440282 671840847 674124360
805.6 674124360 675836086 677364588 678694189 679691911 680273771 680415571 680165172 679591715 678776324
824F78776324j162529j946747l146410m444361n445957n856872n673230n150497m554748
842.4F41394973m208088m235804m510761m926562n308032n607068n762816n145907
858.7F01689935k684057J769900O528199R914815J1984468J3133824J2895107J0876954
875F66109145P522404L688276M4226k864003m698634n625427o001234o121099o173432
893.4F45880222o030738n656183n350172n229771n403579o170153p529140r120822
909.7E95389664j0511517j1354268j1452377j0705948r109556o868303m516840k615154
926E28255701j199067J34767J626551L069102M135609M791021N259336N378663M260838
944.3E55712521J302183k924264p262766j0925174j3659298j5534222j6731024j7422617
$$ plain form
824 678776324 677613795 675667048 672520638 668076277 662630320 656773448 651100218 645949721 641394973
842.4 641394973 637186885 632951081 628440320 623513758 618205726 612598658 606835842 601689935
858.7 601689935 599005878 600775778 607303977 617218792 629203260 642337084 655232191 666109145
875 666109145 673631549 677319825 677364051 674500048 669801414 664175987 658174753 652053654 645880222
893.4 645880222 639849484 634193301 628843129 623613358 618209779 612039626 604510486 595389664
909.7 595389664 584878147 573523879 562071502 551365554 542255998 535387695 530870855 528255701
926 528255701 527056634 527191401 528817952 531887054 536022663 540813684 546073020 551451683 555712521
944.3 555712521 557014704 554090440 546827674 535902500 522243202 506708980 489977956 472555339
960.7D72555339j7850905j8312008j8975645j9784331k0485431k0778537k0517468
974.9C35851014j9656778j8184721j6163230j3751716j1156737q553312o135150m025013
991.3B38224357k281040r72583p6280N37456Q46102P59408L44336j94773o32316q49872
1011.6B35704795p04006j76221N56707J363710K203956L017232L681213M060819M145861
1030B53854066L972113L441483K559394J579195Q37892N08905N48422Q02189J353353
1048.4B69457012K448559M019499N735010P220209Q390218R474963J0483264J0659963
1064.7C27888697Q491457K886414m758149j0577559j1608422q560449m340917q08537
1081B98612535J807779L714830N039394N994409O708086O990075O591618N436539L760219
$$ plain form
960.7 472555339 454704434 436392426 417416781 397632450 377147019 356368482 335851014
974.9 335851014 316194236 298009515 281846285 268094569 256937832 248384520 242249370 238224357
991.3 238224357 235943317 234970734 234894454 235431910 236278012 237037420 237381756 237186983 236554667 235704795
1011.6 235704795 235000789 234824568 235381275 236744985 238948941 241966173 245647386 249708205 253854066
1030 253854066 257826179 261267662 263827056 265406251 266244143 266753048 267301470 268103659 269457012
1048.4 269457012 271905571 275925070 281660080 288880289 297270507 306745470 317228734 327888697
1064.7 327888697 336380154 339266568 334508419 323930860 312322438 303761989 299421072 298612535
1081 298612535 300420314 304135144 309174538 315168947 321877033 328867108 335458726 340895265 344655484
1099.4C44655484K061993R32067Q54671J840026L256082M377812M849404M664958M008770
1117.7C71501267L084004K184301J736880K129912L342539M764557N370706M391075
1134C98505241J864999j563608m936040p379621q600831q806616q239657p059216n462438
1152.4C48322213l683895j865924m5269J794785L752470N919725Q249193J0493249
1168.7C72936547J2401938J3884366J4894396J5339672J5268714J4820665J4034599
1183D73580897J2946337J1602521R984046Q112967O152630M290521K784968J895010
1199.3E31349897J620770J784027K261996K970755L776669M545987N088329N193115
1215.6E58591545M815042M015147K859831J496136J31011j037180j838028k208174
$$ plain form
1099.4 344655484 346717477 347649544 348504215 350344241 353600323 357978135 362827539 367492497 371501267
1117.7 371501267 374585271 376769572 378506452 380636364 383978903 388743460 394114166 398505241
1134 398505241 400370240 398806632 393870592 386490971 377890140 369083524 360843867 353784651 348322213
1152.4 348322213 344638318 342772394 342727125 344521910 348274380 354194105 362443298 372936547
1168.7 372936547 385338485 399222851 414117247 429456919 444725633 459546298 473580897
1183 473580897 486527234 498129755 508113801 516226768 522379398 526669919 529454887 531349897
1199.3 531349897 532970667 534754694 537016690 539987445 543764114 548310101 553398430 558591545
1215.6 558591545 563406587 567421734 570281565 571777701 571908712 570871532 569033504 566825330
1231.9E66825330k252400k109468j852870j509189j006723k91109N64754J367927J964867
1250.3E61701119K278149K225697J881182J393795R49443Q14855J121819J772046K412081
1268.6E76550186K654075K331734J541197N95987j97828o77704q36432q15392p85410
1287E80360413q76546j165331j598656k032220k334893k448678k410948k317012k324223
1305.4E62851906k400398k269209j895904j521349j311899j262486j384735j905799
1321.7E48900127l000795m444004n657196o158948n917310n170167m148483k974749
1338E11428475j647710m16875L25918O50346O68883M00424l4093m76301p83861j017928
1358.4E09097278j193046j054526n40316k24411j30356J33813N59330J126706J473308
$$ plain form
1231.9 566825330 564572930 562463462 560610592 559101403 558094680 557803571 558368325 559736252 561701119
1250.3 561701119 563979268 566204965 568086147 569479942 570429385 571244240 572366059 574138105 576550186
1268.6 576550186 579204261 581535995 583077192 583673179 583475351 582797647 581961215 581145823 580360413
1287 580360413 579483867 578318536 576719880 574687660 572352767 569904089 567493141 565176129 562851906
1305.4 562851906 560451508 558182299 556286395 554765046 553453147 552190661 550805926 548900127
1321.7 548900127 545899332 541455328 535798132 529639184 523721874 518551707 514403224 511428475
1338 511428475 509780765 509363890 509689808 510340154 511009037 511409461 511375368 510899067 510115206 509097278
1358.4 509097278 507904232 506849706 506309390 506084979 505954623 506088436 506647766 507774472 509247780
1376.7E09247780J450121J468361J859247K791465M198074M788280L725767K277732
1393.1E31806827J064777K6822q23200j288950j683056k120138k190768k201260k252876
1411.4E20338178k073169j834393j736641j199066k18868L90887Q46028J182079J499773
1429.8E17194808J793801J730323J887620K435445K320469J978397J543820Q08537
1446.1E31693220m1246p34508j271427j780212k477407j841724K18033J241684K459944
1464.5E27466357M167378N133867O481171R675264J1175275R919643Q788824Q179188
1480.8E90986967P791460O929516O330491O556809O720721N457700M455029M671455
1497.1F39900148M732668M074157L116130K576471L471970L829301L032803K510608
$$ plain form
1376.7 509247780 510697901 512166262 514025509 516816974 521015048 525803328 529529095 531806827
1393.1 531806827 532871604 532898426 532075226 530786276 529103220 526983082 524792314 522591054 520338178
1411.4 520338178 518265009 516430616 514693975 513494909 513276041 513666928 514512956 515695035 517194808
1429.8 517194808 518988609 520718932 522606552 525041997 527362466 529340863 530884683 531693220
1446.1 531693220 531651974 530917466 529646039 527865827 525388420 523546696 523764729 525006413 527466357
1464.5 527466357 531633735 536767602 543248773 552924037 564099312 574018955 582807779 590986967
1480.8 590986967 598778427 605707943 612038434 618595243 625315964 630773664 635228693 639900148
1497.1 639900148 644632816 648706973 651823103 654399574 657871544 661700845 664733648 667244256
1513.4F67244256K187967K254426K202154K293229K440929K174556K163828J938939
1529.7F84900284J485526J438082J350522O58571L44515R75013J325071J199961O85393
1548.1F94362938J77324p8320l05236p21991j381993p10785P7903o12915j281738j829863
1568.5F87695324j949489j375079j679361k374947j903355j748264k243399k446652
1584.8F71974778k422750k363384k371609k480268k636373k690852k684236k708852
1601.1F51616454k645731k556503k665043k968788l073752l104388l704369l996015
1617.4F26901865k740979k486229l169477l092170k954602k780736k162098j966835
1633.7F05548739j893222o95944P4804J41621Q8453L70502J586259J945496K098560
$$ plain form
1513.4 667244256 669432223 671686649 673888803 676182032 678622961 680797517 682961345 684900284
1529.7 684900284 686385810 687823892 689174414 689832985 690177500 691152513 692477584 693677545 694362938
1548.1 694362938 694540262 694461942 694156706 693434715 692052722 691341937 691419840 690806925 689525187 687695324
1568.5 687695324 685745835 684370756 682691395 680316448 678413093 676664829 674421430 671974778
1584.8 671974778 669552028 667188644 664817035 662336767 659700394 657009542 654325306 651616454
1601.1 651616454 648970723 646414220 643749177 640780389 637706637 634602249 630897880 626901865
1617.4 626901865 624160886 621674657 618505180 615413010 612458408 609677672 607515574 605548739
1633.7 605548739 603655517 602959573 603034377 603175998 603264451 603634953 605221212 607166708 609265268
1652.1F09265268L942668L961087L149449L180266L859401M486560M065872M166245
1668.4F40076816N121470M877567M842758N412757M956782M308224M544318O306588
1684.7F80447280N939305M459799M185557L552616L256082L421188L208637L443360
1701.1G11913824K744377J839101J865864J920402J727104J479983J283706J608252
1717.4G26382613K116919J925826J747310J941323J967013J852989J618862J793504
1733.7G41346359K351821K043843J960218K348900K503097K405941K276600K541661
1750G59778440L020108K816558K567350K618075K447724K438545K262056J668752J269102
1768.4G80886710J194954J570105J999319J734197J256585R98139R45926J004279J114607
$$ plain form
1652.1 609265268 613207936 617169023 620318472 623498738 627358139 631844699 635910571 640076816
1668.4 640076816 645198286 650075853 654918611 660331368 665288150 669596374 674140692 680447280
1684.7 680447280 686386585 690846384 695031941 698584557 701840639 705261827 708470464 711913824
1701.1 711913824 714658201 716497302 718363166 720283568 722010672 723490655 724774361 726382613
1717.4 726382613 728499532 730425358 732172668 734113991 736081004 737933993 739552855 741346359
1733.7 741346359 743698180 745742023 747702241 750051141 752554238 754960179 757236779 759778440
1750 759778440 762798548 765615106 768182456 770800531 773248255 775686800 777948856 779617608 780886710
1768.4 780886710 782081664 783651769 785651088 787385285 788641870 789640009 790585935 791590214 792704821
1786.7G92704821R83476P48754R71317J150429Q75891O72102Q46684J146078J142800
1805.1H01242352R01758O49452O20664P40289P55847P58171Q38399P43449M46379L07381
1825.5H08004141K96295L52084P17104Q82744O60778M81426L19720o080j41144K96235
1845.9H11863303O39200O20306M63486K29597Q0466O2227J52827K68042K72214P3850
1866.3H14725518k0563K75969M26769L04640K99692M33862M84347M03047K80499J19150
1886.7H17732930L2366K64644M69506M44889M28140K93434M2677j01209m5955J16885
1907.1H19678307K89738L86178K66910m5180k60175j07765J33574L28541N02705M26650
1927.5H21599483J60218p0036j37269n1618J04487J91093K05755K45571J69635j2696
$$ plain form
1786.7 792704821 793688297 794437051 795408368 796558797 797434688 798106790 798953474 800099552 801242352
1805.1 801242352 802144110 802793562 803414226 804154515 804910362 805668533 806506932 807250381 807696760 808004141
1825.5 808004141 808300436 808652520 809369624 810252368 810913146 811394572 811714292 811708212 811567068 811863303
1845.9 811863303 812502503 813122809 813586295 813815892 813896358 813958585 814111412 814379454 814651668 814725518
1866.3 814725518 814704955 814980924 815407693 815712333 816012025 816445887 816930234 817333281 817613780 817732930
1886.7 817732930 817765296 818029940 818499446 818944335 819372475 819665909 819708586 819607377 819561422 819678307
1907.1 819678307 819968045 820354223 820621133 820575953 820315778 820208013 820341587 820670128 821172833 821599483
1927.5 821599483 821759701 821689665 821552396 821500778 821605265 821796358 822002113 822247684 822417319 822404623
1947.9H22404623l5226J30415L35753M57763L99888K06172R120j17898q7440K02656
1968.3H23905826M97162N13673L04997P510j79648j63198J1265K37286L49224K36094
1988.7H25720191k4140j91748j74999p6354Q7559K33531J92523j3649k48075m22060
2009H25082779m56691l33905j85192q6844j12116l63112p23004q35121m98056j11461
2029.4H21377277j7166j19209l03745m82500n79297n20766l40581j56343l9041l0399
2049.8H18788230j11281k03312k20477j52529o079J78515K56360J86741M8757p8678
2070.2H18686247r8109l0399P0155J70171J91510J33395L6180n5611o6161L6001J78337
2092.7H19251716K59221K56598K13027J45972P9333P2658J32203K05160K33948K07364
$$ plain form
1947.9 822404623 822369397 822499812 822835565 823293328 823693216 823899388 823908508 823790610 823703170 823905826
1968.3 823905826 824402988 824916661 825221658 825229168 825049520 824886322 824897587 825134873 825484097 825720191
1988.7 825720191 825696051 825504303 825329304 825252950 825340509 825574040 825766563 825752914 825504839 825082779
2009 825082779 824626088 824292183 824106991 824020147 823908031 823544919 822821915 821986794 821488738 821377277
2029.4 821377277 821360111 821240902 820937157 820454657 819875360 819354594 819014013 818857670 818818629 818788230
2049.8 818788230 818676949 818473637 818253160 818100631 818094552 818273067 818529427 818716168 818764925 818686247
2070.2 818686247 818588138 818557739 818627894 818798065 818989575 819122970 819159150 819103539 819037378 819073379 819251716
2092.7 819251716 819510937 819767535 819980562 820126534 820205867 820278525 820410728 820615888 820849836 821057200
2113.1H21057200J31071K9624m6075m8995J2875P2956J10030J24514Q0049n185n9784
2135.5H21458280o6638k2054N9784J26421J58787J34230L1173o4194m7922O8009K36272
2157.9H22072148L86298M28140L55363K32577J56284K31623M49598O38962O84738O10829
2178.3H26246560M49121K69770K04683K87890M67181O39498O62685N02348K64644Q3328
2198.7H30077708P3373K77639N46336O67274N95390M05193J92940R2805J63257L60489
2219.1H33452404N79655O49869M92633J92344k9266p332J73331L85999N38171M75824
2239.5H36903632J91152p9096j66654l3021K62678N04195N35429L61144Q6189j09017
2259.9H38456631j09613P1347L44157N30481M95553K48730o8605k18868j01387J87933
$$ plain form
2113.1 821057200 821188271 821217895 821171820 821122825 821135700 821208656 821318686 821443200 821523249 821518064 821458280
2135.5 821458280 821391642 821369588 821429372 821555793 821714580 821848810 821879983 821815789 821767867 821835876 822072148
2157.9 822072148 822458446 822886586 823241949 823474526 823630810 823862433 824312031 824950993 825635731 826246560
2178.3 826246560 826695681 826965451 827170134 827458024 827925205 828564703 829227388 829729736 829994380 830077708
2198.7 830077708 830151081 830428720 830975056 831642330 832237720 832642913 832835853 832928658 833091915 833452404
2219.1 833452404 834032059 834681928 835174561 835366905 835337639 835330307 835503638 835889637 836427808 836903632
2239.5 836903632 837094784 837015688 836849034 836816013 837078691 837582886 838118315 838479459 838565648 838456631
2259.9 838456631 838347018 838418365 838762522 839293003 839788556 840037286 839968681 839749813 839648426 839836359
2280.3H39836359M91917N87285L49700k7776k36570j55867J18018M07159N31077M05312
2300.7H42306614J32859j13428j87159j0788L36826N74052N19932L11791R4355n5016
2321.1H43910038k6285J69515L70741M55082L28481o6042m63843n22852k74897J7405
2341.5H43897343P5400k85984o10649m44889J1682M21524N57721M93407K73943j56700
2361.9H44232798o73950r88186r91523q38756o29247m62710n24462p36355q50440p64012
2382.3H36773157n15222k16663q881J9490j42753m01258n47231m77790k62142o9975
2402.7H34150732n5254k00570m38273o50346o85632n25355k99693j85072k78532n24104
2423.1H30307901p50601q10683o73771m77851l65734m03285n96821q00908q55982p55012
$$ plain form
2280.3 839836359 840328276 840915561 841265261 841237485 841000915 840845048 840963066 841370225 841901302 842306614
2300.7 842306614 842439473 842326045 842138886 842128098 842464924 843038976 843558908 843870699 843965054 843910038
2321.1 843910038 843883753 844053268 844424009 844879091 845207572 845141530 844677687 844154835 843879938 843897343
2341.5 843897343 843972743 843686759 843076110 842631221 842642903 843064427 843622148 844115555 844389498 844232798
2361.9 844232798 843558848 842570662 841579139 840740383 840111136 839648426 839123964 838387609 837537169 836773157
2382.3 836773157 836257935 836041272 836032391 836051881 835909128 835507870 834960639 834482849 834220707 834150732
2402.7 834150732 834095478 833894908 833456635 832806289 832120657 831595302 831295609 831110537 830832005 830307901
2423.1 830307901 829557300 828746617 828072846 827594995 827229261 826825976 826229155 825428247 824572265 823817253
2443.5H23817253n76615m15445l89993n28574p19189q31485p99775o37353m44889l32594
2463.9H18141341l74734n90027q15630q39650o58751m27425k77757k97666m70817o64473
2484.3H12724411p58945o71745m13418j60396j02758k63870n04732o32465n69761l79860
2504.7H08266461j58131k8253j20938m01079o59943p21574n66303l22223j49667j86801
2525.1H04951549m41790p28309q93831q80778o71745m08232l30746n07236p83026r61900
2545.5G98343956r47356p39097m61042l37065m31239o46293q70884r67622q51035o20365
2565.8G91471958m00543k83599m37558p77542r89080r51349o98388l78728k39611l67224
2586.2G85948336o39915q35121p80404n71131l46423j46985j55329m29690p28369q65161
$$ plain form
2443.5 823817253 823240638 822825193 822435200 821906626 821187437 820355952 819556177 818918824 818473935 818141341
2463.9 818141341 817766607 817176580 816360950 815521300 814862549 814435124 814157367 813859701 813388884 812724411
2484.3 812724411 811965466 811293721 810880303 810719907 810617149 810353279 809848547 809216082 808646321 808266461
2504.7 808266461 808108330 808080077 807959139 807558060 806898117 806176543 805610240 805288017 805138350 804951549
2525.1 804951549 804509759 803781450 802887619 802006841 801335096 800926864 800596118 800088882 799305856 798343956
2545.5 798343956 797396600 796657503 796196461 795859396 795428157 794781864 793910980 792943358 792092323 791471958
2565.8 791471958 791071415 790787816 790350258 789572716 788583636 787632287 786933899 786555171 786315560 785948336
2586.2 785948336 785308421 784473300 783692896 783121765 782775342 782628357 782473028 782043338 781314969 780449808
2606.6G80449808q07405o52075n39183n26488o64830r47178j205802j269161j150966
2625G72686720r66549q24571q69214j126051j405358j500607j388431j194298j011133
2643.4G62400508r28879j052320j313209j490891j454354j254797j007676q56936r21786
2661.7G52119660j115739j298487j359463j206756r44256p62105p55728q92043j082301
2680.1G42702782j201570j151502r85205p88689o74844p81238j040637j241565j275182
2698.4G33562350j176953j031518r40144r92537j171648j346946j378000j245677j040816
2716.8G23238111q57473q04424r24826j101672j175762j087725q70466o52015n69761
2735.1G15193987o42538q11339r59396r85920q92103p14600n45562n59031p31469q45551
$$ plain form
2606.6 780449808 779642403 778990328 778451145 777924657 777259827 776312649 775106847 773837686 772686720
2625 772686720 771720171 770895600 770026386 768900335 767494977 765994370 764605939 763411641 762400508
2643.4 762400508 761471629 760419309 759106100 757615209 756160855 754906058 753898382 753041446 752119660
2661.7 752119660 751003921 749705434 748345971 747139215 746194959 745432854 744677126 743785083 742702782
2680.1 742702782 741501212 740349710 739364505 738575816 737900972 737119734 736079097 734837532 733562350
2698.4 733562350 732385397 731353879 730413735 729421198 728249550 726902604 725524604 724278927 723238111
2716.8 723238111 722380638 721576214 720651388 719549716 718373954 717286229 716415763 715763748 715193987
2735.1 715193987 714551449 713740110 712780714 711794794 710902691 710188091 709642529 709083498 708352029 707506478
2755.5G07506478q43227p64310o22273m98056m80593n73158p40111q87871r18209q78751
2775.9G00299919q32260q20696r25064j111985j279473j383245j378357j271129j212657
2794.3F90085053j318037j535952j760662j897275j927793j884163j820683j855016
2810.6F76085472k011716k201855k344311k379536k350450k345800k387882k499997
2826.9F57563925k652228k794743k928137k983690k967298l018498l164351l407896
2843.2F33647084l747761l980160l932476l634333l237188k949059k877593l024817
2859.5F06263697l371179l821313m244268m597545m906475n224705n571366n790054
2875.9E68736792n652011n127251m357159l524125k756953k081931j515388j051486
$$ plain form
2755.5 707506478 706663251 705898941 705276668 704778612 704298019 703724861 702984750 702096879 701178670 700299919
2775.9 700299919 699467659 698646963 697721899 696609914 695330441 693947196 692568839 691297710 690085053
2794.3 690085053 688767016 687231064 685470402 683573127 681645334 679761171 677940488 676085472
2810.6 676085472 674073756 671871901 669527590 667148054 664797604 662451804 660063922 657563925
2826.9 657563925 654911697 652116954 649188817 646205127 643237829 640219331 637054980 633647084
2843.2 633647084 629899323 625919163 621986687 618352354 615115166 612166107 609288514 606263697
2859.5 606263697 602892518 599071205 594826937 590229392 585322917 580098212 574526846 568736792
2875.9 568736792 563084781 557957530 553600371 550076246 547319293 545237362 543721974 542670488
2892.2E42670488o99162n34058n41389o33895q18491j131833j517594j888811k221942
2910.5E32683313k574027l034949l545582l877402l942787l754437l264964k502084
2926.8E06187081j580596n51462O03914J843095L070951M169106N037189N655110O032526
2945.2E30466914O188989O234526O238640O150484O059468O031215N949020N682111
2961.5E79001367N156875M525423M022240L723920L631890L668844L676355L610909
2977.8F11017823L456712L137946K783179K566338K426565K243519J931786J507282
2994.2F31071150J147747Q59261N48601K88963N8413k15769n00739p97450j142263
3012.5F31317914j460493j650870j752078j863659k026498k219141k368331k425015
$$ plain form
2892.2 542670488 541971326 541437268 540895879 540261984 539443493 538311660 536794066 534905255 532683313
2910.5 532683313 530109286 527074337 523528755 519651353 515708566 511954129 508689165 506187081
2926.8 506187081 504606485 504055023 504658937 506502032 509572983 513742089 518779278 524434388 530466914
2945.2 530466914 536655903 542890429 549129069 555279553 561339021 567370236 573319256 579001367
2961.5 579001367 584158242 588683665 592705905 596429825 600061715 603730559 607406914 611017823
2977.8 611017823 614474535 617612481 620395660 622961998 625388563 627632082 629563868 631071150
2994.2 631071150 632218897 633078158 633626759 633915722 633974135 633758366 633257627 632460177 631317914
3012.5 631317914 629857421 628206551 626454473 624590814 622564316 620345175 617976844 615551829
3028.8F15551829k413988k368986k457321k676368k748191k716601k782881k888799
3045.1E94498694k900124k818703k791286k896786l015935l078461l091573l002882
3061.5E70902944k838910k749860k873123l115475l212154l077567k843320k700329
3077.8E47492206k759218k897799k994299l071427l071845l015280l019392l030658
3094.1E23632288k924085k776444k821266k997279k973080k746225k656877k776086
3110.4E00960946k779812k645432k649457k768755k908677k985894k876431k689064
3126.7D78657424k604335k689809k800107k704560k453000k345919k512634k655417
3143D57891643k617776k525837k367436k238870k343148k528131k522707k421916k375006
$$ plain form
3028.8 615551829 613137841 610768855 608311534 605635166 602886975 600170374 597387493 594498694
3045.1 594498694 591598570 588779867 585988581 583091795 580075860 576997399 573905826 570902944
3061.5 570902944 568064034 565314174 562441051 559325576 556113422 553035855 550192535 547492206
3077.8 547492206 544732988 541835189 538840890 535769463 532697618 529682338 526662946 523632288
3094.1 523632288 520708203 517931759 515110493 512113214 509140134 506393909 503737032 500960946
3110.4 500960946 498181134 495535702 492886245 490117490 487208813 484222919 481346488 478657424
3126.7 478657424 476053089 473363280 470563173 467858613 465405613 463059694 460547060 457891643
3143 457891643 455273867 452748030 450380594 448141724 445798576 443270445 440747738 438325822 435950816
3161.4D35950816k342642k264231k163857k124071k133310k154500k160698k129674
3177.7D18477833k073884k012193j958549j921475j925707j955420j949310j914233
3194D02767062j873195j789421j709997j689315j696885j712531j703888j652747j584500
3212.4C87354583j509220j469612j489937j510650j509875j479179j409501j325845
3228.7C75650764j213372j174391j356780j494765j388371j249969j141578j039237
3245C65592301j050443j186579j256645j147836j000375r62674r96024j009106r88424
3263.4C55994195r26644p91311o84798p77990r29564r63241r52094r40472r20564q78006
3283.8C47229511q03382p05629n74947n32686o77854q62777r49800q93712o98716n25594
$$ plain form
3161.4 435950816 433608174 431343943 429180086 427056015 424922705 422768205 420607507 418477833
3177.7 418477833 416403949 414391756 412433207 410511732 408586025 406630605 404681295 402767062
3194 402767062 400893867 399104446 397394449 395705134 394008249 392295718 390591830 388939083 387354583
3212.4 387354583 385845363 384375751 382885814 381375164 379865289 378386110 376976609 375650764
3228.7 375650764 374437392 373263001 371906221 370411456 369023085 367773116 366631538 365592301
3245 365592301 364541858 363355279 362098634 360950798 359950423 358987749 357991725 356982619 355994195
3263.4 355994195 355067551 354276240 353591442 352813452 351883888 350920647 349968553 349028081 348107517 347229511
3283.8 347229511 346426129 345720500 345145553 344612867 343935013 343072236 342122436 341228724 340530008 340004414
3304.2C40004414o10649r03160j105368j099735r83864r06736q86023q39621p68185
3322.5C31901073p59124q93295j036495j014471q94547p46399o49124p89345j021236
3340.9C24097037j049459r84072q75086p05391q05348j086057j099824r26882q36105
3359.2C15728813q40872p80463n58138m80205p85202j137882j112461q31545o86168
3377.6C08515877o92994p32690o82086n07444l06994j50889k60830n74976n77450j84357
3398C03845167o258l72351p28249n74648k48790j07974j39147l07858m03255k73407
3418.4C00683230j03831j937J12146K63274L19957K19345K73109M10944K03222j11192
3438.8C02268267n4539K42830M02838M21881M49330N05835N58823O09398P20799Q32766
$$ plain form
3304.2 340004414 339393765 338490605 337385237 336285502 335301638 334394902 333508879 332669258 331901073
3322.5 331901073 331141949 330248654 329212159 328197688 327303141 326556742 325907618 325118273 324097037
3340.9 324097037 323047578 322063506 321188420 320483029 319677681 318591624 317491800 316564918 315728813
3359.2 315728813 314887941 314107478 313549340 313069135 312283933 311146051 310033590 309202045 308515877
3377.6 308515877 307822883 307090193 306408107 305900663 305593669 305442780 305181950 304606974 304029524 303845167
3398 303845167 303838909 303466558 302738309 302163661 301914871 301806897 301667750 301359892 300956637 300683230
3418.4 300683230 300579399 300577462 300689608 300952882 301272839 301492184 301765293 302176237 302379459 302268267
3438.8 302268267 302213728 302456558 302859396 303281277 303730607 304236442 304795265 305404663 306125462 306958228
3459.2C06958228P32482P05868J019299J204580Q81374M17262L97772P19607J026600
3477.5C14063072J029283P90119Q30919J075327J050532R09805R67264J070500J121849
3495.9C22908670J130700J124859J139730J072168R17256R11534J168698J454562J372278
3514.2C33200455J086652J092076J290649J447559J334369J040280J068622J395881
3530.6C42956543J631409J664013J518338J401842J559943J703590J612246J526088
3546.9C55574012J627266J714498J811057J981616K108932K278298K406567K172798
3563.2C71675044J876504K469331L259718L064692K779901K967566L205419L330767
3579.5C94628942L416121L287762K942294L152132L922284L875583L584385L825367
$$ plain form
3459.2 306958228 307690710 308396578 309415877 310620457 311501831 311919093 312316865 313036472 314063072
3477.5 314063072 315092355 315882474 316713393 317788720 318839252 319749057 320716321 321786821 322908670
3495.9 322908670 324039370 325164229 326303959 327376127 328293383 329204917 330373615 331828177 333200455
3514.2 333200455 334287107 335379183 336669832 338117391 339451760 340492040 341560662 342956543
3530.6 342956543 344587952 346251965 347770303 349172145 350732088 352435678 354047924 355574012
3546.9 355574012 357201278 358915776 360726833 362708449 364817381 367095679 369502246 371675044
3563.2 371675044 373551548 376020879 379280597 382345289 385125190 388092756 391298175 394628942
3579.5 394628942 398045063 401332825 404275119 407427251 411349535 415225118 418809503 422634870
3595.8D22634870M078775M051477M079431L965468L589779L716677M130274M161388
3612.1D54408139M250437M091382L956705M699231M893899M121989L220886L449797
3628.5D87092465M939079M860193M294336M217088M163802M148304M073799L611922
3644.8E21400988L017485L528118M956425M774689L860474M088163M420042L838003
3661.1E53884387L423631L336549K827466K627432L466129L057480K465487L538608
3677.4E78627169L814578L436327L206253K763152K251208K182245K637864K805471
3693.7F01724267K583623K242625J866758J872599K277136K130210J471460J086771
3710F17255449J731754K580464K279579J648307J335740J343429J489043J790882K005696
$$ plain form
3595.8 422634870 426713645 430765122 434844553 438810021 442399800 446116477 450246751 454408139
3612.1 454408139 458658576 462749958 466706663 471405894 476299793 480421782 483642668 487092465
3628.5 487092465 492031544 496891737 501186073 505403161 509566963 513715267 517789066 521400988
3644.8 521400988 524418473 527946591 532903016 537677705 541538179 545626342 550046384 553884387
3661.1 553884387 557308018 560644567 563472033 566099465 569565594 572623074 575088561 578627169
3677.4 578627169 582441747 585878074 589084327 591847479 594098687 596280932 598918796 601724267
3693.7 601724267 604307890 606550515 608417273 610289872 612567008 614697218 616168678 617255449
3710 617255449 618987203 621567667 623847246 625495553 626831293 628174722 629663765 631454647 633460343
3728.4F33460343J519740P94470P09235J578391K200842J511455J44124J30176J461685
3746.7F43510461J032948N71013J734078K101719J398862J029253J325190J265466
3763.1F53968990R00924P92682Q17955J222968J519084J225591Q03232O94096R51767
3781.4F62897289R50038R26197J133203J108826R08732N95689M16815O05226L73184
3799.8F69915199M30525J162767R25660R15051J399994J106798K96593J29223O20663
3818.1F76902473M02093P97570J303017Q71539O71327O00755O12676O95467K54751
3836.5F83111668k1220N30243J036823J254678J158357O24179m58538j269937N47827
3854.8F86514080K007067J390517N47289Q5950M03464N46575N7399L40700Q98659J038075
$$ plain form
3728.4 633460343 634980083 635774553 636483788 638062179 640263021 641774476 641918600 642048776 643510461
3746.7 643510461 644543409 645114422 646848500 648950219 650349081 651378334 652703524 653968990
3763.1 653968990 654869914 655662596 656480551 657703519 659222603 660448194 661251426 661945522 662897289
3781.4 662897289 663847327 664773524 665906727 667015553 667924285 668519974 668936789 669542015 669915199
3799.8 669915199 670345724 671508491 672434151 673349202 674749196 675855994 676152587 676281810 676902473
3818.1 676902473 677304566 678102136 679405153 680276692 680948019 681548774 682161450 682856917 683111668
3836.5 683111668 683090448 683620691 684657514 685912192 687070549 687694728 687236190 685966253 686514080
3854.8 686514080 688521147 689911664 690458953 690544903 690948367 691494942 691552341 691893041 692791700 693829775
3875.2F93829775Q14259K00152K77579N34654M12702O10292L85225J89304P30038P75993
3895.6F98759973J31190k69115j32144L13938R14872J013160O70492M20094J34647
3914G01957107j25349P0810M14312L79145K82407M01557L09467N3585K37464N80490
3934.4G04560995N07951K57790M4703N7936L10123K77281J77503L74436L98576K29538
3954.8G07196832J95503K23815K24948K42532K46703K24531K27392K10940J62900J58966
3975.2G09315062J92284K34723L13580L25501J79529N1797J05381J63376J21296K03073
3995.6G11205602L39567
3997.6G11545169
$$ plain form
3875.2 693829775 694644034 694844186 695121765 695656419 696069121 696679413 697064638 697253942 697983980 698759973
3895.6 698759973 698891163 698622048 698489904 698803842 699718714 700731874 701402366 701822460 701957107
3914 701957107 701831758 701902568 702316880 702696025 702978432 703379989 703689456 703743041 703980505 704560995
3934.4 704560995 705068946 705326736 705371439 705429375 705739498 706016779 706194282 706568718 706967294 707196832
3954.8 707196832 707392335 707616150 707841098 708083630 708330333 708554864 708782256 708993196 709156096 709315062
3975.2 709315062 709507346 709742069 710055649 710381150 710560679 710612476 710717857 710881233 711002529 711205602
3995.6 711205602 711545169
3997.6 711545169
##END=$$ End of the data block
