##TITLE=$$ Begin of the data block
##JCAMP-DX=5.00 $$ ACD/SpecManager v 10.08
##SPECTROMETER/DATA SYSTEM=Alpha
##DATE=29 Dec 2014 15:06:02
##DATA TYPE=INFRARED SPECTRUM
##DATA CLASS=XYDATA
##ORIGIN=
##OWNER=
##NPOINTS=1765
##FIRSTX=399.76428223
##LASTX=3997.64306641
##MAXX=3997.64306641
##MINX=399.76428223
##MAXY=0.84595734
##MINY=0.23488641
##XFACTOR=1.0000000000
##YFACTOR=1.000000000000000e-9
##FIRSTY=0.55517113
##DELTAX=2.03961372
##XUNITS=1/CM
##YUNITS=ARBITRARY UNITS
##XYDATA=(X++(Y..Y))
399.8E55171132p086992n101860k747595K12014K469241K533377J016378l06189j481474
418.1E44678032j594781m73023q33034k214730l560364m601956m445076l017604r48847
436.5E22988617J378894L059864L635109L658116L670513L612876L457010K986252
452.8E48447251J560212o28353k522766l137708k781033j932979j555324k234041l721774
471.2E31493485m895210m216552k550423j107633j55568J71423r7275p50065j261592
489.5E16630590j306951j105607r71734j114607j770794k757609l427327l598154l403455
507.9D97174352l092140l211945l803611m756361n445659n038172l842950k396166
524.2D65587348r41068N5373L37362N02854J443297L380388N355179O287188N736649
$$ y = [555171132, 548084140, 542982280, 540234685, 540446699, 542915940, 545449317, 546465695, 546159506, 544678032, 543083251, 542610228, 541777194, 539562464, 536002100, 531400144, 526955068, 523937464, 522988617, 524367511, 527427375, 531062484, 534720600, 538391113, 542003989, 545460999, 548447251, 550007463, 549379110, 546856344, 543718636, 540937603, 539004624, 537449300, 535215259, 531493485, 526598275, 522381723, 519831300, 518723667, 518568099, 518739522, 518642247, 517892182, 516630590, 515323639, 514218032, 513246298, 512131691, 510360897, 507603288, 504175961, 500577807, 497174352, 494082212, 490870267, 487066656, 482310295, 476864636, 471826464, 467983514, 465587348, 464646280, 464701653, 465039015, 465541869, 466985166, 470365554, 475720733, 482007921, 487744570]
542.5D87744570L904491J759887j4782j252979j892149k282143k904653l860742m888982
560.9D76312518n897254o762832p375598p484466o370276m003376j173317J593023
577.2D38838422M116148O229788P584065P853806P123679N612701L718645J976013
593.5D83053267Q03024J82271j14888k40624k21610q3506P7664N03749J182973J747311
613.9D86889631K252757K829045L354430L802568M136592M153133L747344L036797
630.2E14202297K426326K133727K044618J928866J650512J447261J433789J344324
646.6E28611720J173555J109481J204014J341939J330316J221419J088023R23156Q99137
664.9E38902760J418530K020896J558244J475096J754463J710653J516223J455188
$$ y = [487744570, 491649061, 493408948, 493394166, 492141187, 490249038, 487966895, 485062242, 481201500, 476312518, 470415264, 463652432, 456276834, 448792368, 442422092, 438418716, 437245399, 438838422, 442954570, 449184358, 456768423, 464622229, 471745908, 477358609, 481077254, 483053267, 483856291, 484038562, 483923674, 483683050, 483461440, 483377934, 483455598, 483959347, 485142320, 486889631, 489142388, 491971433, 495325863, 499128431, 503265023, 507418156, 511165500, 514202297, 516628623, 518762350, 520806968, 522735834, 524386346, 525833607, 527267396, 528611720, 529785275, 530894756, 532098770, 533440709, 534771025, 535992444, 537080467, 538003623, 538902760, 540321290, 542342186, 543900430, 545375526, 547129989, 548840642, 550356865, 551812053]
681.2E51812053J493990J391649J015246M92871q3625p95663j574933k355337k965868
699.6E48430383l216743l110349k506972j400053j00553J351475K916992M235149N147933
717.9E51747262N829990O270647O359101O156444N736232N221546M721820M199326
734.3E96242368L534556K655148J652777N81265n75900j750946k837718l842115m619241
752.6E91040194n102158n439102n433142m703045l276348j397431P00652K789915M794061
771E73973596O562710P918239Q877277R380996R170234Q298755P167935N917013M762769
789.3F42029524M123092M067242M380464M804254M926622M463315L492594K408385
805.6F74695492J688361J388073J238108R76204N90444J37687k77639n44965p59899
$$ y = [551812053, 553306043, 554697692, 555712938, 556205809, 556122184, 555326521, 553751588, 551396251, 548430383, 545213640, 542103291, 539596319, 538196266, 538095713, 539447188, 542364180, 546599329, 551747262, 557577252, 563847899, 570207000, 576363444, 582099676, 587321222, 592043042, 596242368, 599776924, 602432072, 604084849, 604666114, 604090214, 602339268, 599501550, 595659435, 591040194, 585938036, 580498934, 575065792, 570362747, 567086399, 565688968, 566389620, 569179535, 573973596, 580536306, 588454545, 597331822, 606712818, 615883052, 624181807, 631349742, 637266755, 642029524, 646152616, 650219858, 654600322, 659404576, 664331198, 668794513, 672287107, 674695492, 676383853, 677771926, 679010034, 679986238, 680576682, 680714369, 680436730, 679891765, 679131866]
824F79131866j173497k001583l193558m504442n535066n912721n674362n151332m561126
842.4F41424179m150808m153013m508615m967153n317568n550921n683661n149007
858.7F01943433k717912J793504O545186R887397J1938930J3102472J2919485J0876238
875F66288733P431746L588080k3663k907872m698157n592644o023229o192564o190718
893.4F45679712o042242n735755n402267n187690n350172o204069p613778r142757
909.7E95000982j0449588j1261284j1389315j0696412r124159o861508m482925k601743
926E28134048j193285J41323J608550L078580M151762M769265N246699N367160M245698
944.3E55549800J302064k921462p256687j0951459j3752997j5623272j6721040j7370015
$$ y = [679131866, 677958369, 675956786, 672763228, 668258786, 662723720, 656810999, 651136637, 645985305, 641424179, 637273371, 633120358, 628611743, 623644590, 618327022, 612776101, 607092440, 601943433, 599225521, 601019025, 607564211, 617451608, 629390538, 642493010, 655412495, 666288733, 673720479, 677308559, 677284896, 674377024, 669678867, 664086223, 658062994, 651870430, 645679712, 639637470, 633901715, 628499448, 623311758, 617961586, 611757517, 604143739, 595000982, 584551394, 573290110, 561900795, 551204383, 542080224, 535218716, 530735791, 528134048, 526940763, 527082086, 528690636, 531769216, 535920978, 540690243, 545936942, 551304102, 555549800, 556851864, 553930402, 546673715, 535722256, 521969259, 506345987, 489624947, 472254932]
960.7D72254932j7842144j8321305j9010544j9847214k0500899k0732969k0474672
974.9C35525185j9652546j8183976j6129613j3688803j1082142q506716o128877m034370
991.3B38118142k294973r36761M411N40346P82087P47010L90351j57714o47083q62792
1011.6B35683024o50108j11818N72979J328275K139836K966285L674492M120618M205138
1030B53928721L942937L372609K534718J581639Q44866N19603N40793Q11607J370072
1048.4B69447565K417326L989995N747526P242173Q400917R483904J0504246J0665178
1064.7C27898830Q453012K825200m800468j0529072j1488407q498609m371465q80062
1081B98608959J749754L709346N069971O027371O726652O988019O577819N431056L757030
$$ y = [472254932, 454412788, 436091483, 417080939, 397233725, 376732826, 355999857, 335525185, 315872639, 297688663, 281559050, 267870247, 256788105, 248281389, 242152512, 238118142, 235823169, 234886408, 234890819, 235431165, 236213252, 236960262, 237350613, 237192899, 236545816, 235683024, 235032916, 234921098, 235494077, 236822352, 238962188, 241928473, 245602965, 249723583, 253928721, 257871658, 261244267, 263778985, 265360624, 266205490, 266725093, 267265886, 268077493, 269447565, 271864891, 275854886, 281602412, 288844585, 297245502, 306729406, 317233652, 327898830, 336351842, 339177042, 334376574, 323847502, 312359095, 303860486, 299489021, 298608959, 300358713, 304068059, 309138030, 315165401, 321892053, 328880072, 335457891, 340888947, 344645977]
1099.4C44645977K052337R45747Q83162J855254L256023M352570M830956M694372M048258
1117.7C71564656L073812K142459J713842K136976L363132M763931N358100M390240
1134C98507148J850933j585871m959583p417351q627326q774638q143306o992697n459816
1152.4C48397493l673732j854122o3032J779706L789246N992085Q267998J0435611
1168.7C73071253J2364656J3903737J4891982J5301645J5252382J4830678J4028728
1183D73645061J2924642J1610806J0018706Q123100O139993M293204K798080J896084
1199.3E31449676J604259J765430K260327K980649L788531M547894N066693N165994
1215.6E58629453M803300L998637K823413J460552J02222j056671j835823k199889
$$ y = [344645977, 346698314, 347644061, 348527223, 350382477, 353638500, 357991070, 362822026, 367516398, 371564656, 374638468, 376780927, 378494769, 380631745, 383994877, 388758808, 394116908, 398507148, 400358081, 398772210, 393812627, 386395276, 377767950, 368993312, 360850006, 353857309, 348397493, 344723761, 342869639, 342806607, 344586313, 348375559, 354367644, 362635642, 373071253, 385435909, 399339646, 414231628, 429533273, 444785655, 459616333, 473645061, 486569703, 498180509, 508199215, 516322315, 522462308, 526755512, 529553592, 531449676, 533053935, 534819365, 537079692, 540060341, 543848872, 548396766, 553463459, 558629453, 563432753, 567431390, 570254803, 571715355, 571817577, 570760906, 568925083, 566725194]
1231.9E66725194k218604k024352j779854j497508j027941l09766N60701J378298J968503
1250.3E61774671K271652K248466J906693J377106R40382Q28147J113832J756251K424598
1268.6E76641798K666533K320409J535117N94557k05994o81043q23080p89344p80464
1287E80478489r10639j181782j547575j960992k313912k488375k455235k321899k306759
1305.4E62991321k397776k288580j912176j512408j273513j220405j368046j916707
1321.7E49101710l036797m472077n640864o144702n924881n158067m122555k945840
1338E11655927j622498m12166L15725O46711O62148L68476n2631m74572p99239j011789
1358.4E09276092j140892j023531n65708k69115j62184J33812N95331J162291J453221
$$ y = [566725194, 564506590, 562482238, 560702384, 559204876, 558176935, 557867169, 558427870, 559806168, 561774671, 564046323, 566294789, 568201482, 569578588, 570518970, 571347117, 572460949, 574217200, 576641798, 579308331, 581628740, 583163857, 583758414, 583552420, 582871377, 582048297, 581258953, 580478489, 579567850, 578386068, 576838493, 574877501, 572563589, 570075214, 567619979, 565298080, 562991321, 560593545, 558304965, 556392789, 554880381, 553606868, 552386463, 551018417, 549101710, 546064913, 541592836, 535951972, 529807270, 523882389, 518724322, 514601767, 511655927, 510033429, 509621263, 509936988, 510583699, 511245847, 511614323, 511561692, 511087120, 510287881, 509276092, 508135200, 507111669, 506545961, 506276846, 506114662, 506248474, 506843805, 508006096, 509459317]
1376.7E09459317J401424J447737J867950K796054M176259M752875L711998K289534
1393.1E31903148J075267L3498q17418j296758j701713k145410k198755k176702k234459
1411.4E20440698k077818j819670j698137j187265k12729M29988Q81851J192391J474082
1429.8E17423391J748562J732588J919270K420306K281964J954019J534640Q23915
1446.1E31838655j6331p21872j249194j728058k424836j870573J43886J207530K480090
1464.5E27659297M186153N136133O526649R716391J1128426R883404Q794486Q182287
1480.8E91213226P807613O961226O330431O511211O687582N478918M500985M709244
1497.1F40200436M752100M064440L111780K631664L507614L774524K995491K511561
$$ y = [509459317, 510860741, 512308478, 514176428, 516972482, 521148741, 525901616, 529613614, 531903148, 532978415, 533011913, 532194495, 530897737, 529196024, 527050614, 524851859, 522675157, 520440698, 518362880, 516543210, 514845073, 513657808, 513445079, 513875067, 514756918, 515949309, 517423391, 519171953, 520904541, 522823811, 525244117, 527526081, 529480100, 531014740, 531838655, 531822324, 531100452, 529851258, 528123200, 525698364, 523827791, 523971677, 525179207, 527659297, 531845450, 536981583, 543508232, 553224623, 564353049, 574236453, 583030939, 591213226, 599020839, 605982065, 612312496, 618823707, 625511289, 630990207, 635491192, 640200436, 644952536, 649016976, 652128756, 654760420, 658268034, 662042558, 665038049, 667549610]
1513.4F67549610K223492K289891K219677K296805K406896K138376K138138J933157
1529.7F85196042J521528J480341J388669P20382L94284R78768J293063J140356O58274
1548.1F94771707J95384o3717l10064o98268j300871p09713K0742o46591j317024j838922
1568.5F88102663j917124j355410j674175k396643j957536j788974k277970k469480
1584.8F72265351k398491k340257k396286k503514k624095k673029k690137k723575
1601.1F51915967k636790k537966k665400k965927l059268l088892l684163m015088
1617.4F27262473k780795k467215l122866l097713k982259k763569k092600j878560
1633.7F06076896j847982p29025M7446J62184J63972M80712J633823J947164K112448
$$ y = [667549610, 669773102, 672062993, 674282670, 676579475, 678986371, 681124747, 683262885, 685196042, 686717570, 688197911, 689586580, 690306962, 690701246, 691680014, 692973077, 694113433, 694771707, 694967091, 694903374, 694593310, 693895042, 692594171, 691884458, 691905200, 691258609, 689941585, 688102663, 686185539, 684830129, 683155954, 680759311, 678801775, 677012801, 674734831, 672265351, 669866860, 667526603, 665130317, 662626803, 660002708, 657329679, 654639542, 651915967, 649279177, 646741211, 644075811, 641109884, 638050616, 634961724, 631277561, 627262473, 624481678, 622014463, 618891597, 615793884, 612811625, 610048056, 607955456, 606076896, 604228914, 603499889, 603547335, 603709519, 603873491, 604354203, 605988026, 607935190, 610047638]
1652.1F10047638L894747L899812L154934L226101L890872M492343M086435M199743
1668.4F40892625N125582M871786M862427N425334M944444M307330M578113O292522
1684.7F81300163N860210M424631M186631L573596L289640L423691L156125L364683
1701.1G12579370K733767J876294J863897J886010J705826J481294J306117J596510
1717.4G27029085K039373J871884J733541J929284J969456J900196J682937J813233
1733.7G41968989K318144K045572J988053K328098K449811K383351K294600K559721
1750G60336339L013313K801061K547681K588034K430081K435327K263546J700163J309275
1768.4G81424820J200855J532674J948416J716137J268566J024544R69350J004160
$$ y = [610047638, 613942385, 617842197, 620997131, 624223232, 628114104, 632606447, 636692882, 640892625, 646018207, 650889993, 655752420, 661177754, 666122198, 670429528, 675007641, 681300163, 687160373, 691585004, 695771635, 699345231, 702634871, 706058562, 709214687, 712579370, 715313137, 717189431, 719053328, 720939338, 722645164, 724126458, 725432575, 727029085, 729068458, 730940342, 732673883, 734603167, 736572623, 738472819, 740155756, 741968989, 744287133, 746332705, 748320758, 750648856, 753098667, 755482018, 757776618, 760336339, 763349652, 766150713, 768698394, 771286428, 773716509, 776151836, 778415382, 780115545, 781424820, 782625675, 784158349, 786106765, 787822902, 789091468, 790116012, 791085362, 792089522]
1784.7G92089522J101494R97364P88391R79125J133263Q77440O82891Q60155J155853
1803H00665498J142025R11057O59406N88655O92726P51018P75993Q31544P14481M40479
1823.4H08172882L44514L40999L72052P04944Q52764O39319M81606L24249K205j22607
1843.8H12112927L07143O31571N95927M51684K25604N3465L6717J53124K77758K89738
1864.2H15135658J16884J3769K48254L90827L13342L30627M51863M74333L88682K73466
1884.6H18137705J00196Q940K45929M80771M94004M49895K56539P15r5427j6391J23143
1907.1H20186019K87890M04001K91288l8922k85685j45376J22905L44515N25355M17471
1927.5H22109461R1970j32621j36137j5556J46508K36750K53736K71619J61171l2783
$$ y = [792089522, 793191016, 794188380, 794976771, 795955896, 797089159, 797966599, 798649490, 799509645, 800665498, 801807523, 802718580, 803377986, 803966641, 804659367, 805410385, 806186378, 807017922, 807732403, 808172882, 808517396, 808858395, 809230447, 809935391, 810788155, 811427474, 811909080, 812233329, 812235534, 812112927, 812420070, 813051641, 813647568, 814099252, 814324856, 814378321, 814415038, 814568162, 814845920, 815135658, 815252542, 815266311, 815514565, 815905392, 816218734, 816549361, 817001224, 817475557, 817864239, 818137705, 818237901, 818246841, 818492770, 818973541, 819467545, 819917440, 820173979, 820174694, 820079267, 820062876, 820186019, 820473909, 820877910, 821169198, 821130276, 820844591, 820699215, 820822120, 821166635, 821691990, 822109461, 822201431, 822068810, 821932673, 821917117, 822063625, 822300375, 822554111, 822825730, 822986901, 822954118]
1947.9H22954118n6863J28389L68655M80234L82781J79231j3649j28210o8247K09570
1968.3H24436009M67300M91143L03447O854j76131j35601M9710K37704L06666K04980
1988.7H26192081j6987j65940j44303m5776J00374K25544J89722j0431k69174m50135
2009H25604975m55558l13163j56879q3745j52707l85642p07507q11815m76301j15812
2029.4H21945846n7876j41740k71737m30704n45144n27739l80039j74523j6630q761
2049.8H19390953j12772k02477k22266j59502K682J81079K43902J82092O4373o0439
2070.2H19307625r5367k3425O5625J40667J92940J65105M8399n0128n2928L2007J54495
2092.7H19885015K49565K75672K33590J43707O1631N5373J08302J77919K22385K09630
$$ y = [822954118, 822897255, 823025644, 823394299, 823874533, 824257314, 824436545, 824422896, 824294686, 824226439, 824436009, 824903309, 825394452, 825697899, 825704753, 825528622, 825393021, 825442731, 825680435, 825987101, 826192081, 826175094, 826009154, 825864851, 825819075, 825919449, 826144993, 826334715, 826324284, 826055110, 825604975, 825149417, 824836254, 824679375, 824595630, 824442923, 824057281, 823349774, 822537959, 822061658, 821945846, 821887970, 821746230, 821474493, 821043789, 820498645, 819970906, 819590867, 819416344, 819399714, 819390953, 819278181, 819075704, 818853438, 818693936, 818696618, 818877697, 819121599, 819303691, 819368064, 819307625, 819212258, 819188833, 819254458, 819395125, 819588065, 819753170, 819801569, 819751441, 819698513, 819730520, 819885015, 820134580, 820410252, 820643842, 820787549, 820849180, 820904553, 821012855, 821190774, 821413159, 821622789]
2113.1H21622789J47581O1035q166l2365k2531L9041J26303J44481R2566J5200o0797
2135.5H22125137q7857l5763N7161J35719J83464J59740M8757n7698n7816N8770K29061
2157.9H22758675L74615M28438L54111K22326J57356K50697M65929O36340O84201O13273
2178.3H26945961M55677K78890J94907K80917M69625O16193O31749N19872L02911J06990
2198.7H30803692J10567L00944N19693O52253O13630L93093J65760Q6367J76788L94583
2219.1H34217370N90682O11722M44651J79290k5033j6213J80900M08232N35310M79042
2239.5H37605953K32458o3121j90675l1770K68162M85062N23925L44396O7592r6620
2259.9H39145362q5175Q6189L55184N65171N32508K23338j24692k51174j05024K21491
$$ y = [821622789, 821770370, 821831405, 821823239, 821790874, 821768343, 821807384, 821933687, 822078168, 822170734, 822185934, 822125137, 822037280, 822001517, 822058678, 822194397, 822377861, 822537601, 822586358, 822528660, 822470844, 822529614, 822758675, 823133290, 823561728, 823915839, 824138165, 824295521, 824546218, 825012147, 825648487, 826332688, 826945961, 827401638, 827680528, 827875435, 828156352, 828625977, 829242170, 829873919, 830393791, 830696702, 830803692, 830914259, 831215203, 831734896, 832387149, 833000779, 833393872, 833559632, 833645999, 833822787, 834217370, 834808052, 835419774, 835864425, 836043715, 836018682, 836002469, 836183369, 836591601, 837126911, 837605953, 837838411, 837775290, 837584615, 837552845, 837821007, 838306069, 838829994, 839174390, 839241982, 839145362, 839060187, 839146376, 839501560, 840066731, 840599239, 840822577, 840697885, 840446711, 840341687, 840563178]
2280.3H40563178N27680N97477L57985k4139k52665j88946Q5652M08530N69641M41075
2300.7H43085468J23322j71185k36511k801L78847O12795N35965L06130Q0525o9141
2321.1H44643414n2452J11222L58105N40912L56138j63317n10931m48406j88052Q523
2341.5H44655156j2159l28124n95867m48466n2750L28779N61357N69403L01838j45793
2361.9H44833374o65367r97424r67800p62880n89133m81188n17487p08998q53002p76529
2382.3H37513566n14805k20716L576N2929j43766m27962n47290m51863k66313r7573
2402.7H34899783m5895j66178m20511o61135o92963n04554k66194j65164k89560n46753
2423.1H31140876p67708q36134p04348m87447l48151l86655o00397q15690q65817p49409
$$ y = [840563178, 841090858, 841688335, 842046320, 842022181, 841769516, 841580570, 841666222, 842074752, 842644393, 843085468, 843208790, 843037605, 842801094, 842798293, 843177140, 843789935, 844325900, 844632030, 844712555, 844643414, 844590962, 844702184, 845060289, 845601201, 845957339, 845794022, 845283091, 844834685, 844646633, 844655156, 844642997, 844314873, 843719006, 843270540, 843217790, 843546569, 844107926, 844677329, 844979167, 844833374, 844168007, 843170583, 842202783, 841439903, 840850770, 840369582, 839852095, 839143097, 838290095, 837513566, 836998761, 836778045, 836781621, 836834550, 836690784, 836262822, 835715532, 835263669, 834997356, 834899783, 834853888, 834687710, 834267199, 833606064, 832913101, 832408547, 832142353, 831977189, 831687629, 831140876, 830373168, 829537034, 828832686, 828345239, 827997088, 827610433, 827010036, 826194346, 825328529, 824579120]
2443.5H24579120n68807m15087l99232n33640o91712q17478q21650o34074m02272k95222
2463.9H18999946l87370o20783q08179q24571o48498l94643k51293l05891n12600p15256
2484.3H13530862p80463o56605l72409j23978j16289l11553n14388o04034n71668m08828
2504.7H09070647j63615o199r3639l99887o73652p08163n38409k99871j47223k19464
2525.1H05820525m79937p38382q78334q60691o56248l88979l08037m89235p76708r71258
2545.5G99272716r50873p24614m65869l68178m68672o85691q98719r83179q43525n60164
2565.8G92323232l23892k70188m85480q18133r98795r32157o60062l66807k36094l19004
2586.2G86912620n98609q61168q38757o00159l31283j35660j60456m17053p20561q84175
$$ y = [824579120, 824010313, 823595226, 823195994, 822662354, 821970642, 821153164, 820331514, 819697440, 819295168, 818999946, 818612576, 817991793, 817183614, 816359043, 815710545, 815315902, 815064609, 814758718, 814246118, 813530862, 812750399, 812093794, 811721385, 811597407, 811481118, 811169565, 810655177, 810051143, 809479475, 809070647, 808907032, 808900833, 808807194, 808407307, 807733655, 807025492, 806487083, 806187212, 806039989, 805820525, 805340588, 804602206, 803723872, 802863181, 802206933, 801817954, 801509917, 801020682, 800243974, 799272716, 798321843, 797597229, 797131360, 796763182, 796294510, 795608819, 794710100, 793726921, 792883396, 792323232, 791999340, 791729152, 791243672, 790425539, 789426744, 788494587, 787834525, 787467718, 787231624, 786912620, 786314011, 785452843, 784614086, 784013927, 783682644, 783546984, 783386528, 782969475, 782248914, 781364739]
2606.6G81364739q32260o58571n25177n20349o64949r41336j207769j267433j129091
2625G73617804r41276q12948q71301j138985j424015j520216j399398j186967j003146
2643.4G63319552r37104j047015j283467j477957j465082j258254j002670q53300r13262
2661.7G53081441j121104j320541j369893j206696r45568p57218p39038q92162j079798
2680.1G43649423j159787j100063r41813p81060p18057p94351r98914j234114j313448
2698.4G34607816j192987j007736r18567j008153j197338j348973j366734j233995
2714.7G25333333j040161q91864q43286r23515j075387j148641j079321q84950o75201
2733.1G16771007n90742o58512q26359r52601r41515q51334p17222n88000n93901p30037
$$ y = [781364739, 780532479, 779873908, 779348731, 778828382, 778163433, 777222097, 776014328, 774746895, 773617804, 772676528, 771863580, 770992279, 769853294, 768429279, 766909063, 765509665, 764322698, 763319552, 762382448, 761335433, 760051966, 758574009, 757108927, 755850673, 754848003, 753994703, 753081441, 751960337, 750639796, 749269903, 748063207, 747117639, 746360421, 745621383, 744729221, 743649423, 742489636, 741389573, 740447760, 739666700, 738948643, 738154292, 737155378, 735921264, 734607816, 733414829, 732407093, 731488526, 730480373, 729283035, 727934062, 726567328, 725333333, 724293172, 723401308, 722558022, 721634507, 720559120, 719410479, 718331158, 717446208, 716771007, 716180265, 715521753, 714695394, 713742793, 712801278, 711949944, 711232722, 710644722, 710050821, 709320784]
2753.5G09320784q34346q04126p05541n94437m76658m60625o02245p95007r27448r35435
2773.9G02184916q47161p75874p91669r24766j142919j319885j381338j360297j291633
2792.2F92349374j255572j341044j529634j747966j909375j951278j869797j782954
2808.6F78961754j829565j998067k199769k344548k367080k330303k339303k387286
2824.9F61165833k475976k626777k819956k982378l008008k957522k998889l169715
2841.2F38126612l435254l757060l978729l956080l679752l274679k953470k858818
2857.5F10232770l028690l394604l816128m219890m604220m946411n259573n573988
2873.8E75389266n787611n679131n166053m414797l590226k775073k064765j503229
$$ y = [709320784, 708486438, 707682312, 706976771, 706382334, 705905676, 705445051, 704842806, 704047799, 703120351, 702184916, 701337755, 700561881, 699770212, 698845446, 697702527, 696382642, 695001304, 693641007, 692349374, 691093802, 689752758, 688223124, 686475158, 684565783, 682614505, 680744708, 678961754, 677132189, 675134122, 672934353, 670589805, 668222725, 665892422, 663553119, 661165833, 658689857, 656063080, 653243124, 650260746, 647252738, 644295216, 641296327, 638126612, 634691358, 630934298, 626955569, 622999489, 619319737, 616045058, 613091588, 610232770, 607204080, 603809476, 599993348, 595773458, 591169238, 586222827, 580963254, 575389266, 569601655, 563922524, 558756471, 554341674, 550751448, 547976375, 545911610, 544408381]
2890.1E44408381j041651p04884n46515n16773o07311q40009j162409j526475j878143
2908.5E35584211k188205k564073l054738l537416l863156l970266l800571l284573
2924.8E09321213k500594j580775n65350N81026J835585L076076M178286N060256N667865
2943.2E25073588O009698O166756O231427O255150O193995O094277O070376O017625
2959.5E74112892N727589N172074M553378M046678L724754L651619L700256L675104
2975.8F08364344L603160L471494L174185K830387K612352K472222K280116J953304
2992.1F30761564J527905J172126Q76605N74052L25203P4983k09928m91082p93934
3010.5F33817494j132190j443208j637995j729846j820922j987815k240061k452970
$$ y = [544408381, 543366730, 542661846, 542115331, 541598558, 540991247, 540151238, 538988829, 537462354, 535584211, 533396006, 530831933, 527777195, 524239779, 520376623, 516406357, 512605786, 509321213, 506820619, 505239844, 504674494, 505255520, 507091105, 510167181, 514345467, 519405723, 525073588, 531083286, 537250042, 543481469, 549736619, 555930614, 562024891, 568095267, 574112892, 579840481, 585012555, 589565933, 593612611, 597337365, 600988984, 604689240, 608364344, 611967504, 615438998, 618613183, 621443570, 624055922, 626528144, 628808260, 630761564, 632289469, 633461595, 634338200, 634912252, 635237455, 635312438, 635102510, 634611428, 633817494, 632685304, 631242096, 629604101, 627874255, 626053333, 624065518, 621825457, 619372487]
3026.8F19372487k476156k378046k323568k443254k659440k712429k716243k850413
3043.1E98812938k939105k905369k818942k783418k868593k974569l062845l116071
3059.4E75344026l026605k846360k761245k885162l129363l220857l053128k791345
3075.7E51629961k664924k789319k970397l028393l062189l058910k989531l030478
3092.1E28035820l095389k941310k746702k823412l036618l008902k764464k659321
3108.4E04959702k767860k774090k633125k643257k788484k913863k976000k900332
3124.7D82562691k714872k589316k654492k781362k723127k503306k403438k562732
3141D61630046k707898k648384k524197k366870k231002k315969k526789k565027k459645
$$ y = [619372487, 616896331, 614518285, 612194717, 609751463, 607092023, 604379594, 601663351, 598812938, 595873833, 592968464, 590149522, 587366104, 584497511, 581522942, 578460097, 575344026, 572317421, 569471061, 566709816, 563824654, 560695291, 557474434, 554421306, 551629961, 548965037, 546175718, 543205321, 540176928, 537114739, 534055829, 531066298, 528035820, 524940431, 521999121, 519252419, 516429007, 513392389, 510383487, 507619023, 504959702, 502191842, 499417752, 496784627, 494141370, 491352886, 488439023, 485463023, 482562691, 479847819, 477258503, 474604011, 471822649, 469099522, 466596216, 464192778, 461630046, 458922148, 456273764, 453749567, 451382697, 449151695, 446835726, 444308937, 441743910, 439284265]
3159.4D39284265k408564k388746k302289k189338k134323k114713k113402k145469
3175.7D21487421k149165k092451k029091j980573j938939j906067j909822j946301
3192D05535012j972019j939118j800627j681923j696826j735895j717687j685977j647592
3210.3C89657348j588344j542419j506985j504153j549780j560211j511634j446127
3226.7C77447695j338274j156926j075715j284033j496970j454652j332581j201212
3243C67107332j045376j048386j214475j252383j113862r99450j008779j045466j005292
3261.3C57373863r41842r14932q46564p10845p51049r31680r88632r77785r35256q72582
3281.7C48502696q72434q48561p14123n47946n23984o87361q78036r71854r08047o98268
$$ y = [439284265, 436875701, 434486955, 432184666, 429995328, 427861005, 425746292, 423632890, 421487421, 419338256, 417245805, 415216714, 413236141, 411297202, 409391135, 407481313, 405535012, 403562993, 401623875, 399823248, 398141325, 396444499, 394708604, 392990917, 391304940, 389657348, 388069004, 386526585, 385019600, 383515447, 381965667, 380405456, 378893822, 377447695, 376109421, 374952495, 373876780, 372592747, 371095777, 369641125, 368308544, 367107332, 366061956, 365013570, 363799095, 362546712, 361432850, 360433400, 359424621, 358379155, 357373863, 356432021, 355517089, 354670525, 353959680, 353208631, 352276951, 351288319, 350310534, 349375278, 348502696, 347630262, 346781701, 346067578, 345519632, 344995648, 344308287, 343430251, 342458397, 341550350, 340852082]
3302.1C40852082n22763n98162q89331j123756j137674j023025r51558q92341p95663
3320.5C32917809p66783q23707r37164j018315r77963r00835p81417o59168p65234
3338.8C25287223r85921j048713j041860r51677p26462p14719r74775j110374r73076
3357.2C16759646p91192p99984q33094o32316n07653p85380j156360j136810q29577
3375.5C09287280o77824o94156p26968o61462n05329l34024j74880k68489n84781o08713
3395.9C04050654k09927k2620m02868p48694n67377k37643j10686j21624k50160l68029
3416.3C01011026k64585r4950m8191K6942K04026L34055K76207K48522L30180J83344
3436.7C02206576o2347K2352L01272M07785M07219M39703M99994N88030O62595P58022
$$ y = [340852082, 340329319, 339731157, 338841826, 337718070, 336580396, 335557371, 334605813, 333713472, 332917809, 332151026, 331327319, 330390155, 329371840, 328393877, 327493042, 326711625, 326052457, 325287223, 324301302, 323252589, 322210729, 321259052, 320532590, 319817871, 318843096, 317732722, 316759646, 315968454, 315168470, 314335376, 313703060, 313195407, 312410027, 311253667, 310116857, 309287280, 308609456, 307915300, 307188332, 306526870, 306021541, 305687517, 305512637, 305244148, 304659367, 304050654, 303840727, 303818107, 303415239, 302666545, 302099168, 301861525, 301750839, 301629215, 301379055, 301011026, 300746441, 300651491, 300603300, 300630242, 300834268, 301168323, 301444530, 301693052, 302023232, 302206576, 302144229, 302166581, 302467853, 302875638, 303282857, 303722560, 304222554, 304810584, 305473179, 306231201]
3457.1C06231201Q39472P05063O59942R88245J185656Q79496M48347M14073O98179
3475.5C13049674J010656J039416P97838Q10266J037240J039326R36508R83447J100301
3493.8C21804672J196653J170904J103997J096189J024991R07451R49442J219333J460969
3512.2C31934601J367837J131267J118034J292944J464784J324117J037300J124829
3528.5C41795713J418054J576036J632690J560003J440197J536131J714587J738161
3544.8C54411572J657754J636565J635194J758516J997620K151400K299726K397239
3561.1C69945586K175659J930654K536982L291696L070474K748042K903521L169865
3577.5C91772479L383756L521978L327668K915859L160864L956944L885657L581524
$$ y = [306231201, 307070673, 307775736, 308435678, 309423923, 310609579, 311489075, 311937422, 312351495, 313049674, 314060330, 315099746, 315897584, 316707850, 317745090, 318784416, 319720924, 320704371, 321804672, 323001325, 324172229, 325276226, 326372415, 327397406, 328304857, 329254299, 330473632, 331934601, 333302438, 334433705, 335551739, 336844683, 338309467, 339633584, 340670884, 341795713, 343213767, 344789803, 346422493, 347982496, 349422693, 350958824, 352673411, 354411572, 356069326, 357705891, 359341085, 361099601, 363097221, 365248621, 367548347, 369945586, 372121245, 374051899, 376588881, 379880577, 382951051, 385699093, 388602614, 391772479, 395156235, 398678213, 402005881, 404921740, 408082604, 412039548, 415925205, 419506729]
3593.8D19506729L846317M128933M092872M089505L944695L579825L780961M230708
3610.1D51200545M165619M163951M080951M084826M801333M872590M093975L239125
3626.4D84702915L436148M882097M862100M360140M284024M175782M125595M048109
3642.7E18876910L602267L034651L583073N036116M783809L846288M072368M362524
3659E51198006L820061L471613L413558K931118K661467L366411L022551K535522L549755
3677.4E79970062L749251L381610L225923K827882K278209K156377K633274K807378
3693.7F03029966K572298K279401J915515J832306K188325K128065J537919J041293
3710F18525088J603842K611398K420545J771033J395821J348973J474380J743913J942515
$$ y = [419506729, 423353046, 427481979, 431574851, 435664356, 439609051, 443188876, 446969837, 451200545, 455366164, 459530115, 463611066, 467695892, 472497225, 477369815, 481463790, 484702915, 488139063, 493021160, 497883260, 502243400, 506527424, 510703206, 514828801, 518876910, 522479177, 525513828, 529096901, 534133017, 538916826, 542763114, 546835482, 551198006, 555018067, 558489680, 561903238, 564834356, 567495823, 570862234, 573884785, 576420307, 579970062, 583719313, 587100923, 590326846, 593154728, 595432937, 597589314, 600222588, 603029966, 605602264, 607881665, 609797180, 611629486, 613817811, 615945876, 617483795, 618525088, 620128930, 622740328, 625160873, 626931906, 628327727, 629676700, 631151080, 632894993, 634837508]
3728.4F34837508J500368Q29101P36833J545786K167106J524746K27452K54571J467884
3746.7F45091355R36866M56571J639307K109408J463592J034200J307488J274645R13859
3765.1F56227291Q61585R06527J203596J405895J119793P82072P72596J032888R39906
3783.5F65252149Q55982J081527J091003R37283P22110N98610O83069K93553L09527
3801.8F71824813J113653R12190Q78930J376629J162409M17650J78695N52296L30031
3820.2F78747296P29502J285612R21071O96420N84484N80191O77884K63572R179N71489
3840.6F85066700J025498J211941J147926O77705l24190j191437M27782J931251J367390
3858.9F91340566M82738M4882M32849O00755Q1360K92838Q07524J018524Q81076K65539
$$ y = [634837508, 636337876, 637166977, 637903810, 639449596, 641616702, 643141448, 643368900, 643623471, 645091355, 646028221, 646484792, 648124099, 650233507, 651697099, 652731299, 654038787, 655313432, 656227291, 657088876, 657995403, 659198999, 660604894, 661724687, 662506759, 663279355, 664312243, 665252149, 666108131, 667189658, 668280661, 669217944, 669940054, 670538664, 671221733, 671515286, 671824813, 672938466, 673850656, 674729586, 676106215, 677268624, 677686274, 677864969, 678417265, 678747296, 679476798, 680762410, 681683481, 682379901, 682964385, 683544576, 684222460, 684486032, 684495211, 685066700, 686092198, 687304139, 688452065, 689129770, 688805580, 687614143, 688041925, 689973176, 691340566, 691823304, 691868186, 692301035, 692901790, 692983150, 693275988, 694083512, 695102036, 695983112, 696248651]
3879.3F96248651L51011O12915M08709N31733L29971K05875Q02278Q29220J11938l33310
3899.7G00098991j67787K91348R06408J049757O75380L63469P7486j45197R1195M46439
3920.1G03687489L50416K06470L96729L79026P6890J87039N68688N45084K87950N9426
3940.5G06745207L8207L04639L41833K06828K98083L76880L15130K50458J85311J50144
3960.9G09212720K00749K20775K16544K83897K94924J92702J47283J91450K28405L05474
3981.3G11494923K97606J14858O8605J57773J33395J65523K93433K85983
3997.6G13012099
$$ y = [696248651, 696599662, 697212577, 697621286, 698153019, 698482990, 698688865, 699491143, 700320363, 700432301, 700098991, 699931204, 700222552, 701128960, 702178717, 702854097, 703217566, 703295052, 703149855, 703241050, 703687489, 704037905, 704244375, 704641104, 705020130, 705097020, 705284059, 705852747, 706397831, 706685781, 706745207, 706783414, 707088053, 707429886, 707636714, 707934797, 708311677, 708626807, 708877265, 709062576, 709212720, 709413469, 709634244, 709850788, 710134685, 710429609, 710622311, 710769594, 710961044, 711189449, 711494923, 711792529, 711907387, 711975992, 712133765, 712267160, 712432683, 712726116, 713012099]
##END=$$ End of the data block
