##TITLE=$$ Begin of the data block
##JCAMP-DX=5.00 $$ ACD/SpecManager v 10.08
##SPECTROMETER/DATA SYSTEM=Alpha
##DATE=29 Dec 2014 15:06:02
##DATA TYPE=INFRARED SPECTRUM
##DATA CLASS=XYDATA
##ORIGIN=
##OWNER=
##NPOINTS=1765
##FIRSTX=399.76428223
##LASTX=3997.64306641
##MAXX=3997.64306641
##MINX=399.76428223
##MAXY=0.84700537
##MINY=0.23504400
##XFACTOR=1.0000000000
##YFACTOR=1.000000000000000e-9
##FIRSTY=0.55811030
##DELTAX=2.03961372
##XUNITS=1/CM
##YUNITS=ARBITRARY UNITS
##XYDATA=(X++(Y..Y))
399.8E58110297q424044n389512k062022M18782J783073J963675J195073K88844p72714
418.1E47111452j388610n95927q22902k738535m262805m598379m140318k940416j106083
436.5E24517477J093387K858699L472328L495276L662347L687978L582001L179908
452.8E49549401J562536q15511k542556k931594k527237j802147j625001k430678l815054
471.2E32622159m810930m244089k830982j390100j15692L85940r3937q75890j310170
489.5E17336309j303971r69887p66039j093745j843512k739370l432512l685832l480822
507.9D98020619l194511l347277l824950m572928n231201m936606l768355k405524
524.2D66739267j096427r5010L23892N48928J427740L349245N448699O518483N819559
$$ y = [558110297, 549686253, 544296741, 542234719, 542653501, 544436574, 546400249, 547595322, 547884166, 547111452, 545722842, 545126915, 544304013, 541565478, 537302673, 532704294, 528563976, 525623560, 524517477, 525610864, 528469563, 531941891, 535437167, 539099514, 542787492, 546369493, 549549401, 551111937, 550296426, 547753870, 544822276, 542295039, 540492892, 538867891, 536437213, 532622159, 527811229, 523567140, 520736158, 519346058, 519230366, 519616306, 519522369, 518646479, 517336309, 516032338, 515062451, 514296412, 513202667, 511359155, 508619785, 505187273, 501501441, 498020619, 494826108, 491478831, 487653881, 483080953, 477849752, 472913146, 469144791, 466739267, 465642840, 465547830, 465871722, 466420650, 467848390, 471197635, 476646334, 483164817, 488984376]
542.5D88984376L708899J558513o1453j228720j890987k385109l043622l933102m980415
560.9D76728380n893439o649196p376224p448912o232262l993958j274496J548588
577.2D39408481M132807O225646P570207P916719P175922N518615L612817K002328
593.5D83563542Q87216K44826o0320k15113k60145j26451R7692N59807J247912J788587
613.9D87727553K243787K865612L443778L892839M209459M089713L593862L039002
630.2E15105605K569914K176762J895249J741707J610100J473725J426697J331985
646.6E29331744J120090J069725J259565J439333J388192J228094J111925R90450J009286
664.9E39948404J519203J900971J353085J373708J741171J748145J551270J507163
$$ y = [488984376, 492693275, 494251788, 494190335, 492961615, 491070628, 488685519, 485641897, 481708795, 476728380, 470834941, 464185745, 456809521, 449360609, 443128347, 439134389, 437859893, 439408481, 443541288, 449766934, 457337141, 465253860, 472429782, 477948397, 481561214, 483563542, 484450758, 484695584, 484635264, 484420151, 484160006, 484033555, 484131247, 484691054, 485938966, 487727553, 489971340, 492836952, 496280730, 500173569, 504383028, 508472741, 512066603, 515105605, 517675519, 519852281, 521747530, 523489237, 525099337, 526573062, 527999759, 529331744, 530451834, 531521559, 532781124, 534220457, 535608649, 536836743, 537948668, 538939118, 539948404, 541467607, 543368578, 544721663, 546095371, 547836542, 549584687, 551135957, 552643120]
681.2E52643120J528621J392901J063943N38885j14321q12292j562596k385318l014684
699.6E49278259l227234l065109k481758j421273o9320J424610K932012M185856N084872
717.9E52640915N792320O269991O405354O244242N807638N266011M728198M121184
734.3E97275853L472924K723575J709044N12302o46472j757085k836049l894865m717470
752.6E91841757n158603n435109n382478m605592l247320j536310N22614K772569M915416
771E74686944O658972P978260Q965493R435474R131313Q212805P085859N901456M827082
789.3F42883658M144967M033923M408181M872560M936993M402698L426253K389133
805.6F75498366J729846J438260J215280R28282N94437J68384k94567o67691q77023
$$ y = [552643120, 554171741, 555564642, 556628585, 557167470, 557053149, 556240857, 554678261, 552292943, 549278259, 546051025, 542985916, 540504158, 539082885, 539013565, 540438175, 543370187, 547556043, 552640915, 558433235, 564703226, 571108580, 577352822, 583160460, 588426471, 593154669, 597275853, 600748777, 603472352, 605181396, 605693698, 605047226, 603290141, 600454092, 596559227, 591841757, 586683154, 581248045, 575865567, 571259975, 568012655, 566476345, 566998959, 569771528, 574686944, 581345916, 589324176, 598289669, 607725143, 616856456, 625069261, 632155120, 638056576, 642883658, 647028625, 651062548, 655470729, 660343289, 665280282, 669682980, 673109233, 675498366, 677228212, 678666472, 679881752, 680810034, 681404471, 681572855, 681278288, 680610597, 679733574]
824F79733574j151740j949072l238559m618645n652725n965531n609214n023480m532933
842.4F41991675m298627m324437m541218m909217n280137n549908n668461n077243
858.7F02342427k629698J822234O531298R878576J1946082J3102829J2866378J0796309
875F66656435P342100L488123o6757k895892m712522n628884o017863o181300o224573
893.4F45758867o070494n711437n373954n201102n385875o254673p686913r199918
909.7E94874501j0448575j1245727j1391223j0690272r088456o813467m449308k559542
926E28187931j168192J19805J560867L020287M135132M781365N236149N375504M279077
944.3E55527925J296521k992094p347166j1000693j3769567j5648186j6757817j7370104
$$ y = [679733574, 678581834, 676632762, 673394203, 668775558, 663122833, 657157302, 651548088, 646524608, 641991675, 637693048, 633368611, 628827393, 623918176, 618638039, 613088131, 607419670, 602342427, 599712729, 601534963, 608066261, 617944837, 629890919, 642993748, 655860126, 666656435, 673998535, 677486658, 677419901, 674524009, 669811487, 664182603, 658164740, 651983440, 645758867, 639688373, 633976936, 628602982, 623401880, 618016005, 611761332, 604074419, 594874501, 584425926, 573180199, 561788976, 551098704, 542010248, 535196781, 530747473, 528187931, 527019739, 527139544, 528700411, 531720698, 535855830, 540637195, 545873344, 551248848, 555527925, 556824446, 553832352, 546485186, 535484493, 521714926, 506066740, 489308923, 471938819]
960.7D71938819j7822087j8334121j8994152j9786954k0481378k0758003k0456940
974.9C35305184j9569933j8096954j6063362j3651341j1083067q511871o091595l956109
991.3B38280952k236918r57846l9503N61118Q20458P52970L87192j76042o53491q32855
1011.6B35906035o68064j93968N34355J374543K213165L009409L657683M046068M130170
1030B54009396L930986L401547K542943J598954Q82805N22971N33432Q31127J394957
1048.4B69649118K411336L966302N750238P252932Q393437R461790J0455936J0588408
1064.7C27929497Q404523K864957m740477j0529250j1486530q439303m301995q29726
1081B98871696J803577L725767N015403N986035O735146O990373O555259N397052L732473
$$ y = [471938819, 454116732, 435782611, 416788459, 397001505, 376520127, 355762124, 335305184, 315735251, 297638297, 281574935, 267923594, 256840527, 248328656, 242237061, 238280952, 236044034, 235086188, 235046685, 235607803, 236428261, 237181231, 237568423, 237392381, 236738890, 235906035, 235237971, 235044003, 235578358, 236952901, 239166066, 242175475, 245833158, 249879226, 254009396, 257940382, 261341929, 263884872, 265483826, 266366631, 266889602, 267423034, 268254161, 269649118, 272060454, 276026756, 281776994, 289029926, 297423363, 306885153, 317341089, 327929497, 336334020, 339198977, 334458500, 323929250, 312442720, 304003417, 299701422, 298871696, 300675273, 304401040, 309416443, 315402478, 322137624, 329127997, 335683256, 341080308, 344812781]
1099.4C44812781K065569R74387Q81135J807749L200651M354983M870445M714757M051536
1117.7C71733993L067404K126634J710505K149701L374398M777640N344152M317790
1134C98602217J770646j614750m940599p387698q583098q720100q118183o965279n416155
1152.4C48627001l650457j836121m0829J797199L774792N924642Q208394J0455102
1168.7C73259723J2419820J3911665J4888793J5334427J5264422J4780134J3982117
1183D73841101J2946248J1628270R975165Q085192O135225M298866K812564J894891
1199.3E31617522J589418J774430K305925L036141L780544M476667N030632N192756
1215.6E58804035M816234L959716K794504J462519Q6665j068413j807809k164364k193689
$$ y = [344812781, 346878350, 347852737, 348733872, 350541621, 353742272, 358097255, 362967700, 367682457, 371733993, 374801397, 376928031, 378638536, 380788237, 384162635, 388940275, 394284427, 398602217, 400372863, 398758113, 393817514, 386429816, 377846718, 369126618, 361008435, 354043156, 348627001, 344976544, 343140423, 343099594, 344896793, 348671585, 354596227, 362804621, 373259723, 385679543, 399591208, 414480001, 429814428, 445078850, 459858984, 473841101, 486787349, 498415619, 508390784, 516475976, 522611201, 526910067, 529722631, 531617522, 533206940, 534981370, 537287295, 540323436, 544103980, 548580647, 553611279, 558804035, 563620269, 567579985, 570374489, 571837008, 571923673, 570855260, 569047451, 566883087, 564689398]
1234E64689398k004087j760543j480817j022220k98738N73039J359582J940727K267062
1252.3E64263403K236307J889169J407504J000941Q59261J117170J749515K388477
1268.6E76911747K621890K300322J532018O11424j76310o58751q18431q04007p85589
1287E80734313q86441j162171j555681j980484k326548k476931k417445k298593k327442
1305.4E63302577k424479k276123j881122j512766j299143j245439j403272j930893
1321.7E49329340k980351m419208n669534o179809n916179n120933m064798k919912
1338E12058616j650930m51207K88367O25432O53922L89994j1385m42028p94351j035273
1358.4E09631157j166046j016974n52178k89678j87755J26064N75244J146675J473367
$$ y = [564689398, 562685311, 560924768, 559443951, 558421731, 558122993, 558696032, 560055614, 561996341, 564263403, 566499710, 568388879, 569796383, 570797324, 571656585, 572773755, 574523270, 576911747, 579533637, 581833959, 583365977, 583977401, 583801091, 583142340, 582323909, 581519902, 580734313, 579847872, 578685701, 577130020, 575149536, 572822988, 570346057, 567928612, 565630019, 563302577, 560878098, 558601975, 556720853, 555208087, 553908944, 552663505, 551260233, 549329340, 546348989, 541929781, 536260247, 530080438, 524164259, 519043326, 514978528, 512058616, 510407686, 509956479, 510244846, 510870278, 511524200, 511914194, 511902809, 511460781, 510666430, 509631157, 508465111, 507448137, 506895959, 506606281, 506418526, 506544590, 507119834, 508266509, 509739876]
1376.7E09739876J425922J466691J872063K765000M142225M743993L702819K273858
1393.1E32132447J065016M3511p95484j319408j755714k170682k194167k158761k192795
1411.4E20653963k013028j753747j643539j188159k71320M00543Q93951J201212J477838
1429.8E17757714J767695J739263J910866K443552K303660J937627J523137Q51393
1446.1E32234907K325p41482j256466j704216k395987j861632J36971J192331K445758
1464.5E28052509M162073N162835O561458R727717J1137426R874999Q767307Q151293
1480.8E91597617P782936O985962O431163O612300O665647N405128M484415M721463
1497.1F40686631M747391M072130L134787K678454L572464L754735K931118K468109
$$ y = [509739876, 511165798, 512632489, 514504552, 517269552, 521411777, 526155770, 529858589, 532132447, 533197463, 533240974, 532445490, 531126082, 529370368, 527199686, 525005519, 522846758, 520653963, 518640935, 516887188, 515243649, 514055490, 513784170, 514184713, 515078664, 516279876, 517757714, 519525409, 521264672, 523175538, 525619090, 527922750, 529860377, 531383514, 532234907, 532237232, 531495750, 530239284, 528535068, 526139081, 524277449, 524414420, 525606751, 528052509, 532214582, 537377417, 543938875, 553666592, 564804018, 574679017, 583446324, 591597617, 599380553, 606366515, 612797678, 619409978, 626075625, 631480753, 635965168, 640686631, 645434022, 649506152, 652640939, 655319393, 658891857, 662646592, 665577710, 668045819]
1513.4F68045819K209544K304614K251803K329171K433598K141416K111495J920581
1529.7F85748041J551270J496613J359940P18772M25697R81509J287580J132488O45816
1548.1F95347726J78874p8619k75790n79775j203298q13186q2195o66380j292288j812637
1568.5F88722432j928926j363635j663506k417982k001106j813829k279878k457857
1584.8F72795713k407849k362013k403974k509237k631604k670050k687216k733826
1601.1F52389944k633572k509177k648294k984166l075003l059209l648758m036784
1617.4F27794981k806365k451778l102839l085315k965450k765120k093195j825154
1633.7F06699765j777590p31468M5896K08378K29478N40733J671493J993596K219260
$$ y = [668045819, 670255363, 672559977, 674811780, 677140951, 679574549, 681715965, 683827460, 685748041, 687299311, 688795924, 690155864, 690874636, 691300333, 692281842, 693569422, 694701910, 695347726, 695526600, 695447981, 695172191, 694592416, 693389118, 692575932, 692493737, 691827357, 690535069, 688722432, 686793506, 685429871, 683766365, 681348383, 679347277, 677533448, 675253570, 672795713, 670387864, 668025851, 665621877, 663112640, 660481036, 657810986, 655123770, 652389944, 649756372, 647247195, 644598901, 641614735, 638539732, 635480523, 631831765, 627794981, 624988616, 622536838, 619433999, 616348684, 613383234, 610618114, 608524919, 606699765, 604922175, 604190707, 604236603, 604444981, 604674459, 605215192, 606886685, 608880281, 611099541]
1652.1F11099541L957153L835260L099978L217161L918409M530073M118800M220605
1668.4F41996980N142271M895032M846811N369365M951596M397214M668057O263912
1684.7F82531238N750537M349470M149973L584206L334701L444791L156662L315568
1701.1G13617146K632320J817226J845420J868367J715779J531899J359821J624763
1717.4G28012741K008199J811862J693547J915217J984059J922250J690805J805425
1733.7G42844105K271175K000809J985848K339482K438069K376437K331733K601922
1750G61189580K997458K767384K537847K598106K443135K418101K234280J702607J337409
1768.4G82225907J228273J527250J908481J682222J256346J023472R79483J033008
$$ y = [611099541, 615056694, 618891954, 621991932, 625209093, 629127502, 633657575, 637776375, 641996980, 647139251, 652034283, 656881094, 662250459, 667202055, 671599269, 676267326, 682531238, 688281775, 692631245, 696781218, 700365424, 703700125, 707144916, 710301578, 713617146, 716249466, 718066692, 719912112, 721780479, 723496258, 725028157, 726387978, 728012741, 730020940, 731832802, 733526349, 735441566, 737425625, 739347875, 741038680, 742844105, 745115280, 747116089, 749101937, 751441419, 753879488, 756255925, 758587658, 761189580, 764187038, 766954422, 769492269, 772090375, 774533510, 776951611, 779185891, 780888498, 782225907, 783454180, 784981430, 786889911, 788572133, 789828479, 790851951, 791831434, 792864442]
1784.7G92864442J128793J007318P91371R78410J113475Q60810O92069Q60632J126468
1803H01423788J108885Q96394O75917O14047O86467P29739P71880Q45135P47859M74870
1823.4H08974981L40879L14951L46184O79076Q46088O40511M75347L44515N1975j04248
1843.8H12910259K78711O17623N93067M31120K05398N5253N2571J62960K78532K94983
1864.2H15880477J38581K7836K20239L46362K87891L33428M72725M92692L85284K64466
1884.6H18849981J21116K8730K33531M65631M81904M47929K85864L6180q9884k3127
1905H20837855J28210K85149L73363K49565m6134k48671j10149J44183L53158M91142
1925.4H22457671L86059J26243r4891j40249j7226J62125K59101K43485K16842J25408
$$ y = [792864442, 793993235, 795000553, 795791924, 796770334, 797883809, 798744619, 799436688, 800297320, 801423788, 802532673, 803429067, 804104984, 804719031, 805405498, 806135237, 806907117, 807752252, 808500111, 808974981, 809315860, 809630811, 809976995, 810656071, 811502159, 812142670, 812618017, 812962532, 813014507, 812910259, 813188970, 813806593, 814399660, 814830780, 815036178, 815091431, 815144002, 815306962, 815585494, 815880477, 816019058, 816046894, 816267133, 816613495, 816901386, 817234814, 817707539, 818200231, 818585515, 818849981, 818971097, 818999827, 819233358, 819698989, 820180893, 820628822, 820914686, 820950866, 820860982, 820837855, 820966065, 821251214, 821624577, 821874142, 821828008, 821579337, 821469188, 821613371, 821966529, 822457671, 822843730, 822969973, 822875082, 822734833, 822717607, 822879732, 823138833, 823382318, 823599160, 823724568]
1945.8H23724568l5584m9293J42336L83317M99010M02689J69814n1141j37925l1829
1966.2H25015962K52843M82619M72963K80678Q404j76012j60694L3259K73347L67522
1986.6H26850891K22445m6909k11537j83642o4969R9778K43306J98305l4213k78831
2007H26794624m17649m21107l00229j59144p8142j38998l94940p02918p78735m80473
2027.4H22922289j38819l3438j05321k84374m80175n77271n17011l62277j91212m9770
2047.8H20182621m291p4387j95026k35498j40131L3617J96338K43128J75476O7770
2068.2H20249617m9293q0705r894O9380J25170J80304J79231N6088p2360p0989M8935
2090.6H20625484J95742K87056K83837K20179J23263M7386P5399J42336J90676K27391
$$ y = [823724568, 823688984, 823639691, 823782027, 824165344, 824664354, 825067043, 825236857, 825185716, 825047791, 825015962, 825268805, 825751424, 826224387, 826505065, 826513469, 826337457, 826176763, 826210022, 826483369, 826850891, 827073336, 827026427, 826814890, 826631248, 826566279, 826666057, 826909363, 827107668, 827073455, 826794624, 826376975, 825955868, 825655639, 825496495, 825418353, 825279355, 824884415, 824181497, 823402762, 822922289, 822783470, 822750032, 822644711, 822360337, 821880162, 821302891, 820785880, 820423603, 820232391, 820182621, 820178330, 820103943, 819908917, 819673419, 819533288, 819566905, 819763243, 820006371, 820181847, 820249617, 820200324, 820119619, 820109725, 820179105, 820304275, 820484579, 820663810, 820719898, 820647538, 820576549, 820625484, 820821226, 821108282, 821392119, 821612298, 821735561, 821782947, 821858346, 822000682, 822191358, 822418749]
2111H22418749K26617J53721L6537l9935n1081j8776O4493J56998J49310N7518j4364
2133.5H23139787m4465n4777j9908N9485J28866J64807J37746M1842o4432q2135N5015
2155.9H23461831K65717M09961M34160L55005K17319J29878K34783M86195O65546O80148
2176.3H27340543N83947M48346L10779K36153L07620M93288O33717O16610M63187K50280
2196.7H31684470J04606J25885L12627N52118O70850N99026L89636J70648Q2255J73330
2217.1H34865451L95834O00815O22392M37438J57118l0398O079K05338M30763N48661
2237.5H38239491M54307J90854o2466j54555j8775K76267N04136N10991L15130M5299
2257.9H40300679j05679o5684J09553L63291N52356M99189J99735j38164k49564n5671
$$ y = [822418749, 822645366, 822799087, 822835624, 822795689, 822744608, 822725832, 822790325, 822947323, 823096633, 823154151, 823139787, 823095322, 823040545, 823020637, 823080122, 823208988, 823373795, 823511541, 823553383, 823488951, 823406816, 823461831, 823727548, 824137509, 824571669, 824926674, 825143993, 825273871, 825508654, 825994849, 826660395, 827340543, 827924490, 828372836, 828683615, 828919768, 829227388, 829720676, 830354393, 830971003, 831434190, 831684470, 831789076, 831914961, 832227588, 832779706, 833450556, 834049582, 834439218, 834609866, 834692121, 834865451, 835261285, 835862100, 836484492, 836921930, 837079048, 837048650, 837054729, 837260067, 837690830, 838239491, 838693798, 838884652, 838822186, 838667631, 838648856, 838925123, 839429259, 839940250, 840255380, 840300679, 840195000, 840129316, 840238869, 840602160, 841154516, 841653705, 841853440, 841715276, 841465712, 841410041]
2278.3H41410041K94089N63741N62489K92063n0724k44379j65880J27256M41730N68211
2298.7H43798637M09305P3135j96516j97053O2644M01616N90981N29706L13282N3406
2319.1H45839143j03772m2260J49072L66032M95612L01540k00927n81443n21660j79887
2339.5H45521450O4790J3411l20911n50449l63469K4855L01361M26233N11467L74079
2359.9H46002817p1883o46174j036584j037002p83801n33521m22538n20289p19189
2378.2H40231836q21114p31051m79698j96040j0967o676j70588l89993n12123m51565
2398.6H36462021k65122j00970q0466k02298m26233o38187o56724m80771k79844j96159
2419H33135247k95579n40614p61211q00669o54459m63903l71278m13358n82576p93338
$$ y = [841410041, 841704130, 842267871, 842830360, 843122423, 843071699, 842827320, 842661440, 842788696, 843230426, 843798637, 844207942, 844281077, 844084561, 843887508, 843950152, 844351768, 844942749, 845472455, 845785737, 845839143, 845735371, 845693111, 845842183, 846208215, 846703827, 847005367, 846804440, 846222997, 845701337, 845521450, 845586240, 845599651, 845278740, 844728291, 844364822, 844389677, 844691038, 845117271, 845628738, 846002817, 845930934, 845284760, 844248176, 843211174, 842427373, 841893852, 841471314, 840951025, 840231836, 839410722, 838679671, 838199973, 838003933, 837992966, 837986290, 837815702, 837425709, 836913586, 836462021, 836196899, 836095929, 836015463, 835813165, 835386932, 834748745, 834092021, 833611250, 833331406, 833135247, 832839668, 832299054, 831537843, 830737174, 830082715, 829618812, 829247534, 828834176, 828251600, 827458262]
2439.4H27458262q72552p74026n90861m23312l98874n43118p19845q11577p82490o16669
2459.8H20924938m02987l12090m15325o49691q50022q50141o27279l43025j97291k90275
2480.2H15986812n38111p34925p55310n90444l37004j43290j16765k99335n71728o99400
2500.6H11200500n94020l37482q0883J6749j20163m24624o91533p26819n31137k75672
2521H07434916j24752j93477m68433p74800r44853q74400o08385l65496l21507m93467
2541.4H02265346p82311r85384r50813p18236m35412l12746m44114p01427r22740r74476
2561.8G95037687q06391n43595l26216k85864n26249q43287r65774q85367o36876l48568
2582.2G88869500k51651l86536o49333q45670q05855n77748l02196j18494j70052m62115
$$ y = [827458262, 826585710, 825811684, 825220823, 824797511, 824398637, 823855519, 823135674, 822324097, 821541607, 820924938, 820521951, 820209861, 819794536, 819144845, 818294823, 817444682, 816817403, 816474378, 816277087, 815986812, 815448701, 814713776, 813958466, 813368022, 813031018, 812887728, 812770963, 812471628, 811899900, 811200500, 810606480, 810268998, 810188115, 810204864, 810084701, 809660077, 808968544, 808241725, 807710588, 807434916, 807310164, 807116687, 806648254, 805873454, 804928601, 804054201, 803445816, 803080320, 802758813, 802265346, 801483035, 800497651, 799546838, 798828602, 798393190, 798080444, 797636330, 796934903, 796012163, 795037687, 794231296, 793687701, 793361485, 793075621, 792549372, 791706085, 790740311, 789854944, 789218068, 788869500, 788617849, 788231313, 787581980, 786736310, 785930455, 785352707, 785050511, 784932017, 784761965, 784299850]
2602.6G84299850p67529q90612q28087o30737m47452m69088o91295r89914j239359
2620.9G77345777j284004j106023q80182p90000r03785j158000j421630j519501j397073
2639.3G66885579j175523r77993r33767j084148j302362j463950j459002j236320r51647
2657.6G56300867q29757r39607j148284j318276j354813j180053r05037p48396p75993
2676G47100651r14335j084149j181424j128852r58323p72477o90102p91311j027167
2694.3G38552511j217544j277209j209557j041710r26674r83536j161217j331509j370668
2712.7G28032887j242399j035691q77738q51690r42529j069784j126647j044869q66771
2731.1G18974769o84619n93126o56366q48413r89615r47953q37266p14302n88000n96762
$$ y = [784299850, 783532321, 782641709, 781813622, 781182885, 780735433, 780266345, 779575050, 778585136, 777345777, 776061773, 774955750, 774075568, 773285568, 772381783, 771223783, 769802153, 768282652, 766885579, 765710056, 764732063, 763798296, 762714148, 761411786, 759947836, 758488834, 757252514, 756300867, 755471110, 754531503, 753383219, 752064943, 750710130, 749530077, 748625040, 747876644, 747100651, 746186316, 745102167, 743920743, 742791891, 741833568, 741061091, 740370989, 739579678, 738552511, 737334967, 736057758, 734848201, 733806491, 732879817, 731896281, 730735064, 729403555, 728032887, 726790488, 725754797, 724877059, 724025369, 723082840, 722013056, 720886409, 719841540, 718974769, 718290150, 717697024, 717040658, 716192245, 715202630, 714254677, 713417411, 712703109, 712115109, 711518347]
2751.4G11518347p39932q41737q04960o96242n92530m85778m57525o10650q20279r04321
2771.8G04564393q69811q17001p94887q17061r19640j114368j317382j390577j319289
2790.2F95204377j224458j230836j376927j587510j785636j898885j887560j826644
2806.5F82385921j804113j850605j994431k216458k380133k389550k326667k305031
2822.8F65118933k369166k512574k661765k796411k943099l011405k975106l009677
2839.1F42839730l192723l476918l803074l983796l913224l642857l275632k984703
2855.5F14566803k888501l040611l422201l873766m280805m642487m960835n299806
2871.8E82157791n642355n813122n678355n179406m396081l536641k771735k118945
$$ y = [711518347, 710778415, 709936678, 709131718, 708435476, 707842946, 707357168, 706899643, 706288993, 705468714, 704564393, 703694582, 702877581, 702082694, 701265633, 700345993, 699231625, 697914243, 696523666, 695204377, 693979919, 692749083, 691372156, 689784646, 687999010, 686100125, 684212565, 682385921, 680581808, 678731203, 676736772, 674520314, 672140181, 669750631, 667423964, 665118933, 662749767, 660237193, 657575428, 654779017, 651835918, 648824513, 645849407, 642839730, 639647007, 636170089, 632367015, 628383219, 624469995, 620827138, 617551506, 614566803, 611678302, 608637691, 605215490, 601341724, 597060919, 592418432, 587457597, 582157791, 576515436, 570702314, 565023959, 559844553, 555448472, 551911831, 549140096, 547021151]
2888.1E47021151j530707j054168p35939n69343n34535o05523q14915j144886j509845
2906.5E38521290j867593k218246k617717l083229l541589l872215l965676l765941
2922.8E13589084l268897k520264j603007n68926O05345J880466L096283M140615N032659
2941.1E20383358N708754O071329O218076O259203O226241O155432O096065O090879
2957.4E69209337O029308N726278N183101M585981M119873L826857L689646L690422
2973.8F06060803L721416L679395L504991L194153K869726K646625K491414K315224
2990.1F30483747K022922J578092J167059Q81910O16134L59416J02043j87338m80234
3008.4F36543751p73430j115024j446545j648069j740277j820921j958609k166808
$$ y = [547021151, 545490444, 544436276, 543700337, 543130994, 542596459, 541990936, 541176021, 540031135, 538521290, 536653697, 534435451, 531817734, 528734505, 525192916, 521320701, 517355025, 513589084, 510320187, 507799923, 506196916, 505627990, 506233335, 508113801, 511210084, 515350699, 520383358, 526092112, 532163441, 538381517, 544640720, 550866961, 557022393, 563118458, 569209337, 575238645, 580964923, 586148024, 590734005, 594853878, 598680735, 602370381, 606060803, 609782219, 613461614, 616966605, 620160758, 623030484, 625677109, 628168523, 630483747, 632506669, 634084761, 635251820, 636133730, 636749864, 637109280, 637211323, 637023985, 636543751, 635770321, 634655297, 633208752, 631560683, 629820406, 627999485, 626040876, 623874068]
3024.7F23874068k373695k456248k408504k384782k512992k674162k698720k718329
3041.1F03646636k834260k916277k890825k792418k790213k924025l008425l061891
3057.4E80428302l099382l008782k847136k759397k881467l118992l196180l065943
3073.7E56451023k839208k698183k813280k984822l024160l068209l071368k993107
3090E32958686l017246l065884k964497k834976k862036l002763l003657k771616k638220
3108.4E06797791k777637k827048k689481k670794k790362k935052l023833k919555
3124.7D84164029k703368k616555k730459k839654k710581k443224k374858k573997
3141D63171333k704352k650380k574563k443671k285719k334386k512157k521873k453029
$$ y = [623874068, 621500373, 619044125, 616635621, 614250839, 611737847, 609063685, 606364965, 603646636, 600812376, 597896099, 595005274, 592212856, 589422643, 586498618, 583490193, 580428302, 577328920, 574320138, 571473002, 568713605, 565832138, 562713146, 559516966, 556451023, 553611815, 550913632, 548100352, 545115530, 542091370, 539023161, 535951793, 532958686, 529941440, 526875556, 523911059, 521076083, 518214047, 515211284, 512207627, 509436011, 506797791, 504020154, 501193106, 498503625, 495832831, 493042469, 490107417, 487083584, 484164029, 481460661, 478844106, 476113647, 473273993, 470563412, 468120188, 465745330, 463171333, 460466981, 457816601, 455242038, 452798367, 450512648, 448178262, 445666105, 443144232, 440691203]
3159.4D40691203k441436k389163k293289k216547k167523k126903k130210k168030
3175.7D22758102k164989k118051k068103k016335j955092j926691j946509j957297
3192D06605035j927316j885384j820386j765221j764894j744330j715690j743555j710534
3210.3C90527725j566410j482278j517892j558840j579940j581252j525223j448214
3226.7C78267676j329184j142919j108885j353770j544744j469106j307517j171917
3243C67839634j058518j073003j227171j261174j121849j023531j045138j046210r73672
3261.3C58009368r52750r52125q34077p03365p97898r62913r95189r87976r42201q59290
3281.7C49021584q07703q04096p64638o01858n20110o80089r08763j035481r48787
$$ y = [440691203, 438249767, 435860604, 433567315, 431350768, 429183245, 427056342, 424926132, 422758102, 420593113, 418475062, 416406959, 414390624, 412435532, 410508841, 408562332, 406605035, 404677719, 402792335, 400971949, 399206728, 397441834, 395697504, 393981814, 392238259, 390527725, 388961315, 387479037, 385961145, 384402305, 382822365, 381241113, 379715890, 378267676, 376938492, 375795573, 374686688, 373332918, 371788174, 370319068, 369011551, 367839634, 366781116, 365708113, 364480942, 363219768, 362097919, 361074388, 360029250, 358983040, 358009368, 357056618, 356104493, 355270416, 354567051, 353769153, 352806240, 351811051, 350823075, 349880874, 349021584, 348213881, 347409785, 346645147, 346043289, 345523179, 344843090, 343934327, 342898846, 341950059]
3300.1C41950059o63102m53740n68479q94010j140535j174599j038194r08017q77053
3318.4C34232330q65131p89881p49797r07749j073122j031071r02146p68602o82115
3336.8C26462716q03828r95249j026124j036524r68487p45534p85679j085401j140326
3355.2C17875564r22292p75874q08358q18104o58124n77897q05110j118183j124352
3373.5C10267270q50350o86407o97553p39783o91712n40734l28898j17660k15470n64188
3393.9C04834515n99951k32339n5790m25577p77006n52624j72049p4744j46449k88427
3414.3C01509559l91692k73913r7334m7893M2469K22712L04699K19345K55377L89009
3434.7C02132338K28942q9467r1404K14428M35501M87775M75556M83006N59121O65248
$$ y = [341950059, 341286957, 340833217, 340264738, 339370728, 338230193, 337055594, 336017400, 335109383, 334232330, 333367199, 332577318, 331827521, 330919772, 329846650, 328815579, 327913433, 327144831, 326462716, 325658888, 324663639, 323637515, 322600991, 321632504, 320886970, 320101291, 319015890, 317875564, 316953272, 316177398, 315369040, 314550936, 313892812, 313314915, 312509805, 311391622, 310267270, 309416920, 308730513, 308032960, 307293177, 306601465, 306060731, 305731833, 305614173, 305398703, 304834515, 304234564, 304002225, 303946435, 303520858, 302743852, 302191228, 302019179, 301944435, 301797986, 301509559, 301117867, 300843954, 300746620, 300698727, 300741196, 300963908, 301268607, 301487952, 301743329, 302132338, 302361280, 302271813, 302180409, 302394837, 302830338, 303318113, 303793669, 304276675, 304835796, 305501044]
3455.1C05501044P68572Q13931O87987O71893J018107J227617Q71390M16726M73053
3473.4C12450320P89761J006633R74774P43896P89672J053244J034767R09209J006663
3491.8C20758939J132309J164675J129061J131177J168102J070470R22650R52065J197338
3510.2C30626786J455307J408785J161158J122922J293779J461058J344145J059383
3526.5C40933323J114011J432210J614392J643479J552403J462817J618504J745880
3542.8C53117019J655340J600325J685739J729816J802266J985401K157658K319306
3559.1C68052870K422601K236336J971692K530128L327489L151715K813548K929359
3575.4C89435738L149569L349156L551304L435463L025412L213883L987342L922283
$$ y = [305501044, 306269616, 307083547, 307771534, 308443427, 309461534, 310689151, 311560541, 311977267, 312450320, 313240081, 314246714, 315221488, 315965384, 316755056, 317808300, 318843067, 319752276, 320758939, 321891248, 323055923, 324184984, 325316161, 326484263, 327554733, 328477383, 329429448, 330626786, 332082093, 333490878, 334652036, 335774958, 337068737, 338529795, 339873940, 340933323, 342047334, 343479544, 345093936, 346737415, 348289818, 349752635, 351371139, 353117019, 354772359, 356372684, 358058423, 359788239, 361590505, 363575906, 365733564, 368052870, 370475471, 372711807, 374683499, 377213627, 380541116, 383692831, 386506379, 389435738, 392585307, 395934463, 399485767, 402921230, 405946642, 409160525, 413147867, 417070150]
3591.7D17070150L594339L837407M114449M073828M119248M059821L712684L824860
3608.1D48406786M199028M182070M240513M130811M066318M762471M864752M115969
3624.4D82968718L312707L560394M955023M832805M298776M260302M189491M128396
3640.7E16506612M016817L599942L145635L680706M923165M670977L858149M119814
3657E48521817M380166L807009L446400L402650K944708K700388L414631L026486K515852
3675.4E78160107L594697L809750L381848L192961K810061K287865K193153K620876
3691.7F02051318K771437K599954K273918J824557J784564K215921K139032J532495
3708F19193196J079917J628459K563357K382875J785993J443565J378655J475990J750887
$$ y = [417070150, 420664489, 424501896, 428616345, 432690173, 436809421, 440869242, 444581926, 448406786, 452605814, 456787884, 461028397, 465159208, 469225526, 473987997, 478852749, 482968718, 486281425, 489841819, 494796842, 499629647, 503928423, 508188725, 512378216, 516506612, 520523429, 524123371, 527269006, 530949712, 535872877, 540543854, 544402003, 548521817, 552901983, 556708992, 560155392, 563558042, 566502750, 569203138, 572617769, 575644255, 578160107, 581754804, 585564554, 588946402, 592139363, 594949424, 597237289, 599430442, 602051318, 604822755, 607422709, 609696627, 611521184, 613305748, 615521669, 617660701, 619193196, 620273113, 621901572, 624464929, 626847804, 628633797, 630077362, 631456017, 632932007, 634682894]
3726.4F34682894J934468J497388Q90911Q13782J512707K094686J561224K95341K14815
3744.7F45498216J434505R83775M46617J541138K053678J464784J042366J283884J259983
3763.1F57008946R56833Q97050Q84474J162767J406312J183569Q38697O70553Q55982
3781.4F65865183R59277R91762J144647J115740R27329O31809M79639O46233L65555
3799.8F73127174M02451J154959Q98361Q49903J407683J213074M39226K27392N89728
3818.1F80309951K68519O50764J264393R60648Q14378O89447N57721N66483J99615
3836.5F86281919J4425N54859R97365J231790J210987P44999k39730j101971L77774
3854.8F90072417J825214J340270N22792J00136M20630N25176K9683K75732Q04603
$$ y = [634682894, 636617362, 638114750, 639005661, 639819443, 641332150, 643426836, 644988060, 645283401, 645498216, 646932721, 647916496, 648363113, 649904251, 651957929, 653422713, 654465079, 655748963, 657008946, 657965779, 658862829, 659747303, 660910070, 662316382, 663499951, 664338648, 665009201, 665865183, 666824460, 667816222, 668960869, 670076609, 671003938, 671635747, 672115386, 672761619, 673127174, 673529625, 674684584, 675582945, 676432848, 677840531, 679053605, 679492831, 679720223, 680309951, 680578470, 681229234, 682493627, 683454275, 684268653, 684958100, 685515821, 686082304, 686281919, 686296344, 686851203, 687848568, 689080358, 690291345, 691036344, 690796614, 689694643, 690072417, 691897631, 693237901, 693760693, 693860829, 694281459, 694806635, 694836318, 695112050, 695916653]
3873.2F95916653J046478R21250K64108L43680N97239L17752N01037L98219K12431
3891.6G00518847P59303Q71539K09272l20196k32160K94387R25064J012922O33537
3909.9G04672515L43562J34766k6763J29283M27127M14907K85149L47257K71260K0266
3930.3G07019329J59025N29290N42998L55601J19269r716J69576K50160K25962L75390
3950.7G09736884M24444L07918K09033J59920J65343K42472K93851K37941J80304J96696
3971.1G12154806K28405K35676K27690K35617K95878K94029J57118L5644L5107J18196
3991.5G14018166K04802K75075L15964
3997.6G14814007
$$ y = [695916653, 696963131, 697884381, 698148489, 698492169, 699089408, 699407160, 699908197, 700306416, 700518847, 701278150, 702149689, 702358961, 702038765, 701806605, 702100992, 703026056, 704038978, 704672515, 705016077, 705150843, 705124080, 705253363, 705680490, 706095397, 706380546, 706727803, 706999063, 707019329, 707178354, 707707644, 708250642, 708606243, 708725512, 708715796, 708885372, 709135532, 709361494, 709736884, 710161328, 710469246, 710678279, 710838199, 711003542, 711246014, 711539865, 711777806, 711958110, 712154806, 712383211, 712618887, 712846577, 713082194, 713378072, 713672101, 713829219, 713864863, 713899970, 714018166, 714222968, 714498043, 714814007]
##END=$$ End of the data block
