##TITLE=$$ Begin of the data block
##JCAMP-DX=5.00 $$ ACD/SpecManager v 10.08
##SPECTROMETER/DATA SYSTEM=Alpha
##DATE=29 Dec 2014 15:06:02
##DATA TYPE=INFRARED SPECTRUM
##DATA CLASS=XYDATA
##ORIGIN=
##OWNER=
##NPOINTS=1765
##FIRSTX=399.76428223
##LASTX=3997.64306641
##MAXX=3997.64306641
##MINX=399.76428223
##MAXY=0.83760440
##MINY=0.27597040
##XFACTOR=1.0000000000
##YFACTOR=1.000000000000000e-9
##FIRSTY=0.56311423
##DELTAX=2.03961372
##XUNITS=1/CM
##YUNITS=ARBITRARY UNITS
##XYDATA=(X++(Y..Y))
$$ plain form
399.8 563114226 557477832 553622365 552485883 553536057 554712057 555033326 555698097 557160497 558591068
418.1 558591068 558752298 556414247 552723229 550423265 549678385 547912478 544153869 539839804 537311018
436.5 537311018 538197100 541778982 546045542 549636066 553065062 557270885 561418772 563672423 563249230
454.8 563249230 561126113 559470534 559228301 558741868 556300104 551816583 547155917 544121146 542428136
473.2 542428136 540515125 537575364 534655154 533391654 534061015 535388708 535520375 533973992 532257676
491.5 532257676 531739891 531717896 530550361 527596891 523813128 521015704 519566000 517801762 514278352
509.9 514278352 509329855 504501522 500755727 497726530 494429052 490443319 486814290 485340208
526.2 485340208 486352652 488012761 488890827 489627510 492183775 497713298 504877687 510771215 513594210
$$ packed form
399.8E63114226n636394l855467j136482J050174J176000L21269O64771J462400J430571
418.1E58591068J61230k338051l691018k299964p44880j765907l758609m314065k528786
436.5E37311018Q86082L581882M266560L590524L428996M205823M147887K253651m23193
454.8E63249230k123117j655579k42233m86433k441764m483521m660666l034771j693010
473.2E42428136j913011k939761k920210j263500O69361J327693J31667j546383j716316
491.5E32257676n17785k1995j167535k953470l783763k797424j449704j764238l523410
509.9E14278352m948497m828333l745795l029197l297478l985733l629029j474082
526.2D85340208J012444J660109Q78066P36683K556265N529523P164389N893528K822995
$$ plain form
544.6 513594210 514060438 514107525 514448524 514043152 511618495 507318020 502752244 499000967 495231003
562.9 495231003 489858031 482345611 474207491 468055457 465246201 465424895 467502594 470808178 475847632
581.3 475847632 483166009 491776854 499362320 504083633 506321073 507774234 509425402 510798275
597.6 510798275 510785699 509331286 507872999 507871926 509361327 511109293 512073278 512634099 514149547
616 514149547 517492652 522096992 526428401 529547513 532089710 535319209 539289832 542817891 544793904
634.3 544793904 545428932 546138048 548002064 550599694 552524865 553072989 553093076 554031253 556212783
652.7 556212783 558539569 559662044 559464335 559326291 560544789 562836766 565097153 565970182 565930605
671 565930605 566813111 569240510 572342932 574421048 574887574 574911833 576051354 578282297 579861164
$$ packed form
544.6E13594210M66228M7087L40999m05372k424657m300475m565776l751277l769964
562.9D95231003n372972p512420q138120o152034k809256J78694K077699L305584N039454
581.3D75847632P318377Q610845P585466M721313K237440J453161J651168J372873
597.6E10798275j2576j454413j458287j073J489401J747966R63985N60821J515448
616E14149547L343105M604340M331409L119112K542197L229499L970623L528059J976013
634.3E44793904O35028P09116J864016K597630J925171N48124K0087R38177K181530
652.7E56212783K326786J122475j97709j38044J218498K291977K260387Q73029l9577
671E65930605Q82506K427399L102422K078116M66526K4259J139521K230943J578867
$$ plain form
689.4 579861164 579369605 577236056 575082421 573777854 572481513 569832623 565794408 562068641 560630322
707.7 560630322 561895251 564514697 566968918 569281816 572868645 578701794 585905313 592548847
724.1 592548847 597547889 601475656 605914950 611437976 616631269 619719863 620592594 620867252 621885896
742.4 621885896 623037279 622386515 618927598 613722086 608764827 604984581 601545930 597210646 592126310
760.8 592126310 588048160 586798012 588670909 592437208 596853554 601959586 608858705 618124068
777.1 618124068 628415346 637292206 643511772 648074865 652877867 658576727 663936317 667512596
793.4 667512596 669641078 672228217 676696360 682426631 687228560 689483643 689947248 690854013 693220794
811.8 693220794 695719838 696479499 695318043 693839312 693580687 694216251 693644226 690214872 684691548
$$ packed form
689.4E79861164m91559k133549k153635j304567j296341k648890m038215l725767j438319
707.7E60630322J264929K619446K454221K312898L586829N833149P203519O643534
724.1E92548847M999042L927767M439294N523026N193293L088594Q72731K74658J018644
742.4F21885896J151383o50764l458917n205512m957259l780246l438651m335284n084336
760.8E92126310m078150j250148J872897L766299M416346N106032O899119R265363
777.1F18124068J0291278Q876860O219566M563093M803002N698860N359590L576279
793.4F67512596K128482K587139M468143N730271M801929K255083M63605R06765K366781
811.8F93220794K499044P59661j161456j478731k58625O35564n72025l429354n523324
$$ plain form
830.1 684691548 679271698 675103068 671362460 666585147 660540819 654618323 650304079 647525251
846.4 647525251 644716561 640434206 634694695 628796637 623929620 620318770 618353605 619376361
862.8 619376361 624521971 633914292 646592796 660245359 671861827 679771125 684723973 688103437
879.1 688103437 689692855 688078940 682807684 675490081 668571234 663196385 658538759 653157711
895.4 653157711 646766841 640471399 635289073 630749941 625195622 617389560 607664347 597432613
911.7 597432613 587699592 578282297 568650007 559347689 552036345 547954500 546745420 546893477 547150493
930.1 547150493 547572970 549200177 552763104 557808042 563078821 567437947 570064306 570114076 566758156
948.4 566758156 559381664 547933042 533435583 517616808 501668692 485576570 468653053 450502247
$$ packed form
830.1F84691548n419850m168630l740608m777313o044328n922496m314244k778828
846.4F47525251k808690m282355n739511n898058m867017l610850j965165J022756
862.8F19376361N145610R392321J2678504J3652563J1616468P909298M952848L379464
879.1F88103437J589418j613915n271256p317603o918847n374849m657626n381048
895.4F53157711o390870o295442n182326m539132n554319p806062r725213j0231734
911.7E97432613r733021r417295r632290r302318p311344m081845j209080J48057K57016
930.1E47150493M22477J627207L562927N044938N270779M359126K626359M9770l355920
948.4E66758156p376492j1448622j4497459j5818775j5948116j6092122j6923517j8150806
$$ plain form
964.7 450502247 431497842 412404835 393618733 374995023 356438190 338454515 321991414
979 321991414 307966411 296862036 288550854 282597691 278639674 276497394 275970399 276661962 278015733
997.4 278015733 279495269 280822337 282025188 283136994 283910602 284024954 283562660 283122152 283370167
1015.7 283370167 284606606 286669791 289243162 292189121 295590818 299559295 303925842 308144122
1032 308144122 311540365 313794881 315148294 316090167 316918939 317633122 318237185 319186777 321328998
1050.4 321328998 325309455 331050307 337898850 345445573 353943676 363815844 374449313 383172691
1066.7 383172691 386058360 381092519 370623410 359689534 352035135 348307610 347462386 348679394
1083 348679394 351762533 356438935 362093955 368091524 374020755 379655570 384671241 388546914 390806884
$$ packed form
964.7D50502247j9004405j9093007j8786102j8623710j8556833j7983675j6463101
979C21991414j4025003j1104375q311182n953163l958017k142280n26995O91563J353771
997.4B78015733J479536J327068J202851J111806P73608J14352m62294m40508K48015
1015.7B83370167J236439K063185K573371K945959L401697L968477M366547M218280
1032C08144122L396243K254516J353413R41873Q28772P14183O04063R49592K142221
1050.4C21328998L980457N740852O848543P546723Q498103R872168J0633469Q723378
1066.7C83172691K885669m965841j0469109j0933876p654399l727525q45224J217008
1083C48679394L083139M676402N655020N997569N929231N634815N015671L875673K259970
$$ plain form
1101.4 390806884 391539544 391784728 393052161 396111190 400491416 405081719 409004211 412097186 414689600
1119.8 414689600 417065173 419238091 421330392 423912525 427656144 432458371 436985075 439286172
1136.1 439286172 438016951 433301806 426412612 418709278 410958052 403472304 396617234 391051769
1152.4 391051769 387390137 385706216 385544389 386444628 388500780 392360121 398645580 407324910 417708844
1170.7 417708844 429032892 440986753 453694135 467194468 480975270 494096905 505884111
1185 505884111 516360581 525833011 534166098 540726721 545016050 547422528 549162149 551255226
1201.3 551255226 553818107 556375980 558733404 561465681 565441310 570827007 576711416 581819713
1217.7 581819713 585483611 587929368 589693725 590839386 590906322 589611530 587405920 585229874 583722770
$$ packed form
1101.4C90806884P32660K45184J267433L059029M380226M590303L922492L092975K592414
1119.8D14689600K375573K172918K092301K582133L743619M802227M526704K301097
1136.1D39286172j269221m715145o889194p703334p751226p485748o855070n565465
1152.4C91051769l661632j683921j61827R00239K056152L859341O285459Q679330J0383934
1170.7D17708844J1324048J1953861J2707382J3500333J3780802J3121635J1787206
1185E05884111J0476470R472430Q333087O560623M289329K406478J739621K093077
1201.3E51255226K562881K557873K357424K732277L975629N385697N884409N108297
1217.7E81819713L663898K445757J764357J145661O6936j294792k205610k176046j507104
$$ plain form
1236 583722770 582726479 581647992 580351293 579498291 579915524 581723571 584167182 586292684 587788105
1254.4 587788105 589048326 590498269 592096686 593403280 594236851 595140517 596854925 599468231 602153957
1272.7 602153957 603809059 604048193 603439510 602852702 602635682 602400661 601599455 600201905 598742664
1291.1 598742664 597615004 596545398 594920456 592479110 589697301 587364197 585703075 584236264
1307.4 584236264 582503557 580542743 578817666 577754736 577182591 576394141 574629068 571546972 567381382
1325.8 567381382 562653959 557677746 552483737 547299385 542784095 539691925 538459122 538615882
1342.1 538615882 539034367 539161921 539198697 539448440 539807141 539764225 538986623 537657619 536253810 535359383
1362.5 535359383 535215974 535105169 534563482 534144640 534468353 535752296 537430406 538595438 539197743
$$ packed form
1236E83722770r96291j078487j296699q53002M17233J808047K443611K125502J495421
1254.4E87788105J260221J449943J598417J306594Q33571R03666J714408K613306K685726
1272.7F02153957J655102K39134o08683n86808k17020k35021q01206j397550j459241
1291.1E98742664j127660j069606j624942k441346k781809k333104j661122j466811
1307.4E84236264j732707j960814j725077j062930n72145p88450j765073l082096m165590
1325.8E67381382m727423m976213n194009n184352m515290l092170j232803J56760
1342.1E38615882M18485J27554L6776K49743L58701m2916p77602j329004j403809q94427
1362.5E35359383j43409j10805n41687m18842L23713J283943J678110J165032O02305
$$ plain form
1380.8 539197743 540125430 542437911 546614468 551436186 554935336 556743145 557448924 557730019 557626784
1399.2 557626784 556900978 555358648 553239822 551396310 549868941 548157632 546172261 544056296
1415.5 544056296 541997552 540824294 541002452 541575432 542061031 542565107 543439865 545035422 546858847
1433.9 546858847 548456430 550117433 551939130 553829491 555551171 556579828 556515157 555568695 554196537
1452.2 554196537 552519977 550004184 547687054 547416925 548083842 549734414 553232372 557888985 563438177
1470.6 563438177 571181059 580383062 589296520 597664833 605421007 612420261 618247747 623429775
1486.9 623429775 629156649 635588169 640908957 644810259 648477316 652600229 656691551 659870803
1503.2 659870803 661923885 664153755 667536259 670896351 673739254 675902307 677652061 679136992
$$ packed form
1380.8E39197743R27687K312481M176557M821718L499150J807809P05779K81095j03235
1399.2E57626784p25806j542330k118826j843512j527369j711309j985371k115965
1415.5E44056296k058744j173258J78158N72980M85599N04076Q74758J595557J823425
1433.9E46858847J597583J661003J821697J890361J721680J028657o4671r46462j372158
1452.2E54196537j676560k515793k317130k70129O66917J650572L497958M656613N549192
1470.6E63438177P742882R202003Q913458Q368313P756174O999254N827486N182028
1486.9F23429775N726874O431520N320788L901302L667057M122913M091322L179252
1503.2F59870803K053082K229870L382504L360092K842903K163053J749754J484931
$$ plain form
1519.5 679136992 680904865 683430314 686050832 688402891 690107763 691154063 692380190 694033861
1535.8 694033861 694982171 694961429 695436478 696894586 698567688 699809372 700387359 700370431 699787796
1554.2 699787796 698710263 697312355 697231770 697905362 697494030 696217418 694649637 693344891 692513347
1572.6 692513347 690890372 688156307 686259806 685114682 683721900 681959212 679736376 677181304
1588.9 677181304 674683690 672471941 670345068 668000758 665295601 662342608 659522533 656921983
1605.2 656921983 654130578 650821388 647284985 643813372 639929295 635831833 632973671 630170941
1621.5 630170941 626473188 623232603 620724082 618536055 616654277 614443481 611892164 611083269
1637.8 611083269 611681640 612298012 612533152 612648308 613847315 615779221 617764354 621136248 624977350
$$ packed form
1519.5F79136992J767873K525449K620518K352059J704872J046300J226127J653671
1535.8F94033861R48310k0742M75049J458108J673102J241684N77987j6928n82635
1554.2F99787796j077533j397908q0585O73592m11332j276612j567781j304746q31544
1572.6F92513347j622975k734065j896501j145124j392782j762688k222836k555072
1588.9F77181304k497614k211749k126873k344310k705157k952993k820075k600550
1605.2F56921983k791405l309190l536403l471613l884077m097462k858162k802730
1621.5F30170941l697753l240585k508521k188027j881778k210796k551317q08895
1637.8F11083269N98371O16372K35140J15156J199007J931906J985133L371894L841102
$$ plain form
1656.2 624977350 628188312 631275475 634947896 639170408 642796099 646073163 650099218 654481292
1672.5 654481292 659170330 664252102 668632686 672134876 675679028 681117058 686958313 691661298
1688.8 691661298 695840359 699140668 701982856 705012262 708132744 711565077 714360952 716435552
1705.1 716435552 718686283 721013129 722941637 724220395 724982977 726368070 729034662 731714666
1721.5 731714666 733876646 735669672 737065852 738254786 739481151 741246581 743691742 745668828
1737.8 745668828 747304678 749294877 751597404 753783584 755703509 757892251 760782599 763677299
1754.1 763677299 766293406 768705547 770636559 772416890 774364710 776138902 777515292 778469265
1770.4 778469265 779436171 780938983 782608569 784075618 785320222 786331773 787145078 787988126 788811624
$$ packed form
1656.2F24977350L210962L087163L672421M222512L625691L277064M026055M382074
1672.5F54481292M689038N081772M380584L502190L544152N438030N841255M702985
1688.8F91661298M179061L300309K842188L029406L120482L432333K795875K074600
1705.1G16435552K250731K326846J928508J278758P62582J385093K666592K680004
1721.5G31714666K161980J793026J396180J188934J226365J765430K445161J977086
1737.8G45668828J635850J990199K302527K186180J919925K188742K890348K894700
1754.1G63677299K616107K412141J931012J780331J947820J774192J376390R53973
1770.4G78469265R66906J502812J669586J467049J244604J011551Q13305Q43048Q23498
$$ plain form
1788.8 788811624 789474785 790345192 791379392 792142451 792791665 793822885 795208395 796304107 796852648
1807.1 796852648 797216654 797941566 799039960 799982369 800533533 800925851 801312745 801732481 802307904
1825.5 802307904 802805841 803103566 803686082 804519415 805231988 805785060 806048214 805866480 805633605 806096196
1845.9 806096196 806986868 807645917 807897687 807934821 808087587 808451414 808850586 809051454 808935404 808559775
1866.3 808559775 808428645 809051931 809896886 810356319 810521662 810725749 811083794 811510503 811855197 811988235
1886.7 811988235 812015772 812292457 812770128 813157678 813475609 813725710 813877344 814019859 814185381 814277411
1907.1 814277411 814306557 814395070 814491928 814485192 814494789 814684093 814852834 814957023 815208197 815540075 815799296
1929.5 815799296 815947592 815988362 815983713 816028416 816064656 816058517 816167593 816360831 816524029 816749454 817079723
$$ packed form
1788.8G88811624O63161Q70407J034200P63059O49214J031220J385510J095712N48541
1807.1G96852648L64006P24912J098394R42409N51164L92318L86894M19736N75423
1825.5H02307904M97937K97725N82516Q33333P12573N53072K63154j81734k32875M62591
1845.9H06096196Q90672O59049K51770L7134J52766L63827L99172K00868j16050l75629
1866.3H08559775j31130O23286Q44955M59433J65343K04087L58045M26709L44694J33038
1886.7H11988235K7537K76685M77671L87550L17931K50101J51634J42515J65522R2030
1907.1H14277411K9146Q8513R6858o736R597J89304J68741J04189K51174L31878K59221
1929.5H15799296J48296M0770m649M4703L6240o139J09076J93238J63198K25425L30269
$$ plain form
1951.9 817079723 817381024 817530930 817574739 817666173 817879319 818118393 818257570 818328202 818409562 818551779
1972.3 818551779 818794250 819063723 819215715 819206357 819179773 819263160 819400847 819458425 819379091 819283009 819333613
1994.8 819333613 819516003 819706142 819755375 819597304 819359899 819221735 819234729 819236100 818995893 818518996
2015.2 818518996 818056464 817743480 817427933 816918850 816310287 815961838 815889657 815810978 815653682 815401196
2035.6 815401196 814997613 814531863 814190984 814040065 813958824 813779414 813493550 813263059 813211918 813301682
2056 813301682 813376844 813340366 813252449 813253701 813418567 813656032 813775599 813706994 813609242 813666403 813851714
2078.4 813851714 814017475 814063132 814013958 814020991 814184546 814444602 814646065 814704061 814706445 814808130 815079391
2100.8 815079391 815421879 815649629 815726817 815783978 815901995 816061497 816203654 816261888 816243708 816245317 816322029
$$ packed form
1951.9H17079723L01301J49906M3809R1434K13146K39074J39177P0632Q1360J42217
1972.3H18551779K42471K69473J51992r358k6584Q3387J37687N7578p9334r6082N0604
1994.8H19333613J82390J90139M9233j58071k37405j38164J2994J371k40207m76897
2015.2H18518996m62532l12984l15547n09083o08563l48449p2181p8679j57296k52486
2035.6H15401196m03583m65750l40879j50919q1241j79410k85864k30491n1141Q9764
2056H13301682P5162l6478q7917J252J64866K37465J19567o8605r7752N7161J85311
2078.4H13851714J65761M5657m9174P033J63555K60056K01463N7996K384J01685K71261
2100.8H15079391L42488K27750P7188N7161J18017J59502J42157N8234j8180J609P6712
$$ plain form
2123.3 816322029 816442132 816539288 816563487 816532791 816533983 816637039 816799164 816889584 816845357 816764295 816778600
2145.7 816778600 816934347 817129910 817202449 817187726 817234099 817412674 817717493 818037927 818252087 818399847
2166.1 818399847 818638206 819079578 819660544 820179522 820542932 820850730 821249723 821765840 822266698 822637498
2186.5 822637498 822943687 823307991 823744774 824196696 824575603 824834108 825049162 825361252 825813890 826286435
2206.9 826286435 826640427 826873720 827120721 827501833 827964306 828360140 828636885 828851104 829117477 829492271
2227.3 829492271 829877973 830127537 830209315 830308080 830586553 830932617 831179559 831316710 831426859 831577539
2247.7 831577539 831776321 832002759 832213163 832355201 832470477 832653284 832874596 833050191 833202183 833369255
2268.1 833369255 833548546 833745182 833972156 834211111 834394753 834507465 834615350 834780693 834999681 835209012
$$ packed form
2123.3H16322029J20103R7156K4199l0696J192J03056J62125R0420m4227q1062J4305
2145.7H16778600J55747J95563P2539j4723M6373J78575L04819L20434K14160J47760
2166.1H18399847K38359M41372N80966N18978L63410L07798L98993N16117N00858L70800
2186.5H22637498L06189L64304M36783M51922L78907K58505K15054L12090M52638M72545
2206.9H26286435L53992K33293K47001L81112M62473L95834K76745K14219K66373L74794
2227.3H29492271L85702K49564Q1778R8765K78473L46064K46942J37151J10149J50680
2247.7H31577539J98782K26438K10404J42038J15276J82807K21312J75595J51992J67072
2268.1H33369255J79291J96636K26974K38955J83642J12712J07885J65343K18988K09331
$$ plain form
2288.5 835209012 835340738 835410893 835513294 835683882 835859179 835968196 836023450 836084962 836189747 836365163
2308.9 836365163 836598635 836771131 836828411 836891115 837056577 837305486 837521613 837604403 837563813 837462008
2329.3 837462008 837400258 837443650 837467134 837351680 837198436 837062955 836860180 836472452 836026728 835840642
2349.7 835840642 836009741 836359799 836681724 836897969 836881399 836623192 836299777 836005688 835642695 835098028
2370.1 835098028 834408522 833744109 833287001 833018661 832739353 832343459 831920207 831604242 831447721 831376314
2390.4 831376314 831251502 830990076 830647647 830379069 830225408 830060005 829779327 829406619 829035580 828750849
2410.8 828750849 828517199 828186989 827690363 827124715 826648772 826283276 825891495 825388551 824811041 824249268
2431.2 824249268 823790610 823372185 822844207 822187304 821509182 820933282 820476472 820042312 819520235 818896055
$$ packed form
2288.5H35209012J31726P0155J02401J70588J75297J09017N5254O1512J04785J75416
2308.9H36365163K33472J72496N7280O2704J65462K48909K16127Q2790m0590j01805
2329.3H37462008o1750M3392K3484j15454j53244j35481k02775l87728m45724j86086
2349.7H35840642J69099L50058L21925K16245j6570k58207l23415k94089l62993n44667
2370.1H35098028o89506o64413m57108k68340k79308l95894m23252l15965j56521p1407
2390.4H31376314j24812k61426l42429k68578j53661j65403k80678l72708l71039k84731
2410.8H28750849k33650l30210m96626n65648m75943l65496l91781n02944n77510n61773
2431.2H24249268m58658m18425n27978o56903o78122n75900m56810m34160n22077o24180
$$ plain form
2451.6 818896055 818293631 817814648 817385733 816884696 816307366 815721691 815184474 814727187 814320445 813865006
2472 813865006 813325286 812784791 812323213 811933517 811538160 811077595 810568333 810084939 809696853 809372067
2492.4 809372067 809034586 808698714 808384180 808078706 807812691 807579994 807285190 806894839 806516707 806207895
2512.8 806207895 805914819 805606425 805278599 804903448 804464817 804006577 803576946 803133011 802605271 802003920
2533.2 802003920 801386893 800809979 800274193 799715877 799117804 798505127 797883093 797262371 796652615 796056807
2553.6 796056807 795466661 794854522 794230759 793652654 793138087 792630672 792078614 791489422 790895820 790326595
2574 790326595 789758027 789138258 788518369 787987351 787521601 787044942 786534846 786041617 785617471 785242319
2594.4 785242319 784865081 784453094 783999264 783535838 783114552 782700598 782196403 781586349 780918181 780228496
$$ packed form
2451.6H18896055o02424m78983m28915n01037n77330n85675n37217m57287m06742m55439
2472H13865006n39720n40495m61578l89696l95357m60565n09262m83394l88086l24786
2492.4H09372067l37481l35872l14534l05474k66015k32697k94804l90351l78132l08812
2512.8H06207895k93076l08394l27826l75151m38631m58240m29631m43935n27740o01351
2533.2H02003920o17027n76914n35786n58316n98073o12677o22034o20722o09756n95808
2553.6G96056807n90146o12139o23763n78105n14567n07415n52058n89192n93602n69225
2574G90326595n68568o19769o19889n31018m65750m76659n10096m93229m24146l75152
2594.4G85242319l77238m11987m53830m63426m21286m13954n04195o10054o68168o89685
$$ plain form
2614.8 780228496 779509127 778727651 777871966 776944339 775989711 775042236 774074674 773070097 772034168
2633.2 772034168 770972967 769913912 768884897 767830789 766709805 765578032 764451385 763330698
2649.5 763330698 762276292 761287570 760285020 759218395 758141518 757131040 756172180 755207837 754212201
2667.8 754212201 753213048 752260923 751367092 750523448 749704421 748863518 748005450 747171819 746373236 745581388
2688.2 745581388 744736612 743815720 742869079 741927922 740992367 740034103 738998294 737901986 736811221
2706.6 736811221 735764444 734756112 733740568 732692003 731653452 730689168 729779005 728869975 727987766
2724.9 727987766 727151811 726340413 725572109 724831998 724071801 723309815 722580433 721876621 721176863 720492482
2745.3 720492482 719831526 719178855 718535900 717900157 717275202 716680884 716106236 715533555 714996278 714492500
$$ packed form
2614.8G80228496p19369p81476q55685r27627r54628r47475r67562j004577j035929
2633.2G72034168j061201j059055j029015j054108j120984j131773j126647j120687
2649.5G63330698j054406r88722j002550j066625j076877j010478r58860r64343r95636
2667.8G54212201r99153r52125q93831q43644q19027q40903q58068q33631p98583p91848
2688.2G45581388q44776r20892r46641r41157r35555r58264j035809j096308j090765
2706.6G36811221j046777j008332j015544j048565j038551r64284r10163r09030q82209
2724.9G27987766q35955q11398p68304p40111p60197p61986p29382p03812o99758o84381
2745.3G20492482o60956o52671o42955o35743o24955n94318n74648n72681n37277n03778
$$ plain form
2765.7 714492500 713942051 713308156 712628722 711945176 711226404 710401654 709499061 708588779 707639039 706626832
2786.1 706626832 705582917 704470813 703245580 701932609 700582623 699211419 697780311 696242154
2802.4 696242154 694595158 692898750 691194355 689429045 687553167 685618043 683662236 681641698
2818.8 681641698 679516792 677301288 675031066 672687709 670263588 667800069 665276706 662687540
2835.1 662687540 660040557 657215714 654122829 650820673 647357583 643741429 640060842 636509657
2851.4 636509657 633291066 630480051 627960861 625491738 622796237 619657278 616015851 611923158
2867.7 611923158 607430637 602631211 597641647 592550993 587576866 583030999 579129934 575953126
2884 575953126 573445857 571537614 570200741 569311142 568669200 568104148 567464709 566698372 565816522
$$ packed form
2765.7G14492500n50449o33895o79434o83546p18772q24750r02593r10282r49740j012207
2786.1G06626832j043915j112104j225233j312971j349986j371204j431108j538157
2802.4F96242154j646996j696408j704395j765310j875878j935124j955807k020538
2818.8F81641698k124906k215504k270222k343357k424121k463519k523363k589166
2835.1F62687540k646983k824843l092885l302156l463090l616154l680587l551185
2851.4F36509657l218591k811015k519190k469123k695501l138959l641427m092693
2867.7F11923158m492521m799426m989564n090654m974127m545867l901065l176808
2884E75953126k507269j908243j336873q89599o41942n65052o39439p66337q81850
$$ plain form
2902.4 565816522 564735234 563380122 561745048 559741676 557248890 554221094 550727606 547002971
2918.7 547002971 543340921 539978623 537108481 534916580 533550322 533116579 533788025 535695016 538724124
2937 538724124 542644262 547271371 552368462 557679057 563070893 568519533 574013770 579507351 584972799
2955.4 584972799 590375721 595646679 600699961 605400980 609662652 613566220 617260814 620841563
2971.7 620841563 624308825 627644062 630905867 634057760 636929572 639482617 641797185 643900692
2988 643900692 645804644 647423923 648665667 649659932 650448680 650947809 651183665 651122391 650746524 650198162
3008.4 650198162 649540961 648652017 647431612 645925343 644217014 642383516 640530288 638642609 636590183
3026.8 636590183 634405792 632199943 629976511 627666235 625251770 622843146 620452523 617973506
$$ packed form
2902.4E65816522j081288j355112j635074k003372k492786l027796l493488l724635
2918.7E47002971l662050l362298k870142k191901j366258m33743O71446J906991L029108
2937E38724124L920138M627109N097091N310595N391836N448640N494237N493581N465448
2955.4E84972799N402922N270958N053282M701019M261672L903568L694594L580749
2971.7F20841563L467262L335237L261805L151893K871812K553045K314568K103507
2988F43900692J903952J619279J241744R94265P88748M99129K35856o1274l75867n48362
3008.4F50198162o57201q88944j220405j506269j708329j833498j853228j887679k052426
3026.8F36590183k184391k205849k223432k310276k414465k408624k390623k479017
$$ plain form
3043.1 617973506 615369141 612685859 610040903 607438982 604766488 602045536 599331200 596588910
3059.4 596588910 593840778 591182053 588622928 586005092 583229899 580434024 577753484 575188518
3075.7 575188518 572681904 570110202 567394197 564603865 561824024 559097946 556426048 553726494
3092.1 553726494 550977349 548304319 545768917 543200731 540490925 537829757 535355926 532911837
3108.4 532911837 530332804 527802765 525518835 523261130 520807624 518159807 515391409 512692332
3124.7 512692332 510196567 507830083 505442381 503005028 500677168 498547584 496412426 494036555
3141 494036555 491534263 489144474 486908287 484853089 482942373 480871469 478488207 476086020 473893046
3159.4 473893046 471843630 469836205 467821777 465801924 463826537 461913973 460022092 458124906
$$ packed form
3043.1F17973506k604365k683282k644956k601921k672494k720952k714336k742290
3059.4E96588910k748132k658725k559125k617836k775193k795875k680540k564966
3075.7E75188518k506614k571702k716005k790332k779841k726078k671898k699554
3092.1E53726494k749145k673030k535402k568186k709806k661168k473831k444089
3108.4E32911837k579033k530039k283930k257705k453506k647817k768398k699077
3124.7E12692332k495765k366484k387702k437353k327860k129584k135158k375871
3141D94036555k502292k389789k236187k055198j910716k070904k383262k402187k192974
3159.4D73893046k049416k007425k014428k019853j975387j912564j891881j897186
$$ plain form
3175.7 458124906 456201196 454268485 452414572 450675786 448977411 447258770 445529610 443798929
3192 443798929 442078561 440372348 438700408 437088221 435515881 433984578 432521284 431074470 429605752
3210.3 429605752 428166181 426753879 425354958 423979193 422600031 421228766 419903815 418636620
3226.7 418636620 417449713 416368365 415303230 414064616 412676543 411363095 410208702 409151673
3243 409151673 408149749 407142878 406050742 404981256 404069901 403207183 402222127 401178271 400251627
3261.3 400251627 399402529 398554236 397828132 397223026 396474183 395544082 394632638 393764257 392889142 392028600
3281.7 392028600 391224593 390488863 389835238 389272183 388663262 387893736 387023360 386123031 385270953 384568959
3302.1 384568959 384021133 383391798 382433653 381259799 380124718 379104018 378132582 377167255 376236707
$$ packed form
3175.7D58124906j923710j932711j853913j738786j698375j718641j729160j730681
3192D43798929j720368j706213j671940j612187j572340j531303j463294j446814j468718
3210.3D29605752j439571j412302j398921j375765j379162j371265j324951j267195
3226.7D18636620j186907j081348j065135j238614j388073j313448j154393j057029
3243D09151673j001924j006871j092136j069486r11355q62718r85056j043856r26644
3261.3D00251627q49098q48293p26104o05106p48843r30101r11444q68381q75115q60542
3281.7C92028600q04007p35730o53625n63055o08921p69526q70376r00329q52078p01994
3302.1C84568959n47826o29335r58145j173854j135081j020700r71436r65327r30548
$$ plain form
3320.5 376236707 375374168 374513477 373514831 372377872 371232629 370169789 369242728 368423402 367486298
3338.8 367486298 366331726 365153193 364034325 362997055 362081677 361045718 359721690 358376622
3355.2 358376622 357267946 356295288 355220526 354095101 353192747 352455884 351490110 350132614 348736852
3373.5 348736852 347661436 346785605 345880747 344902486 343944490 343150228 342645079 342402011 342034847
3391.9 342034847 341287673 340512037 340105921 339921057 339421272 338493764 337698191 337287158 337010503 336700886
3412.3 336700886 336244434 335709095 335334182 335080415 334844172 334749788 334873199 335097462 335236430 335400134
3432.7 335400134 335754275 335980892 335850805 335676968 335780650 336152166 336584449 336978525 337451130 338009596
3453.1 338009596 338565230 339248151 340119302 340857238 341492057 342452079 343614161 344443142 344846904
$$ packed form
3320.5C76236707q62539q60691r98646j136959j145243j062840r27061q19326r37104
3338.8C67486298j154572j178533j118868j037270r15378j035959j324028j345068
3355.2C58376622j108676r72658j074762j125425r02354p36863r65774j357496j395762
3373.5C48736852j075416q75831r04858r78261r57996p94262n05149k43068l67164
3391.9C42034847p47174p75636m06116j84864m99785r27508p95573m11033k76655l09617
3412.3C36700886m56452n35339l74913k53767k36243r4384J23411K24263J38968J63704
3432.7C35400134L54141K26617j30087j73837J03682L71516M32283L94076M72605N58466
3453.1C38009596N55634O82921Q71151P37936O34819R60022J162082Q28981M03762
$$ plain form
3471.4 344846904 345257938 345945626 346875459 347798795 348496586 349258572 350298136 351289511 352138937
3489.8 352138937 353096306 354164779 355226249 356230855 357230097 358226925 359092385 359914452 360852778
3508.1 360852778 361914307 363173902 364452332 365479916 366419703 367502660 368764013 369959921
3524.4 369959921 370920539 371886224 373122513 374589294 376088679 377444655 378680497 380094260 381713927
3542.8 381713927 383156240 384264499 385513186 387071490 388701946 390458882 392365724 394329399
3559.1 394329399 396322280 398189336 399812132 401714355 404402018 407308608 409942925 412488580
3575.4 412488580 415178716 418069214 421164304 424295276 427102268 429681540 432804853 436246425
3591.7 436246425 439492345 442862362 446597576 450332969 453961462 457536191 460818738 463997871
$$ packed form
3471.4C44846904M11034O87688R29833R23336O97791P61986J039564R91375Q49426
3489.8C52138937R57369J068473J061470J004606R99242R96828Q65460Q22067R38326
3508.1C60852778J061529J259595J278430J027584R39787J082957J261353J195908
3524.4C69959921R60618R65685J236289J466781J499385J355976J235842J413763J619667
3542.8C81713927J442313J108259J248687J558304J630456J756936J906842J963675
3559.1C94329399J992881J867056J622796J902223K687663K906590K634317K545655
3575.4D12488580K690136K890498L095090L130972K806992K579272L123313L441572
3591.7D36246425L245920L370017L735214L735393L628493L574729L282547L179133
$$ plain form
3608.1 463997871 467495322 471195042 474988282 478794724 482512891 486582458 490870178 494715989
3624.4 494715989 497857481 500744462 504640937 509104669 513260961 517115951 520826697 524530530
3640.7 524530530 528204679 531532884 534288347 537090361 541031897 545445323 549351156 553099632
3657 553099632 557026684 560602129 563723683 566697061 569292545 571453035 574141264 577053726 579418778
3675.4 579418778 582320869 585823298 589099050 592051029 594646931 596705079 598445415 600819051
3691.7 600819051 603722513 606332958 608405888 610092521 611707509 613661706 615680754 617160857
3708 617160857 618075967 619320273 621569216 623911202 625680327 626997769 628167450 629419565 630891979
3726.4 630891979 632518470 633712053 634228706 634778440 636202812 638235748 639906704 640437961 640412867
$$ packed form
3608.1D63997871L497451L699720L793240L806442L718167M069567M287720L845811
3624.4D94715989L141492K886981L896475M463732M156292L854990L710746L703833
3640.7E24530530L674149L328205K755463K802014L941536M413426L905833L748476
3657E53099632L927052L575445L121554K973378K595484K160490K688229K912462K365052
3675.4E79418778K902091L502429L275752K951979K595902K058148J740336K373636
3691.7F00819051K903462K610445K072930J686633J614988J954197K019048J480103
3708F17160857R15110J244306K248943K341986J769125J317442J169681J252115J472414
3726.4F30891979J626491J193583N16653N49734J424372K032936J670956N31257k5094
$$ plain form
3744.7 640412867 641491413 642711103 643346310 644797504 646901488 648474991 649516463 650793254
3761 650793254 652186513 653162003 653933525 654760122 655869484 657295108 658529878 659321487 659908831
3779.4 659908831 660702765 661599278 662479103 663511276 664572477 665449202 665994346 666258752 666643739
3797.7 666643739 666950941 667193890 668228507 669330657 670216918 671487987 672609627 672909796 672714472
3816.1 672714472 672980368 673380315 674091101 675498068 676647902 677379251 677955210 678413868 678862929
3834.4 678862929 678965747 678822279 679408252 680651426 681946993 683007479 683564961 683229864 682061434
3852.8 682061434 682229578 684091926 685665846 686303437 686283052 686408520 686871111 687044084 687303424
3871.2 687303424 688143134 689192414 690060675 690276921 690351784 690900683 691443384 692034304 692516446 692691505
$$ packed form
3744.7F40412867J078546J219690O35207J451194K103984J573503J041472J276791
3761F50793254J393259R75490P71522Q26597J109362J425624J234770P91609N87344
3779.4F59908831P93934Q96513Q79825J032173J061201Q76725N45144K64406L84987
3797.7F66643739L07202K42949J034617J102150Q86261J271069J121640L00169j95324
3816.1F72714472K65896L99947P10786J406967J149834P31349N75959M58658M49061
3834.4F78862929J02818j43468N85973J243174J295567J060486N57482l35097j168430
3852.8F82061434J68144J862348J573920O37591k0385J25468M62591J72973K59340
3871.2F87303424Q39710J049280Q68261K16246P4863N48899N42701N90920M82142J75059
$$ plain form
3891.6 692691505 693202078 693901241 694065154 693739116 693545997 693871915 694801748 695951283 696787894
3909.9 696787894 697215855 697338462 697220683 697180271 697496712 697898090 698120594 698392093 698788583 699047327
3930.3 699047327 699341834 699875057 700283051 700398326 700414300 700543284 700900733 701236844 701390207 701656759
3950.7 701656759 702081382 702428758 702690303 702918947 703066587 703191340 703416944 703692436 703904390 704082668
3971.1 704082668 704280078 704518735 704791665 705017328 705244303 705486953 705612063 705678463 705826163 706033945
3991.5 706033945 706253767 706496894 706719458
3997.6 706719458
$$ packed form
3891.6F92691505N10573O99163J63913l26038j93119L25918R29833J149535Q36611
3909.9F96787894M27961J22607j17779m0412L16441M01378K22504K71499L96490K58744
3930.3F99047327K94507N33223M07994J15275J5974J28984L57449L36111J53363K66552
3950.7G01656759M24623L47376K61545K28644J47640J24753K25604K75492K11954J78278
3971.1G04082668J97410K38657K72930K25663K26975K42650J25110O6400J47700K07782
3991.5G06033945K19822K43127K22564
3997.6G06719458
##END=$$ End of the data block
