##TITLE=$$ Begin of the data block
##JCAMP-DX=5.00 $$ ACD/SpecManager v 10.08
##SPECTROMETER/DATA SYSTEM=Alpha
##DATE=29 Dec 2014 15:06:02
##DATA TYPE=INFRARED SPECTRUM
##DATA CLASS=XYDATA
##ORIGIN=
##OWNER=
##NPOINTS=1765
##FIRSTX=399.76428223
##LASTX=3997.64306641
##MAXX=3997.64306641
##MINX=399.76428223
##MAXY=0.83837485
##MINY=0.27588749
##XFACTOR=1.0000000000
##YFACTOR=1.000000000000000e-9
##FIRSTY=0.56317788
##DELTAX=2.03961372
##XUNITS=1/CM
##YUNITS=ARBITRARY UNITS
##XYDATA=(X++(Y..Y))
399.8E63177884n550921l606677j089812Q30293J007617K98321J62065P89702J788735
418.1E57807207J116634j940072l503859k448142j170158j737356l252805m089951
434.4E40781498k847433N34892L477216M441917L921568L383398L824055L974617K359211
452.8E63850939k40504k134264j980722l60489k84910k400935m609108m705310l022193
471.2E44112504j473546j538575k894402l319680j637340O75738J396298Q3685j537382
489.5E33867300j743138n47767O8367j057923k903045l812074k874673j500904j692832
507.9E17803311l353059m904270m976094l936052l090859l201544l831387l520071
524.2D86989975j531482Q86142J634300Q79199P27325K680600N704492P184178N844176
$$ plain form
399.8 563177884 557626963 554020286 552930474 553760767 554768384 555066705 555228770 556018472 557807207
418.1 557807207 558923841 556983769 553479910 551031768 549861610 548124254 544871449 540781498
434.4 540781498 537934065 538468957 541946173 546388090 550309658 553693056 557517111 561491728 563850939
452.8 563850939 563610435 561476171 559495449 559134960 558850050 556449115 551840007 547134697 544112504
471.2 544112504 542638958 541100383 538205981 534886301 533248961 533924699 535320997 535404682 533867300
489.5 533867300 532124162 531576395 531644762 530586839 527683794 523871720 520997047 519496143 517803311
507.9 517803311 514450252 509545982 504569888 500633836 497542977 494341433 490510046 486989975
524.2 486989975 485458493 486344635 487978935 488858134 489585459 492266059 497970551 505154729 510998905
542.5E10998905K846896N48363N5790K82645l84748k306103m227698m672766l891319
560.9D99249965l821522n551428p767111q121907n998969k733589K71827K175212L352821
579.3D71055299N100369P405222Q581579P440746M612594K191782J428008J715839
595.6E09531438J564265J20580j422048j436889m8101J396060J708627R09984M77433
613.9E12801349J530647L413737M621208M290760L086566K556921L293931M105985
630.2E39701104L665984K031922O02484O66261J856207K566815J850784M09126j54376
648.6E53196311Q89122K298356K438485J136244j80066m9770J273334K266228K250850
667E65519094Q55387j12236Q93057K508163L088653J927912L76106J56819J306296
$$ plain form
542.5 510998905 513845801 514394164 514449954 514732599 514347851 512041748 507814050 503141284 499249965
560.9 499249965 495428443 489877015 482109904 473987997 467989028 465255439 465527266 467702478 471055299
579.3 471055299 476155668 483560890 492142469 499583215 504195809 506387591 507815599 509531438
595.6 509531438 511095703 511216283 509794235 508357346 508309245 509705305 511413932 512323916 512801349
613.9 512801349 514331996 517745733 522366941 526657701 529744267 532301188 535595119 539701104
630.2 539701104 543367088 545399010 546001494 546667755 548523962 551090777 552941561 553350687 553196311
648.6 553196311 554085433 556383789 558822274 559958518 559778452 559728682 561002016 563268244 565519094
667 565519094 566374481 566262245 567155302 569663465 572752118 574680030 575056136 575212955 576519251
685.3E76519251K267480J582622n34117k218068k175748j258254j205802k592087m054606
703.7E66330671l716826j412749J232087K578259K470433K360464L574192N783081
720E79199612P223964O698608N007029L921628M458487N527437N172371L078044Q74519
738.3F21161699K64764R96173J143157o13689l440917n279601n038499l790200l395677
756.7F02007210m285216n074382m113078j300395J829744L788411M508257N159378
773F02519929O911219R276449J0279119Q846998O191373M532397M781485N751431N458891
791.4F64549291L631234K105296K505839M447639N801737M810274K186537M32014Q66890
809.7F91336751K318442K524614P65443j249373j501083j64867O42181o66857l471434
$$ plain form
685.3 576519251 578786731 580369353 579835236 577617168 575441420 574183166 572977364 570385277 566330671
703.7 566330671 562613845 561201096 562433183 565011442 567481875 569842339 573416531 579199612
720 579199612 586423576 593122184 598129213 602050841 606509328 612036765 617209136 620287180 621161699
738.3 621161699 621426463 622422636 623565793 622952104 619511187 614231586 609193087 605402887 602007210
756.7 602007210 597721994 592647612 588534534 587234139 589063883 592852294 597360551 602519929
773 602519929 609431148 618707597 628986716 637833714 644025087 648557484 653338969 659090400 664549291
791.4 664549291 668180525 670285821 672791660 677239299 683041036 687851310 690037847 690469861 691336751
809.7 691336751 693655193 696179807 696945250 695695877 694194794 694029927 694672108 694005251 690533817
828.1F90533817n549312n463660m158973l708542m782736o097257o023646m382133
844.4F50367558k724946k729952m331887n873918n953729m794777l500402j915991
860.7F18541956J009881N168200R448886J2670636J3588309J1560262P885038M920662
877F84793830L294825J496017j677870n295694p278085o860197n374968m705607n409420
895.4F52982831o362259o245196n163133m556537n616248p904827r763003j0149955
911.7E97221673r644986r428501r670675r305775p349431m126430j172840K01165K87116
930.1E47011316M67956J668870L583730N062282N290270M325866K522290q404l341019
948.4E66583157p382393j1479020j4531374j5857160j5951217j6070842j6927481j8150658
$$ plain form
828.1 690533817 684984505 679520845 675361872 671653330 666870594 660773337 654749691 650367558
844.4 650367558 647642612 644912660 640580773 634706855 628753126 623958349 620457947 618541956
860.7 618541956 619551837 624720037 634168923 646839559 660427868 671988130 679873168 684793830
877 684793830 688088655 689584672 687906802 682611108 675333023 668472826 663097858 658392251 652982831
895.4 652982831 646620572 640375376 635212243 630655706 625039458 617134631 607371628 597221673
911.7 597221673 587576687 578148186 568477511 559171736 551822305 547695875 546523035 546724200 547011316
930.1 547011316 547479272 549148142 552731872 557794154 563084424 567410290 569932580 569924176 566583157
948.4 566583157 559200764 547721744 533190370 517333210 501381993 485311151 468383670 450233012
964.7D50233012j8974632j9088327j8835873j8662274j8528044j7920643j6411066
979C21812153j3977081j1036426q235752n916387l985554k202749n70715O77646J353800
997.4B77918935J506507J397580J257032J101077P45863J24782m41909m66347K05309
1015.7B83348829J248508K126813K582669K878100L377020L990502M371285M213274
1032C08137000L396421K278030J368433R13054P91967P33346O69092R71883K123773
1050.4C21382999L972680N741358O853461P558405Q507580R870857J0611206Q682668
1066.7C83181214K847612m988312j0459215j0877818p586628l712773q57890J215756
1083C48761946L048927M649251N680919O008804N890876N596191N009472L874779K253562
$$ plain form
964.7 450233012 431258380 412170053 393334180 374671906 356143862 338223219 321812153
979 321812153 307835072 296798646 288562894 282646507 278660953 276458204 275887489 276565135 277918935
997.4 277918935 279425442 280823022 282080054 283181131 283926994 284051776 283609867 283143520 283348829
1015.7 283348829 284597337 286724150 289306819 292184919 295561939 299552441 303923726 308137000
1032 308137000 311533421 313811451 315179884 316092938 316884905 317618251 318287343 319259226 321382999
1050.4 321382999 325355679 331097037 337950498 345508903 354016483 363887340 374498546 383181214
1066.7 383181214 386028826 381040514 370581299 359703481 352116853 348404080 347546190 348761946
1083 348761946 351810873 356460124 362141043 368149847 374040723 379636914 384646386 388521165 390774727
1101.4C90774727P48455K85268J307041L090590M390567M555703L863871L065914K596289
1119.8D14678425K363413K146423K071887K588481L782958M824966M504502K272457
1136.1D39233512j260251m682630o858409p657766p707507p489055o880373n559176
1152.4C91138345l629237j671493j93835Q56698K045691L882050O307185Q690149J0392218
1170.7D17817771J1323184J1964739J2740641J3527930J3768614J3079226J1755883
1185E05977988J0450721R466410Q346200O530702M248977K417266J788556K151430
1201.3E51378250K577305K518415K337754K754450L990531N384266N882025N092263
1217.7E81915259L638685K421439J737773J123786N8294j291335k191067k149701j496613
$$ plain form
1101.4 390774727 391523182 391808450 393115491 396206081 400596648 405152351 409016222 412082136 414678425
1119.8 414678425 417041838 419188261 421260148 423848629 427631587 432456553 436961055 439233512
1136.1 439233512 437973261 433290631 426432222 418774456 411066949 403577894 396697521 391138345
1152.4 391138345 387509108 385837615 385643780 386500478 388546169 392428219 398735404 407425553 417817771
1170.7 417817771 429140955 441105694 453846335 467374265 481142879 494222105 505977988
1185 505977988 516428709 525895119 534241319 540772021 545020998 547438264 549226820 551378250
1201.3 551378250 553955555 556473970 558811724 561566174 565556705 570940971 576822996 581915259
1217.7 581915259 585553944 587975383 589713156 590836942 590895236 589603901 587412834 585263133 583766520
1236E83766520r94861j061201j296580q65519M31657J832664K440035K103329J474559
1254.4E87830603J240611J437485J594186J332164Q95500R59993J727521K575100K644538
1272.7F02237701J656771K52783n98251n56171j89007k48134q34703j399279j444578
1291.1E98877132j137257j072466j611054k427936k754151k305091j651525j457692
1307.4E84459960j725614j973629j744330j073479n92292q21530j793564l107369m167258
1325.8E67460895m691065m943073n181908n163908m470766l039717j208604J25170
1342.1E38887024L49998P6592M2260K82049L76642l2425p75516j332581j391053q88944
1362.5E35594046j64330j20461n52058m51326L01241J273036J659871J151025O17206
$$ plain form
1236 583766520 582771659 581710458 580413878 579548359 579980016 581812680 584252715 586356044 587830603
1254.4 587830603 589071214 590508699 592102885 593435049 594330549 595290542 597018063 599593163 602237701
1272.7 602237701 603894472 604147255 603549004 602992833 602803826 602555692 601720989 600321710 598877132
1291.1 598877132 597739875 596667409 595056355 592628419 589874268 587569177 585917652 584459960
1307.4 584459960 582734346 580760717 579016387 577942908 577350616 576529086 574735522 571628153 567460895
1325.8 567460895 562769830 557826757 552644849 547480941 543010175 539970458 538761854 538887024
1342.1 538887024 539237022 539313614 539355874 539637923 540014565 539982140 539206624 537874043 536482990 535594046
1362.5 535594046 535429716 535309255 534757197 534305871 534607112 535880148 537540019 538691044 539308250
1380.8E39308250R72450K345264M152536M760385L445565J770974P18355L24487q8095
1399.2E57710171p26342j534820k111018j840889j511216j701355k006293k119958
1415.5E44158280k012014j128614J73389N59688M89056N18680Q91626J605987J831353
1433.9E47087431J610339J670062J815617J879931J719892J024723q2672r47952j329482
1452.2E54447889j626253k518475k356231k71797O92427J654625L457486M637778N569458
1470.6E63686907P770121R209216Q893490Q368075P769346O962061N769908N176485
1486.9F23605609N771279O464005N316675L890514L667295M130959M088760L176093
1503.2F60111189K092600K280771L359318L334821K863287K198041J753986J491070
$$ plain form
1380.8 539308250 540280700 542625964 546778500 551538885 554984450 556755424 557473779 557798266 557710171
1399.2 557710171 556983829 555449009 553337991 551497102 549985886 548284531 546278238 544158280
1415.5 544158280 542146266 541017652 541191041 541750729 542239785 542758465 543650091 545256078 547087431
1433.9 547087431 548697770 550367832 552183449 554063380 555783272 556807995 556725323 555777371 554447889
1452.2 554447889 552821636 550303161 547946930 547675133 548367560 550022185 553479671 558117449 563686907
1470.6 563686907 571457028 580666244 589559734 597927809 605697155 612659216 618429124 623605609
1486.9 623605609 629376888 635840893 641157568 645048082 648715377 652846336 656935096 660111189
1503.2 660111189 662203789 664484560 667843878 671178699 674041986 676240027 677994013 679485083
1519.5F79485083J773774K521634K652109K351224J649321J015663J218915J634180
1535.8F94301903R47953J1563M68969J411319J670241J306176O45280j7643o31868
1554.2G00113893j110793j393914o2465O76691m18067j277626j576721j337648q38399
1572.6F92774951j598596k736271j909732j124561j377464j783549k249122k563477
1588.9F77432179k497553k207578k123952k352774k704024k936244k813101k585590
1605.2F57211363k763867l323495l568590l465355l879964m124939k878666k806068
1621.5F30400419l687382l225564k493561k176642j869023k191067k527416p70747
1637.8F11459017O53088O65843K57850J23739J239181K005696K034664L314555L793180
$$ plain form
1519.5 679485083 681258857 683780491 686432600 688783824 690433145 691448808 692667723 694301903
1535.8 694301903 695249856 695261419 695730388 697141707 698811948 700118124 700763404 700745761 700113893
1554.2 700113893 699003100 697609186 697546721 698223412 697805345 696527719 694950998 693613350 692774951
1572.6 692774951 691176355 688440084 686530352 685405791 684028327 682244778 679995656 677432179
1588.9 677432179 674934626 672727048 670603096 668250322 665546298 662610054 659796953 657211363
1605.2 657211363 654447496 651124001 647555411 644090056 640210092 636085153 633206487 630400419
1621.5 630400419 626713037 623487473 620993912 618817270 616948247 614757180 612229764 611459017
1637.8 611459017 612112105 612777948 613035798 613159537 614398718 616404414 618439078 621753633 625546813
1656.2F25546813L248453L154040L705143M212261L610730L286242M066468M419982
1672.5F55250132M688382N051196M372001L527164L584921N436063N771697M633307
1688.8F92314863M165769L354549K898216L035009L088773L362953K726376K034188
1705.1G16980696K262652K376258J926482J228988P66694J425624K646387K659678
1721.5G32273459K167047J785457J385986J212538J274883J769364K393365J964152
1737.8G46226251J641870J958370K262294K201855J983703K200126K831459K861321
1754.1G64167249K612591K400756J908123J758218J945317J794577J395344R37164
1770.4G78919339R45926J526236J704872J497984J262903J012922Q14974Q46326Q26597
$$ plain form
1656.2 625546813 628795266 631949306 635654449 639866710 643477440 646763682 650830150 655250132
1672.5 655250132 659938514 664989710 669361711 672888875 676473796 681909859 687681556 692314863
1688.8 692314863 696480632 699835181 702733397 705768406 708857179 712220132 714946508 716980696
1705.1 716980696 719243348 721619606 723546088 724775076 725541770 726967394 729613781 732273459
1721.5 732273459 734440506 736225963 737611949 738824487 740099370 741868734 744262099 746226251
1737.8 746226251 747868121 749826491 752088785 754290640 756274343 758474469 761305928 764167249
1754.1 764167249 766779840 769180596 771088719 772846937 774792254 776586831 777982175 778919339
1770.4 778919339 779865265 781391501 783096373 784594357 785857260 786870182 787685156 788531482 789358079
1788.8G89358079O63519Q51095J016617P90357O93143J020491J318574J041591N46098
1807.1G97299564L91006P45595J095593R28342N55933M04954L89099M31537O04034
1825.5H02845657N16355K76089N51760Q41677P34031N58794K53677k02715k52128M55856
1845.9H06579053Q86798O57916K61486N2512J69098L71575L96252J82927j35362l53873
1866.3H09068382r3162O22213Q23855M47273J61946J93834L39687M15206L40164J22011
1886.7H12441409J2457K87473N09858M17292L33786K37585J22070J22011J79171J29223
1907.1H14792335L8087P7486J17600K3783o259J48595J66177J28925K52724L09825
1927.5H16049278K52664J68979O4313j2159J0848J6213j0312J13428K15292J86026
$$ plain form
1788.8 789358079 790021598 790872693 791889310 792679667 793372810 794393301 795711875 796753466 797299564
1807.1 797299564 797690570 798436165 799531758 800460100 801016033 801420987 801810086 802241623 802845657
1825.5 802845657 803362012 803638101 804189861 805031538 805765569 806324363 806578040 806375325 806123197 806579053
1845.9 806579053 807465851 808123767 808385253 808437765 808606863 808978438 809374690 809557617 809422255 809068382
1866.3 809068382 808975220 809597433 810421288 810868561 811030507 811224341 811564028 811979234 812319398 812441409
1886.7 812441409 812453866 812741339 813251197 813668489 814002275 814239860 814361930 814483941 814663112 814792335
1907.1 814792335 814830422 814907908 815025508 815049291 815043032 815191627 815357804 815486729 815739453 816049278
1927.5 816049278 816301942 816470921 816535234 816523075 816533923 816550136 816539824 816653252 816868544 817054570
1947.9H17054570K29716L03984K68757J61290P5579R1493J99735K40267J40905P5221
1968.3H18841517R8705J64211K63095K68996J30832k3425k7358R5963J45674M4107
1988.7H20002317p5519m7624P8619J49488J51634L7134j42097k00510j19806k205l1769
2011.1H19799662k51890m63128m67479l14832k93314m98116o06060l38793o1095o2048
2031.5H16442907j49250k74241m32253m62294k98917j06335q5055k21253k96831k08139
2051.9H13908339l9936R1196P2002n4419j17898l0398J54554K62678J61409l3915q1777
2074.3H14291835N3167J80841J61409L8803l2723K0861J32621K24352K19762R4116
2094.7H15385044m650R2388K72810L28303K30014P9393L7968J33694K07662J70469
$$ plain form
1947.9 817054570 817284286 817588270 817857027 818018317 818093896 818185389 818385124 818625391 818766296 818841517
1968.3 818841517 818940222 819104433 819367528 819636524 819767356 819743931 819716573 819812536 819958210 820002317
1988.7 820002317 819926798 819879174 819957793 820107281 820258915 820296049 820153952 819953442 819833636 819831431 819799662
2011.1 819799662 819547772 819084644 818617165 818302333 818009019 817510903 816904843 816566050 816504955 816442907
2031.5 816442907 816293657 816019416 815587163 815124869 814825952 814719617 814634562 814413309 814116478 813908339
2051.9 813908339 813868403 813959599 814031601 813977182 813859284 813828886 813983440 814246118 814407527 814373612 814291835
2074.3 814291835 814345002 814525843 814687252 814726055 814693332 814714193 814846814 815071166 815290928 815385044
2094.7 815385044 815380394 815472782 815745592 816073895 816303909 816383302 816421270 816554964 816762626 816933095
2115.1H16933095P9394r120l4630L3319J12414J17302M8042l0935l6717N4658J37567
2137.5H17404389J08421%o7830o139J49846K15292R5487r835N5313K15590L32951L13223
2162H18806708J98960J31726K25664M67956O30498N30362L10182K26260L75807N75125
2182.4H22479248N53906L60608K65837L35574M31120M51684L74675K62201K41995L52263
2202.8H26109111M84765M84526L33905K11001K55108M13954N03838M13895K50756J67609
2223.2H29628468K42173L80576M00424K62380J05261J17898K50995L02375K43783J49429
2243.6H32083762J16765J79589K19047K07543J84536J23144J02460J77860K39253K20418
2264H33854377J70112J57714J94371K09331K03133K05815J54972Q8334J14023J93656
$$ plain form
2115.1 816933095 817012489 817003369 816968739 817002058 817114472 817231774 817279816 817248881 817212164 817266822 817404389
2137.5 817404389 817512810 817512810 817444980 817438841 817588687 817803979 817899466 817889631 817944944 818160534 818493485 818806708
2162 818806708 819005668 819137394 819363058 819831014 820461512 820991874 821302056 821528316 821904123 822479248
2182.4 822479248 823033154 823393762 823659599 823995173 824426293 824877977 825252652 825514853 825756848 826109111
2202.8 826109111 826593876 827078402 827412307 827623308 827878416 828292370 828796208 829210103 829460859 829628468
2223.2 829628468 829870641 830251217 830651641 830914021 831019282 831137180 831388175 831690550 831934333 832083762
2243.6 832083762 832200527 832380116 832599163 832806706 832991242 833114386 833216846 833394706 833633959 833854377
2264 833854377 834024489 834182203 834376574 834585905 834789038 834994853 835149825 835238159 835352182 835545838
2284.4H35545838K13146J66535J20819J32978J76847J73509J31190P8201M1724O8366
2304.8H36849153J47820K11060K03251J24574N8592P8976J46091K17914K25365J12057
2325.2H38374853j0550k0683J1325k2948n9366o0618r1552j49370j92761l70920m70817
2347.6H36936593j96516J68740L32833L55303K71678l4690k87890l42966l19123l83496
2368H36500466o18100p37667o33300m34756k59757k74837l84867l83258k77519j52111
2388.4H32344294r9659j66476k87771l37601k51710j36078j44482k74777l84629l69310
2408.8H29891801k72870k41995l49581n08726n51701m48107l62039m06265n09858n61059
2429.2H25679600n35667m54783m12822n09858o60479o94811n86927m48466m21047n35667
$$ plain form
2284.4 835545838 835758984 835925519 836046338 836179316 836356163 836529672 836660862 836739063 836780787 836849153
2304.8 836849153 836996973 837208033 837411284 837535858 837594450 837673426 837819517 838037431 838262796 838374853
2325.2 838374853 838364303 838343620 838354945 838331997 838272631 838212013 838120461 837971091 837778330 837407410 836936593
2347.6 836936593 836740077 836908817 837241650 837596953 837868631 837833941 837546051 837203085 836883962 836500466
2368 836500466 835882366 835144699 834511399 834076643 833816886 833542049 833157182 832773924 832496405 832344294
2388.4 832344294 832244635 832078159 831790388 831452787 831201077 831064999 830920517 830645740 830261111 829891801
2408.8 829891801 829618931 829376936 829027355 828518629 827966928 827518821 827156782 826750517 826240659 825679600
2429.2 825679600 825143933 824689150 824276328 823766470 823105991 822411180 821824253 821375787 820954740 820419073
2449.6H20419073o34253o04391n13315m65453m98652n58555n73874n24700m48942m17054
2470H15179884m56333n17964n27203m61400l88562l91782m75824n27501m66048l62039
2490.4H10605228l13938l25978l20494k82228k61962k62141k85924l50535l98576l46065
2510.8H07457387k49266k40028l31163m05789m02033m01914m37558m37975m46856n35250
2531.2H03569555o15418o12437n67377n24580n27442n91993o54400o47425n91457n66542
2551.6G97670484n91815o22630o40094o23644n64277n14567n25951n77450o02424n82338
2572G91825294n61356n70655n88059n71370n37217n01394m72129m80532m92216m62710
2592.4G86587656m07041l78429m02391m38035m49836m31359m23670m88341n89788o74605
$$ plain form
2449.6 820419073 819784820 819180429 818667114 818201661 817703009 817144454 816570580 816045880 815596938 815179884
2470 815179884 814723551 814205587 813678384 813216984 812828422 812436640 811960816 811433315 810967267 810605228
2490.4 810605228 810291290 809965312 809644818 809362590 809100628 808838487 808552563 808202028 807803452 807457387
2510.8 807457387 807208121 806968093 806636930 806231141 805829108 805427194 804989636 804551661 804104805 803569555
2531.2 803569555 802954137 802341700 801774323 801249743 800722301 800130308 799475908 798828483 798237026 797670484
2551.6 797670484 797078669 796456039 795815945 795192301 794628024 794113457 793587506 793010056 792407632 791825294
2572 791825294 791263938 790693283 790105224 789533854 788996637 788495243 788023114 787542582 787050366 786587656
2592.4 786587656 786180615 785802186 785399795 784961760 784511924 784080565 783656895 783168554 782578766 781904161
2612.8G81904161p25865p26104p26164q00609r19998r88543r90569r86517j000583
2631.1G74039209j015484j035631j056731j061737j071275j074075j078606j125991
2647.4G65519679j147211j072347r93371Tj036942j054824j015901r86219r95457j001060
2667.8G55222976r84192r22203q61525q60513q72492q65758q52823q18253p84993q12650
2688.2G46587574q86857r33051r34482r23633r10342r36031j005948j056075j078069
2706.6G37923086j066804j028776j025856j044512j014232r48191r06110q94070q89122
2724.9G29105413q68499q25703p84398p57992p23421p05123p38979p43150o84381o44028
2745.3G21629739o64354o82592o50585o27935o25908o18219n91457n44667n24819n40614
$$ plain form
2612.8 781904161 781178296 780452192 779726028 778925419 778005421 777016878 776026309 775039792 774039209
2631.1 774039209 773023725 771988094 770931363 769869626 768798351 767724276 766645670 765519679
2647.4 765519679 764372468 763300121 762306750 761313379 760276437 759221613 758205712 757219493 756224036 755222976
2667.8 755222976 754238784 753316581 752455056 751594543 750722051 749856293 749003470 748185217 747400224 746587574
2688.2 746587574 745700717 744767666 743833184 742909551 741999209 741063178 740057230 739001155 737923086
2706.6 737923086 736856282 735827506 734801650 733757138 732742906 731794715 730888605 729994535 729105413
2724.9 729105413 728236914 727411211 726626813 725868821 725145400 724440277 723701298 722958148 722273767 721629739
2745.3 721629739 720965385 720282793 719632208 719004273 718378365 717760146 717168689 716624022 716099203 715558589
2765.7G15558589n79834o24478o35386o34253p08103q40724r24468r45627r46880r63688
2786.1G07755148j024901j128614j218558j269638j339495j419068j466513j523375
2802.4F97364986j635850j746475j762271j752675j835525j923799j954079k009511
2818.8F82744801k093732k190411k277792k337098k425313k513230k549171k581776
2835.1F63776278k647757k811194l074884l299594l471255l631354l694236l565192
2851.4F37580812l230333k809883k518475k495169k732516l153324l643632m119038
2867.7F12878442m527629m786551m950225n085170m999876m577875l948868l237545
2884E76764703k543032j898110j317561r00805o60717n61655n92887p05719q78930
$$ plain form
2765.7 715558589 714978755 714354277 713718891 713084638 712376535 711535811 710611343 709665716 708718836 707755148
2786.1 707755148 706730247 705601633 704383075 703113437 701773942 700354874 698888361 697364986
2802.4 697364986 695729136 693982661 692220390 690467715 688632190 686708391 684754312 682744801
2818.8 682744801 680651069 678460658 676182866 673845768 671420455 668907225 666358054 663776278
2835.1 663776278 661128521 658317327 655242443 651942849 648471594 644840240 641146004 637580812
2851.4 637580812 634350479 631540596 629022121 626526952 623794436 620641112 616997480 612878442
2867.7 612878442 608350813 603564262 598614037 593528867 588528991 583951116 580002248 576764703
2884 576764703 574221671 572323561 571006000 570105195 569444478 568882823 568289936 567584217 566705287
2902.4E66705287j110018j384079j680374k022446k481997l022730l485382l732383
2918.7E47785878l732860l462672k908468k149880j284540l55721P03872J888275K995908
2937E39479792L902435M626275N111455N330980N391121N434692N513370N520523N455255
2955.4E85765898N395293N278707N044043M692912M321456M018307L743946L537298
2971.7F21797860L442228L372609L317773L205061K903939K566397K324641K107918
2988F45038426J923382J671791J291514J013279Q04841N09322K25782m2796l35932
3006.4F52099609n37276o35266q59380j218140j506686j705826j824259j849294j899362
3024.7F40064120k060353k177299k183318k197146k312303k457678k430737k362549
$$ plain form
2902.4 566705287 565595269 564211190 562530816 560508370 558026373 555003643 551518261 547785878
2918.7 547785878 544053018 540590346 537681878 535531998 534247458 533891737 534595609 536483884 539479792
2937 539479792 543382227 548008502 553119957 558450937 563842058 569276750 574790120 580310643 585765898
2955.4 585765898 591161191 596439898 601483941 606176853 610498309 614516616 618260562 621797860
2971.7 621797860 625240088 628612697 631930470 635135531 638039470 640605867 642930508 645038426
2988 645038426 646961808 648633599 649925113 650938392 651743233 652252555 652478337 652435541 652099609
3006.4 652099609 651562333 650927067 650067687 648849547 647342861 645637035 643812776 641963482 640064120
3024.7 640064120 638003767 635826468 633643150 631446004 629133701 626676023 624245286 621882737
3041.1F21882737k453983k593696k671540k662540k639174k681792k717912k736866
3057.4F00725234k778709k759219k655565k569735k614081k749503k792299k702117
3073.7E79104006k563715k477824k566576k730549k770602k761960k747357k708853
3090E57776570k749741k798021k693772k505481k517700k708316k695859k482354k423883
3108.4E34201443k572834k536893k294958k296507k501309k682090k804398k736152
3124.7E13776302k514839k358556k379953k451540k347528k151579k149046k357840
3141D95065421k475292k373904k236068k089739j970112k122194k397477k397359k205521
3159.4D74797755k068579k002179j977146k007365k029747j970321j908749j921714
$$ plain form
3041.1 621882737 619428754 616835058 614163518 611500978 608861804 606180012 603462100 600725234
3057.4 600725234 597946525 595187306 592531741 589962006 587347925 584598422 581806123 579104006
3073.7 579104006 576540291 574062467 571495891 568765342 565994740 563232780 560485423 557776570
3090 557776570 555026829 552228808 549535036 547029555 544511855 541803539 539107680 536625326 534201443
3108.4 534201443 531628609 529091716 526796758 524500251 521998942 519316852 516512454 513776302
3124.7 513776302 511261463 508902907 506522954 504071414 501723886 499572307 497423261 495065421
3141 495065421 492590129 490216225 487980157 485890418 483920306 481798112 479400635 477003276 474797755
3159.4 474797755 472729176 470726997 468749851 466742486 464712739 462742418 460833669 458911955
3175.7D58911955j955539j909524j810133j751215j735359j737863j754463j751065
3192D44506794j716554j701266j690745j642018j572907j514167j482666j490265j484930
3210.3D30211276j437903j425355j429737j397520j407981j435816j360119j239985
3226.7D19076860j149714j058489j049072j239001j405299j339018j194537j085222
3243D09556508r97126r89229j083582j114249j004339r00894r24885r84937r50128
3261.3D00607139q62539p97540p33495o69926p51108q92997q91119q46475q56221q54850
3281.7C92450869p88510p34389p19666o40482o14375p28905q34852r09448q84354p04140
3302.1C84891748n61118o50912r50307j188278j178503j041979r85205r96768r51529
$$ plain form
3175.7 458911955 456956416 455046892 453236759 451485544 449750185 448012322 446257859 444506794
3192 444506794 442790240 441088974 439398229 437756211 436183304 434669137 433186471 431696206 430211276
3210.3 430211276 428773373 427348018 425918281 424520761 423112780 421676964 420316845 419076860
3226.7 419076860 417927146 416868657 415819585 414580584 413175285 411836267 410641730 409556508
3243 409556508 408559382 407570153 406486571 405372322 404367983 403467089 402542204 401557267 400607139
3261.3 400607139 399744600 398947060 398213565 397543639 396792531 395899534 395008415 394161940 393305719 392450869
3281.7 392450869 391662359 390927970 390208304 389567822 388953447 388224542 387389690 386480242 385595888 384891748
3302.1 384891748 384330630 383679718 382729411 381541133 380362630 379320651 378335446 377338678 376387149
3320.5C76387149q57562q36074r91464j159876j148910j031100q85636q14408r53913
3338.8C67708206j147270j173407j161218j109361r35376r97811j312495j382827j156092
3357.2C57332349r94027j051962j095504r13083p80285j002043j346320j362085j075835
3375.5C47711205q77112q85158r90093r87441q11904n18531k19911l37631q05229q73625
3395.9C40404570m22984j71989n35578r31352p35939l64393k75344l36587m54366n10007
3416.3C35666031l92497k73317j99854n2154J07496J97292J51962J46538K87026J97172
3436.7C35835695r4294j30713J07050L44038M04328L72529M41521N45979O21617P33405
3457.1C39181155Q17269P00206O56008R68874J165092Q33213L77208L74973O90788
$$ plain form
3320.5 376387149 375529587 374693513 373702049 372542173 371393263 370362163 369476527 368662119 367708206
3338.8 367708206 366560936 365387529 364226311 363116950 362181574 361183763 359871268 358488441 357332349
3357.2 357332349 356338322 355286360 354190856 353277773 352497488 351495445 350149125 348787040 347711205
3375.5 347711205 346834093 345948935 344958842 343971401 343159497 342640966 342421055 342083424 341278195 340404570
3395.9 340404570 339981586 339809597 339274019 338342667 337606728 337242335 336966991 336630404 336176038 335666031
3416.3 335666031 335273534 335000217 334800363 334748209 334855705 335052997 335204959 335351497 335638523 335835695
3436.7 335835695 335741401 335610688 335717738 336061776 336466104 336838633 337280154 337826133 338447750 339181155
3457.1 339181155 339998424 340698630 341354638 342323512 343488604 344321817 344699025 345073998 345764786
3475.5C45764786R98586J040489P68214P15196R46463R61840Q80986R84580J047730
3493.8C54108870J017630J012117J036078R85831Q17030P98822R67681J148552J345694
3512.2C63238305J295060R96649R27508J141161J344442J203090R02533R20296J226038
3530.6C73195082J508385J548737J350433J263857J470148J604498J448989J193821
3546.9C84583950J292110J561880J643628J748055J917064K029031K040446J871467
3563.2C98687631J619995J863956K612889K871036K686829K655267K755046K890557
3579.5D18643206L090889L165125K861470K585710L111243L491491L315419L363758
3595.8D43628311L676295L702075L617227L605485L374874L244788L479689L652394
$$ plain form
3475.5 345764786 346763372 347803861 348572075 349287271 350233734 351195574 352076560 353061140 354108870
3493.8 354108870 355126500 356138617 357174695 358160526 358977556 359776378 360744059 361892611 363238305
3512.2 363238305 364533365 365530014 366457522 367598683 368943125 370146215 371048748 371969044 373195082
3530.6 373195082 374703467 376252204 377602637 378866494 380336642 381941140 383390129 384583950
3546.9 384583950 385876060 387437940 389081568 390829623 392746687 394775718 396816164 398687631
3563.2 398687631 400307626 402171582 404784471 407655507 410342336 412997603 415752649 418643206
3579.5 418643206 421734095 424899220 427760690 430346400 433457643 436949134 440264553 443628311
3595.8 443628311 447304606 451006681 454623908 458229393 461604267 464849055 468328744 471981138
3612.1D71981138L766775L836274L793180M126251M307270L869504L171265K934158
3628.5E01785815M009425M576624M179537L798068L656685L687620L680825L308654
3644.8E32683253K705574K870858M076064M407286L843427L724992L937424L582417
3661.1E61831295L115654K980054K631903K199411K687216K914369K412856K972126
3677.4E83744884L548085L267169K907694K547085K028882J727283K321542K885163
3693.7F04977787K687335K150535J709402J603186J925945K009869J472890Q96752
3710F19433701J220584K220809K375603J830936J303136J120269J243353J444400J569688
3728.4F33762479J224100O13034N95033J481355K103388J672387M26233j68443J085222
$$ plain form
3612.1 471981138 475747913 479584187 483377367 487503618 491810888 495680392 498851657 501785815
3628.5 501785815 505795240 510371864 514551401 518349469 522006154 525693774 529374599 532683253
3644.8 532683253 535388827 538259685 542335749 546743035 550586462 554311454 558248878 561831295
3661.1 561831295 564946949 567927003 570558906 572758317 575445533 578359902 580772758 583744884
3677.4 583744884 587292969 590560138 593467832 596014917 598043799 599771082 602092624 604977787
3693.7 604977787 607665122 609815657 611525059 613128245 615054190 617064059 618536949 619433701
3710 619433701 620654285 622875094 625250697 627081633 628384769 629505038 630748391 632192791 633762479
3728.4 633762479 634986579 635599613 636194646 637676001 639779389 641451776 641878009 641709566 642794788
3746.7F42794788J257717N82994J426458K090931J552105J080215J285076J351118
3763.1F53421402J028538Q77738Q44657J068175J370430J176596P84158O31869Q38042
3781.4F62041605R19103R07123J062989J015127Q01206N68747L37661M19080L18169
3799.8F68390810K35141J047790J161933Q88765J218199J127363L66151j22964K75492
3818.1F74588680L10481N94914J333535J103878P22467O01948M82380M52519Q2433
3836.5F80273235j84119N47886J222432J295089J076162O07372k54095j134038J25051
3854.8F83574975J826047J595259P32601N5313J11520M52876J82271K45095Q07464
3873.2F89583421R86635Q35538K48254J11222N51522N08487N89669N33819J59085M45127
$$ plain form
3746.7 642794788 644052505 644635499 646061957 648152888 649704993 650785208 652070284 653421402
3763.1 653421402 654449940 655327678 656172335 657240510 658610940 659787536 660571694 661203563 662041605
3781.4 662041605 662960708 663867831 664930820 665945947 666747153 667315900 667653561 668072641 668390810
3799.8 668390810 668625951 669673741 670835674 671724439 672942638 674070001 674436152 674313188 674588680
3818.1 674588680 674899161 675494075 676827610 677931488 678653955 679255903 679738283 680190802 680273235
3836.5 680273235 680089116 680637002 681859434 683154523 684230685 684838057 684583962 683449924 683574975
3854.8 683574975 685401022 686996281 687728882 687784195 687895715 688348591 688530862 688775957 689583421
3873.2 689583421 690570056 691405594 691653848 691765070 692316592 692825079 693414748 693948567 694107652 694552779
3893.6F94552779O95706J86145k97964j77443K37346Q09908J099288Q29757N05149
3912F98440671K50220r7573r2387L03507M02987K38180K77579L50714K01464K47895
3932.3G00523257N12839M54247K00033P0929J17660L20375L19719J54674K76923M44651
3952.7G03395307L81053K87830K22862J32561J37985K33590K56002J98960J57953J64509
3973.1G05568612K12490K67923K52426K36034K28405J39058R2983J88947K61605J82271
3993.5G07630754J26898J97232
3997.6G07954884
$$ plain form
3893.6 694552779 695248485 695434630 695136666 694959223 695196569 696006477 697105765 697935522 698440671
3912 698440671 698690891 698593318 698500931 698804438 699207425 699445605 699723184 700073898 700275362 700523257
3932.3 700523257 701036096 701490343 701690376 701761305 701878965 702199340 702519059 702673733 702950656 703395307
3952.7 703395307 703776360 704064190 704287052 704419613 704557598 704791188 705047190 705246150 705404103 705568612
3973.1 705568612 705781102 706049025 706301451 706537485 706765890 706904948 706997931 707186878 707448483 707630754
3993.5 707630754 707757652 707954884
3997.6 707954884
##END=$$ End of the data block
