##TITLE=$$ Begin of the data block
##JCAMP-DX=5.00 $$ ACD/SpecManager v 10.08
##SPECTROMETER/DATA SYSTEM=Alpha
##DATE=29 Dec 2014 15:06:02
##DATA TYPE=INFRARED SPECTRUM
##DATA CLASS=XYDATA
##ORIGIN=
##OWNER=
##NPOINTS=1765
##FIRSTX=399.76428223
##LASTX=3997.64306641
##MAXX=3997.64306641
##MINX=399.76428223
##MAXY=0.83929443
##MINY=0.27593702
##XFACTOR=1.0000000000
##YFACTOR=1.000000000000000e-9
##FIRSTY=0.56219244
##DELTAX=2.03961372
##XUNITS=1/CM
##YUNITS=ARBITRARY UNITS
##XYDATA=(X++(Y..Y))
399.8E62192440n283177l459513q11994Q15451O71566K05099P58290J292348J062513
$$ 562192440 556909263 553449750 552637756 553453207 554124773 554329872 555088162 556380510 557443023
418.1E57443023R3519j853823l174544k338111j086593j775026l508151m091501k343952
$$ 557443023 557536542 555682719 552508175 550170064 549083471 547308445 543800294 539708793 537364841
436.5E37364841J009941L545165M056096L420830L306567M079640M154980K432585
$$ 537364841 538374782 541919947 545976043 549396873 552703440 556783080 560938060 563370645
452.8E63370645k44141k155065j852393l38257m93645k584100m513025m430354k886534
$$ 563370645 563126504 560971439 559119046 558780789 558287144 555703044 551190019 546759665 543873131
471.2E43873131j550495j635671k826869l190399j664817M96745J333714J79708j474858
$$ 543873131 542322636 540686965 537860096 534669697 533004880 533501625 534835339 535015047 533540189
489.5E33540189j701951n43773O8963r51827k842128l874064k889871j428306j627744
$$ 533540189 531838238 531294465 531363428 530411601 527569473 523695409 520805538 519377232 517749488
507.9E17749488l346622m971206n079090l971041l136992l311932l826082l408849
$$ 517749488 514402866 509431660 504352570 500381529 497244537 493932605 490106523 486697674
524.2D86697674j432151R44764J722216J037896P61002K483845N523235P172644N831182
$$ 486697674 485265523 486210287 487932503 488970399 489731401 492215246 497738481 504911125 510742307
542.5E10742307K755880N61476K47121M16219n26071k554714m221201m442394l833234
$$ 510742307 513498187 514059663 514306784 514723003 514196932 511642218 507421017 502978623 499145389
560.9D99145389m013539n612671p549793p977843o074995k822280K48641K159238L358692
$$ 499145389 495131850 489519179 481969386 473991543 467916548 465094268 465342909 467502147 470860839
579.3D70860839N172700P465601Q565902P416815M656553K279341J502037J694858
$$ 470860839 476033539 483499140 492065042 499481857 504138410 506417751 507919788 509614646
595.6E09614646J445234N5075j459658j466394L5465J498163J727521Q87931M42743
$$ 509614646 511059880 511114955 509655297 508188903 508224368 509722531 511450052 512337983 512780726
613.9E12780726J449645L370523M686654M335343L063083K581120L421843M190027
$$ 512780726 514230371 517600894 522287548 526622891 529685974 532267094 535688937 539878964
630.2E39878964L588617J896024N25296O54936J893878K664744J959503M78685r9838
$$ 539878964 543467581 545363605 545888901 546543837 548437715 551102459 553061962 553540647 553440809
648.6E53440809R04739K288878K439976J112580k24411o2466J366556K382695K218426
$$ 553440809 554345548 556634426 559074402 560186982 559962571 559900105 561266661 563649356 565867782
667E65867782Q22305M3691J006186K470791K977908J864314L90410K13921J367807
$$ 565867782 566690087 566733778 567739964 570210755 573188663 575052977 575443387 575657308 577025115
685.3E77025115K260268J503587n81682k199828k121568j230121j266777k697349m119277
$$ 577025115 579285383 580788970 580207288 578007460 575885892 574655771 573388994 570691645 566572368
703.7E66572368l703534j334548J286506K565503K442360K346397L614068N899131
$$ 566572368 562868834 561534286 562820792 565386295 567828655 570175052 573789120 579688251
720E79688251P302284O656230M958510L942430M517138N609870N178690K995670Q67009
$$ 579688251 586990535 593646765 598605275 602547705 607064843 612674713 617853403 620849073 621716082
738.3F21716082L52562J058101J126826p36415l625989n346120m946351l706217l427803
$$ 621716082 622068644 623126745 624253571 623517156 619891167 614545047 609598696 605892479 602464676
756.7F02464676m399836n157650m058778j174331J875282L764152M489839N139292
$$ 602464676 598064840 592907190 588848412 587674081 589549363 593313515 597803354 602942646
773F02942646O893873R312510J0317266Q800090O130814M550100M827082N742371N428135
$$ 602942646 609836519 619149029 629466295 638266385 644397199 648947299 653774381 659516752 664944887
791.4F64944887L598690K042353K512217M560888N869806M771232K128482M21584R47415
$$ 664944887 668543577 670585930 673098147 677659035 683528841 688300073 690428555 690850139 691797554
809.7F91797554K423406K504826O99460j245200j525104k62380N52714p13110l493011
$$ 691797554 694220960 696725786 697425246 696180046 694654942 694392562 694945276 694232166 690739155
828.1F90739155n553246n460560m170716l751337m872561o199479o040871m303515
$$ 690739155 685185909 679725349 675554633 671803296 666930735 660731256 654690385 650386870
844.4F50386870k683699k766669m347861n814493n850911m750013l527403j925468
$$ 650386870 647703171 644936502 640588641 634774148 628923237 624173224 620645821 618720353
860.7F18720353J023471N178452R456574J2669981J3578892J1511385P791043M885435
$$ 618720353 619743824 624922276 634378850 647048831 660627723 672139108 679930151 684815586
877F84815586L351211J513004j741886n364477p330001o892979n375922m726588n514086
$$ 684815586 688166797 689679801 687937915 682573438 675243437 668350458 662974536 658247948 652733862
895.4F52733862o495297o291031n118788m516542n629420p957101r799123j0136246
$$ 652733862 646238565 639947534 634828746 630312204 624682784 616725683 606926560 596790314
911.7E96790314r639561r448529r654402r237707p249773m051506j169384K04623L11553
$$ 596790314 587150753 577702224 568047822 558810115 551560342 547508836 546339452 546544075 546855628
930.1E46855628M60566J641392L534138M993678N220174M290045K554774L0756l346801
$$ 546855628 547316194 548957586 552491724 557485402 562705576 566995621 569550395 569581151 566234350
948.4E66234350p422685j1536658j4554978j5810907j5893936j6064107j6955257j8183201
$$ 566234350 558811665 547275007 532720029 516909122 501015186 484951079 467995822 449812621
964.7D49812621j9017100j9114107j8804670j8615663j8486827j7866612j6350746
$$ 449812621 430795521 411681414 392876744 374261081 355774254 337907642 321556896
979C21556896j3927609j1014729q232445n906463l933429k118767m86433P50929J373231
$$ 321556896 307629287 296614558 288382113 282475650 278542221 276423454 275937021 276687950 278061181
997.4B78061181J450420J300096J201540J104087P42376J26541m13269m42326K20984
$$ 278061181 279511601 280811697 282013237 283117324 283859700 283986241 283572972 283130646 283351630
1015.7B83351630J249999K078950K547890K907395L404499L993451M339934M179149
$$ 283351630 284601629 286680579 289228469 292135864 295540363 299533814 303873748 308052897
1032C08052897L408462K281070J346946R18716Q25644P44462O48260R72360K153188
$$ 308052897 311461359 313742429 315089375 316008091 316833735 317578197 318226457 319198817 321352005
1050.4C21352005L992617N759061O863117P540077Q500546R860665J0530203Q559138
$$ 321352005 325344622 331103683 337966800 345506877 354007423 363868088 374398291 382957429
1066.7C82957429K779692m957437j0368318j0775804p513076l702611q99136J202971
$$ 382957429 385737121 380779684 370411366 359635562 352122486 348419875 347520739 348723710
1083C48723710L112465M676640N599349N958915N929202N623102N018920L910601K282858
$$ 348723710 351836175 356512815 362112164 368071079 374000281 379623383 384642303 388552904 390835762
1101.4C90835762P31438K41816J273960L085196M402250M566282L881187L074169K599984
$$ 390835762 391567200 391809016 393082976 396168172 400570422 405136704 409017891 412092060 414692044
1119.8D14692044K402574K184123K066135K554447L744304M810840M503935K240390
$$ 414692044 417094618 419278741 421344876 423899323 427643627 432454467 436958402 439198792
1136.1D39198792j324534m719705o827771p611782p704615p478118o820888n518108
$$ 439198792 437874258 433154553 426326782 418715000 411010385 403532267 396711379 391193271
1152.4C91193271l646672j682431j52915Q99821K056211L878534O312728Q692265J0381192
$$ 391193271 387546599 385864168 385711253 386611074 388667285 392545819 398858547 407550812 417932004
1170.7D17932004J1318356J1944621J2704492J3503462J3766825J3091445J1761606
$$ 417932004 429250360 441194981 453899473 467402935 481169760 494261205 506022811
1185E06022811J0449529R460866Q356810O541550M227340K393544J769662K123534
$$ 506022811 516472340 525933206 534290016 540831566 545058906 547452450 549222112 551345646
1201.3E51345646K574921K549648K354086K744913L993690N402803N872190N047441
$$ 551345646 553920567 556470215 558824301 561569214 565562904 570965707 576837897 581885338
1217.7E81885338L595710K407252J752556J133382K8908j322269k169848k092540j430273
$$ 581885338 585481048 587888300 589640856 590774238 590803146 589480877 587311029 585218489 583788216
1236E83788216r65238j084089j296520q20160M76062J841188K418756K087653J477361
$$ 583788216 582822978 581738889 580442369 579622209 580098271 581939459 584358215 586445868 587923229
1254.4E87923229J249552J451551J610339J315355Q52347R35435J724303K577364K646804
$$ 587923229 589172781 590624332 592234671 593550026 594402373 595337808 597062111 599639475 602286279
1272.7F02286279J646877K35080o01470n48482j64390k10106q24750j411914j437843
$$ 602286279 603933156 604168236 603566766 603018284 602853894 602643788 601819038 600407124 598969281
1291.1E98969281j107812j065374j629412k434969k746284k271414j606881j450598
$$ 598969281 597861469 596796095 595166683 592731714 589985430 587714016 586107135 584656537
1307.4E84656537j745522j974404j733899j086951o16908q50677j829028l105462m124701
$$ 584656537 582911015 580936611 579202712 578115761 577498853 576648176 574819148 571713686 567588985
1325.8E67588985m653990m934967n189717n154788m454374l033162j197993J42216
$$ 567588985 562934995 558000028 552810311 547655523 543201149 540167987 538969994 539112210
1342.1E39112210L68417Q7678L8385K72632L64304o3300q16584j353383j378000q72672
$$ 539112210 539480627 539568305 539606690 539879322 540243626 540180326 539363742 538010359 536632359 535759687
1362.5E35759687j83343j51098n44191l99351L53337J293778J639247J105487N74947
$$ 535759687 535576344 535425246 534881055 534481704 534835041 536128819 537768066 538873553 539448500
1380.8E39448500R67085K371550M155695M727066L409207J732289O65367L19064l3498
$$ 539448500 540415585 542787135 546942830 551669896 555079103 556811392 557476759 557795823 557762325
1399.2E57762325p05779j555502k112150j822770j505971j693845j989662k100349
$$ 557762325 557056546 555501044 553388894 551566124 550060153 548366308 546376646 544276297
1415.5E44276297j972139j082241J98245N62608M68910M98175Q89838J602948J827657
$$ 544276297 542304158 541221917 541420162 541982770 542451680 542949855 543839693 545442641 547270298
1433.9E47270298J621425J672030J807868J882732J728058J033723p5638r36210j302242
$$ 547270298 548891723 550563753 552371621 554254353 555982411 557016134 556940496 556004286 554702044
1452.2E54702044j587868k469897k362311l36349O42001J639307L479600M652738N560100
$$ 554702044 553114176 550644279 548281968 547945619 548587620 550226927 553706527 558359265 563919365
1470.6E63919365P767320R225369Q898198Q349776P733763O930411N780518N215883
$$ 563919365 571686685 580912054 589810252 598160028 605893791 612824202 618604720 623820603
1486.9F23820603N773961O416560N284071L910482L723740M175842M103184L157735
$$ 623820603 629594564 636011124 641295195 645205677 648929417 653105259 657208443 660366178
1503.2F60366178K048254K248346L374219L380955K897381K189219J751721J516760
$$ 660366178 662414432 664662778 668036997 671417952 674315333 676504552 678256273 679773033
1519.5F79773033J797735K524436K616823K334535J684069J046002J223326J650333
$$ 679773033 681570768 684095204 686712027 689046562 690730631 691776633 692999959 694650292
1535.8F94650292R95815O8009M62771J381695J665413J285315N99980l3915n95808
$$ 694650292 695646107 695714116 696176887 697558582 699223995 700509310 701109290 701075375 700479567
1554.2G00479567j060069j392543j22607O57618l89576j250088j572668j337052q48233
$$ 700479567 699419498 698026955 697904348 698561966 698172390 696922302 695349634 694012582 693164349
1572.6F93164349j625181k745807j875520j098752j396954j828730k289355k586841
$$ 693164349 691539168 688793361 686917841 685819089 684422135 682593405 680304050 677717209
1588.9F77717209k502740k203464k125084k373696k732158k942621k809227k613067
$$ 677717209 675214469 673011005 670885921 668512225 665780067 662837446 660028219 657415152
1605.2F57415152k811551l330231l547311l456473l854752m092038k868533k778232
$$ 657415152 654603601 651273370 647726059 644269586 640414834 636322796 633454263 630676031
1621.5F30676031l642201l207743k511442k200663j870871k177834k491951p08700
$$ 630676031 627033830 623826087 621314645 619113982 617243111 615065277 612573326 611864626
1637.8F11864626O95527O88672K91705J85311J291335K006173K045572L391623L808677
$$ 611864626 612560153 613248825 613540530 613725841 615017176 617023349 619068921 622460544 626269221
1656.2F26269221L226877L184497L795206M289210L637016L287375M052758M405558
$$ 626269221 629496098 632680595 636475801 640765011 644402027 647689402 651742160 656147718
1672.5F56147718M698873N064428M366875L537654L626764N458355N739629M598380
$$ 656147718 660846591 665911019 670277894 673815548 677442312 682900667 688640296 693238676
1688.8F93238676M136025L334046K893865L019393L077447L392458K746343J994789
$$ 693238676 697374701 700708747 703602612 706622005 709699452 713091910 715838253 717833042
1705.1G17833042K172828K320051J939893J254678P46905J380742K622724K639651
$$ 717833042 720005870 722325921 724265814 725520492 726267397 727648139 730270863 732910514
1721.5G32910514K139449J784444J432240J249790J270473J761913K373398J923382
$$ 732910514 735049963 736834407 738266647 739516437 740786910 742548823 744922221 746845603
1737.8G46845603J619339J984715K309561K203107J943052K192557K850771K842784
$$ 746845603 748464942 750449657 752759218 754962325 756905377 759097934 761948705 764791489
1754.1G64791489K579152K408743J956880J785994J922905J774490J406014R64701
$$ 764791489 767370641 769779384 771736264 773522258 775445163 777219653 778625667 779590368
1770.4G79590368R59754J512707J698613J491010J238525R94384Q06213Q41379Q36968
$$ 779590368 780550122 782062829 783761442 785252452 786490977 787485361 788291574 789132953 789969921
1788.8G89969921O84023Q46148R83119P56144O68645J024604J333356J040458N50807
$$ 789969921 790653944 791500092 792483211 793239355 793908000 794932604 796265960 797306418 797857225
1807.1G97857225M08530P55251J103282R35316N39958L89755M06861M65572O15895
$$ 797857225 798265755 799021006 800124288 801059604 801599562 801989317 802396178 802861750 803477645
1825.5H03477645N06997K67506N25653Q17239P29382N55098K53797j83344k05457N04374
$$ 803477645 803984642 804252148 804777801 805595040 806324422 806879520 807133317 806949973 806744516 807248890
1845.9H07248890Q93534O18219K24173O3539J86681L52621L75689J86026j30296l68536
$$ 807248890 808142424 808760643 808984816 809048355 809235036 809587657 809963346 810149372 810019076 809650540
1866.3H09650540j20580O03020Q28088M73320J71304J85847L63469M41313L30329J26541
$$ 809650540 809529960 810132980 810961068 811434388 811605692 811791539 812155008 812596321 812926650 813053191
1886.7H13053191M1306K96175M94540L84808L13580K43902J21772J14381J77384J33216
$$ 813053191 813094497 813390672 813885212 814270020 814583600 814827502 814949274 815063655 815241039 815374255
1907.1H15374255N1439Q7023J08421J6152R716J84894J81794R3460K29180L24070K45810
$$ 815374255 815425694 815512717 815621138 815637290 815647006 815831900 816013694 816107154 816336334 816660404 816906214
1929.5H16906214J48475O5327Q285M8399O7353L0756J08063J65045J39058K18332L19123
$$ 816906214 817054689 817120016 817128301 817176700 817244053 817274809 817382872 817547917 817686975 817905307 818224430
1951.9H18224430K75791J33037L4333P5101K19286K85089J73688Q5831J04069J48058
$$ 818224430 818500221 818633258 818667591 818742692 818961978 819247067 819420755 819506586 819610655 819758713
1972.3H19758713K35498K64287J30832l1411j9610J21236J64032L5822j10686q4460
$$ 819758713 819994211 820258498 820389330 820357919 820338309 820459545 820623577 820659399 820548713 820464253
1992.7H20464253R1196J98841J85370O2406j30772k21551j51575k4497m0233k41697
$$ 820464253 820555449 820754290 820939660 821002066 820871294 820649743 820498168 820473671 820433438 820191741
2013.1H20191741m36366m51028l31283l15725n12660o24061l32653k9683m2916j36196
$$ 820191741 819755375 819304347 818973064 818657339 818144679 817520618 817187965 817158282 817115366 816979170
2033.5H16979170k56360m19259m66823l23534j21534p4685k12073l14832k32398m0710
$$ 816979170 816722810 816303551 815836728 815513194 815391660 815316975 815104902 814790070 814557672 814516962
2053.9H14516962R6321P7665l5227r2745M18J68800K38299J20342n4419o4135P6175
$$ 814516962 814613283 814690948 814655721 814562976 814563394 814732194 814970493 815090835 815036416 814972281 815048456
2076.4H15048456J89424J79648N1916n4360j192J61529K71618K03073L8684l577J33217
$$ 815048456 815237880 815417528 815469444 815415084 815413892 815575421 815847039 816050112 816088796 816085219 816218436
2098.8H16218436K88307L13223K01940O8188M2856J29163J98722J67429P4864k1458
$$ 816218436 816506743 816819966 817021906 817090094 817132950 817262113 817460835 817628264 817703128 817681670
2119.2H17681670k8133Q0824J67906J23262N544m8399L338J06036J56641Q6427l8803
$$ 817681670 817653537 817734361 817902267 818025529 818031073 817982674 817986012 818092048 818248689 818335116 818296313
2141.6H18296313q3863R894J75655K27034R6559p867N1260K05874L22342L09885K16186
$$ 818296313 818212450 818222344 818397999 818625033 818721592 818713725 818764985 818970859 819293201 819603086 819819272
2164.1H19819272J51872K21968M46260O00576N15402L35931K72751M14968N76854N31554
$$ 819819272 819971144 820193112 820639372 821239948 821755350 822091281 822364032 822779000 823355854 823887408
2184.5H23887408L62992K60234L08156M38154M98295M18067K74181K31564L37660M59194
$$ 823887408 824250400 824510634 824818790 825256944 825755239 826173306 826447487 826679051 827016711 827475905
2204.8H27475905M48049L06546K06650K56061L99888M92513M22537K74301J99556K71976
$$ 827475905 827923954 828230500 828437150 828693211 829093099 829585612 830008149 830282450 830482006 830753982
2225.2H30753982L88086L72112K29001J14977J59621K94507L35455K41697J26421R8705
$$ 830753982 831142068 831514180 831743181 831858158 832017779 832312286 832647741 832889438 833015859 833114564
2245.6H33114564J55569K12192K31564J93536J08958R2566J68383K18868J86861J57773
$$ 833114564 833270133 833482325 833713889 833907425 834016383 834108949 834277332 834496200 834683061 834840834
2266H34840834J91629K39730K41816K16901K02239J46568P0214R0599J91748K46406
$$ 834840834 835032463 835272193 835514009 835730910 835933149 836079717 836149931 836240530 836432278 836678684
2286.4H36678684K00093J07646P7009J18077J60217J76251J33395O9797Q3327J69039
$$ 836678684 836878777 836986423 837063432 837181509 837341726 837517977 837651372 837721169 837804496 837973535
2306.8H37973535K06769J58667Q7321L7193O1810J54078K52247K53260J09554o9976
$$ 837973535 838180304 838338971 838426292 838463485 838525295 838679373 838931620 839184880 839294434 839224458
2327.2H39224458j49608q4102l576k6405r8705j33336j28150j35541k98619m10676
$$ 839224458 839074850 838990748 838987172 838960767 838862062 838728726 838600576 838465035 838166416 837755740
2347.6H37755740k12550Q7440K79545L17395J82033j23859l33547k70486k01762l29375
$$ 837755740 837543190 837630630 837910175 838227570 838409603 838285744 837952197 837681711 837479949 837150574
2368H37150574n32151o56664o23345m35412k47956k31087l22759l56257k74718j37925
$$ 837150574 836618423 835961759 835338414 834903002 834655046 834423959 834101200 833744943 833470225 833332300
2388.4H33332300q4996j72913l04401l28958k21968j22964j44720k89202m14312l90589
$$ 833332300 833247304 833074391 832769990 832441032 832219064 832096100 831951380 831662178 831247866 830857277
2408.8H30857277k85149k45154l41236m90010n31316m29928l35515l84748n26964o05047
$$ 830857277 830572128 830326974 829985738 829495728 828964412 828534484 828198969 827814221 827287257 826682210
2429.2H26682210n57780m49181m21762n32627o54400o68704n69761m68731m64678n40316
$$ 826682210 826124430 825675249 825253487 824720860 824066460 823397756 822827995 822359264 821894586 821354270
2449.6H21354270o18160n94795m78804m40597n17667n65826n52774n05209m30763m00185
$$ 821354270 820736110 820141315 819662511 819221914 818704247 818138421 817585647 817080438 816649675 816249490
2470H16249490m52876n19753n24223m80652m39107m32491m55857m79519m60327l86417
$$ 816249490 815796614 815276861 814752638 814271986 813832879 813400388 812944531 812465012 812004685 811618268
2490.4H11618268l32951l19541k84135k60651k92599l02136k82645l19183l72052l52979
$$ 811618268 811285317 810965776 810681641 810420990 810128391 809826255 809543610 809224427 808852375 808499396
2510.8H08499396k94089k67208k93493l61085m25697m40538m26471m19080m46916n28156
$$ 808499396 808205307 807938099 807644606 807283521 806857824 806417286 805990815 805571735 805124819 804596663
2531.2H04596663n97299n90205n50866n41210n61953o04510o31928o01590n76973n87702
$$ 804596663 803999364 803409159 802858293 802317083 801755130 801150620 800518692 799917102 799340129 798752427
2551.6G98752427n99801o10173o03259n84006n67079n52296n54860n50687n46634n72324
$$ 798752427 798152626 797542453 796939194 796355188 795788109 795235813 794680953 794130266 793583632 793011308
2572G93011308o00100o27339o32047n67794m81606m53591m88758n16176m82202m16338
$$ 793011308 792411208 791783869 791151822 790584028 790102422 789648831 789160073 788643897 788161695 787745357
2592.4G87745357l83199m06325m45485m59373m35650l86596m02093n06520n97238o73473
$$ 787745357 787362158 786955833 786510348 786050975 785615325 785228729 784826636 784320116 783722878 783049405
2612.8G83049405p51436p58231p41243p93815q85844r48548r61244r68874j006603
$$ 783049405 782297969 781539738 780798495 780004680 779118836 778170288 777209044 776240170 775233567
2631.1G75233567j040638j064479j076162j060843j062155j074612j078427j107693
$$ 775233567 774192929 773128450 772052288 770991445 769929290 768854678 767776251 766668558
2647.4G66668558j123309j073718j028955j030386j045167j053154j010597r46641
$$ 766668558 765545249 764471531 763442576 762412190 761367023 760313869 759303272 758356631
2663.7G58356631r49800r85801r81868r35793q70704q30651q31127q47041q59321q33213
$$ 758356631 757406831 756421030 755439162 754503369 753632665 752802014 751970887 751123846 750264525 749431312
2684.1G49431312q04543q26717q65638r06348r50694r61721r30667r21428r80080j079023
$$ 749431312 748626769 747800052 746934414 746028066 745077372 744115651 743184984 742263556 741283476 740204453
2704.5G40204453j127243j070201j002729r99033j028300j009524r53912r34243r07660
$$ 740204453 739077210 738007009 737004280 736005247 734976947 733967423 733013511 732079268 731171608
2722.9G31171608q59976q28028q12113p91848p70092p53700p26939p05599o95646o83308
$$ 731171608 730311632 729483604 728671491 727879643 727109551 726355851 725628912 724923313 724227667 723544359
2743.3G23544359o70433o80327o91891o78480o62386o21617n61893n44488n55754n46813
$$ 723544359 722873926 722193599 721501708 720823228 720160842 719539225 718977332 718432844 717877090 717330277
2763.7G17330277n28872n39780n86927o43372o79314p38800q38160q99077r09626r25184
$$ 717330277 716801405 716261625 715674698 715031326 714352012 713613212 712775052 711875975 710966349 710041165
2784.1G10041165r80913j059234j129032j199782j274347j326740j372575j461923
$$ 710041165 709060252 708001018 706871986 705672204 704397857 703071117 701698542 700236619
2800.4G00236619j553357j619816j684129j737595j807749j870811j887381j926065
$$ 700236619 698683262 697063446 695379317 693641722 691833973 689963162 688075781 686149716
2816.7F86149716k027750k138555k217352k253354k298176k396345k484560k550364
$$ 686149716 684121966 681983411 679766059 677512705 675214529 672818184 670333624 667783260
2833F67783260k635538k719999k860128l099621l315687l462374l591299l670335l575444
$$ 667783260 665147722 662427723 659567595 656467974 653152287 649689913 646098614 642428279 638852835
2851.4F38852835l265620k853512k527595k512991k799869l197789l644705m134417
$$ 638852835 635587215 632733703 630206108 627693117 624893248 621695459 618050754 613916337
2867.7F13916337m565417m826129m984855n095661m990935m569233l943980l259360
$$ 613916337 609350920 604524791 599539936 594444275 589453340 584884107 580940127 577680767
2884E77680767k586127j939475j357138r06826o14225n15819o17266p73489r14872
$$ 577680767 575094640 573155165 571798027 570891201 570276976 569761157 569143891 568370402 567455530
2902.4E67455530j114547j361609j655459k041638k503693l012121l480315l748894
$$ 567455530 566340983 564979374 563323915 561282277 558778584 555766463 552286148 548537254
2918.7E48537254l726959l421664k884865k175331j340926l97742O85931J872897L026605
$$ 548537254 544810295 541388631 538503766 536328435 534987509 534589767 535275698 537148595 540175200
2937E40175200L980636M655302N094886N328297N381405N433858N566478N583167N481541
$$ 540175200 544155836 548811138 553906024 559234321 564615726 570049584 575616062 581199229 586680770
2955.4E86680770N416751N321622N068242M695893M339993M041373L791750L603816
$$ 586680770 592097521 597419143 602487385 607183278 611523271 615564644 619356394 622960210
2971.7F22960210L471732L385067L330529L211438K923727K592624K355694K154172
$$ 622960210 626431942 629817009 633147538 636358976 639282703 641875327 644231021 646385193
2988F46385193J968205J699030J309216J054228Q60631N49078K58207j7166l18467
$$ 646385193 648353398 650052428 651361644 652415872 653276503 653825581 654083788 654066622 653748155
3006.4F53748155n28992o49869q51631j178622j498104j729369j831650j814545j872718
$$ 653748155 653219163 652569294 651717663 650539041 649040937 647311568 645479918 643665373 641792655
3024.7F41792655k075970k204895k205014k180636k254427k414048k430260k373218
$$ 641792655 639716685 637511790 635306776 633126140 630871713 628457665 626027405 623654187
3041.1F23654187k459944k593219k662182k669453k646208k668381k708077k751530
$$ 623654187 621194243 618601024 615938842 613269389 610623181 607954800 605246723 602495193
3057.4F02495193k817928k795697k658248k555191k614200k747059k782702k696753
$$ 602495193 599677265 596881568 594223320 591668129 589053929 586306870 583524168 580827415
3073.7E80827415k571821k522230k606154k730310k780855k793431k755046k695679
$$ 580827415 578255594 575733364 573127210 570396900 567616045 564822614 562067568 559371889
3090E59371889k747536k792478k688050k523661k524137k701938k729893k557278k479612
$$ 559371889 556624353 553831875 551143825 548620164 546096027 543394089 540664196 538106918 535627306
3108.4E35627306k579690k547383k335310k315163k496958k681673k792954k729595
$$ 535627306 533047616 530500233 528164923 525849760 523352802 520671129 517878175 515148580
3124.7E15148580k519488k356529k389133k493263k404809k190411k163648k371937
$$ 515148580 512629092 510272563 507883430 505390167 502985358 500794947 498631299 496259362
3141D96259362k505839k415508k270431k107322j975894k115220k388954k401084k189636
$$ 496259362 493753523 491338015 489067584 486960262 484984368 482869148 480480194 478079110 475889474
3159.4D75889474k038061k053887k091378k030313k006471k034664j998514j929105
$$ 475889474 473851413 471797526 469706148 467675835 465669364 463634700 461636186 459707081
3175.7D59707081j904338j890987j819641j749217j743585j739949j723618j745730
$$ 459707081 457802743 455911756 454092115 452342898 450599313 448859364 447135746 445390016
3192D45390016j783431j783043j714557j622498j590789j570940j505881j490921j499832
$$ 445390016 443606585 441823542 440108985 438486487 436895698 435324758 433818877 432327956 430828124
3210.3D30828124j453221j445531j447201j398206j398414j419753j385361j336128
$$ 430828124 429374903 427929372 426482171 425083965 423685551 422265798 420880437 419544309
3226.7D19544309j246154j077264j015753j232028j414835j309783j143992j060217
$$ 419544309 418298155 417220891 416205138 414973110 413558275 412248492 411104500 410044283
3243D10044283j019061j045734j121819j102775r66281r04411r97901j024127r24676
$$ 410044283 409025222 407979488 406857669 405754894 404788613 403884202 402886301 401862174 400937498
3261.3D00937498q72553q39531p34538o36756p46251r21011r35167r22501r02831q34734
$$ 400937498 400064945 399225414 398490876 397854120 397107869 396186858 395251691 394329190 393426359 392591625
3281.7C92591625p78585p28667o87093o33060o14107p15613q53301r46760q98540o95020
$$ 392591625 391813040 391084373 390397280 389764220 389150113 388434500 387581199 386634439 385735899 385040879
3302.1C85040879n79804p11292r74894j152604j157731j083255j022637r66817r26882
$$ 385040879 384461075 383749783 382774889 381622285 380464554 379381299 378358662 377391845 376464963
3320.5C76464963q76725q70108j062781j224607j146913j039415r49175q51213r35495
$$ 376464963 375588238 374718130 373655349 372430742 371283829 370244414 369295239 368444026 367508531
3338.8C67508531j120955j177967j198232j144230r41932r73791j292885j394748j167208
$$ 367508531 366387576 365209609 364011377 362867147 361925215 360951424 359658539 358263791 357096583
3357.2C57096583r94802j084626j130163q75831p20680j020193j407772j374960j066297
$$ 357096583 356101781 355017155 353886992 353011161 352290481 351270288 349862516 348487556 347421259
3375.5C47421259r22770r51111r92000r46224p88569n29915k52039l28332p50333q65161
$$ 347421259 346498489 345547378 344555378 343609154 342820585 342290670 342038631 341710299 340959966 340094805
3395.9C40094805m69834j94341n13255r12190p71284m29213k92242l01092m49658n48512
$$ 340094805 339624971 339430630 338917375 338005185 337233901 336804688 336512446 336211354 335761696 335213184
3416.3C35213184m02182k86013k44021l6389J90169K34365J25170J46359L17156J86593
$$ 335213184 334811002 334524989 334280968 334244579 334434748 334669113 334794283 334940642 335257798 335444391
3436.7C35444391j49518j42128J58668L65883L96311L73543M32848N24611N81264P21425
$$ 335444391 335294873 335152745 335311413 335677296 336073607 336447150 336879998 337404609 337985873 338707298
3457.1C38707298Q75831P61717P07090R98378J116008P63416L49670L96193P16149
$$ 338707298 339583129 340344846 341051936 342050314 343166322 343929738 344279408 344675601 345391750
3475.5C45391750R53406R71228P52002P48396R74655R35018Q60662J033008J121282
$$ 345391750 346345156 347316384 348068386 348816782 349791437 350726455 351587117 352620125 353741407
3493.8C53741407J074404J040220J059324J001954P90894P89493J003266J136899J273214
$$ 353741407 354815811 355856031 356915355 357917309 358708203 359497696 360500962 361637861 362911075
3512.2C62911075J261026J038522J005917J212120J364053J180648R18866J002699
$$ 362911075 364172101 365210623 366216540 367428660 368792713 369973361 370892227 371894926
3528.5C71894926J285583J460969J513243J424104J303583J465738J638144J427233
$$ 371894926 373180509 374641478 376154721 377578825 378882408 380348146 381986290 383413523
3544.8C83413523J138032J334160J635224J693875J808285J929313J979590K030730
$$ 383413523 384551555 385885715 387520939 389214814 391023099 392952412 394932002 396962732
3561.1C96962732J910389J639723J926124K737016K952129K717435K649248K726078
$$ 396962732 398873121 400512844 402438968 405175984 408128113 410845548 413494796 416220874
3577.5D16220874K896845L116906L156602K881140K654641L136009L465683L298819
$$ 416220874 419117719 422234625 425391227 428272367 430927008 434063017 437528700 440827519
3593.8D40827519L419161L765642L768414L711850L725350L413230L201961L481806
$$ 440827519 444246680 448012322 451780736 455492586 459217936 462631166 465833127 469314933
3610.1D69314933L726363L852934L859281L754318M121512M346728L911943L226250
$$ 469314933 473041296 476894230 480753511 484507829 488629341 492976069 496888012 500114262
3626.4E00114262K937019L879845M487336M246533L921270L734946L732205L707826
$$ 500114262 503051281 506931126 511418462 515664995 519586265 523321211 527053416 530761242
3642.7E30761242L346383K734185K823591M052758M460454L865719L686667L901004
$$ 530761242 534107625 536841810 539665401 543718159 548178613 552044332 555730999 559632003
3659E59632003L587187L147661L004670K635420K198517K699018K922237K375424K913653
$$ 559632003 563219190 566366851 569371521 572006941 574205458 576904476 579826713 582202137 585115790
3677.4E85115790L537000L310620K967596K594173K058566J728356K320707K862990
$$ 585115790 588652790 591963410 594931006 597525179 599583745 601312101 603632808 606495798
3693.7F06495798K619505K123057J760364J656711J943112J999735J413942Q01742
$$ 606495798 609115303 611238360 612998724 614655435 616598547 618598282 620012224 620813966
3710F20813966J250028K368868K391755J723648J290798J218438J295447J410246J504839
$$ 620813966 622063994 624432862 626824617 628548265 629839063 631057501 632352948 633763194 635268033
3728.4F35268033J203000O40392N76735J417816K070903J702071N79774l9279R59217
$$ 635268033 636471033 637111425 637688160 639105976 641176879 642878950 643458724 643419445 644378662
3746.7F44378662J156986O99758J513780K066195J522660J020789J253664J385153
$$ 644378662 645535648 646235406 647749186 649815381 651338041 652358830 653612494 654997647
3763.1F54997647J017034Q20517Q23141J103222J429975J193643P45832O04928Q56400
$$ 654997647 656014681 656835198 657658339 658761561 660191536 661385179 662131011 662735939 663592339
3781.4F63592339R36508Q77022J032711J062929Q85725N91517K75850L51071K95341
$$ 663592339 664528847 665405869 666438580 667501509 668387234 668978751 669254601 669605672 669901013
3799.8F69901013K22683J046300J191199R27270J207530J088381L63111q8811L26395
$$ 669901013 670123696 671169996 672361195 673288465 674495995 675584376 675947487 675858676 676185071
3818.1F76185071L42548N87881J332223J113177P10726N56290M70102N36978J82628
$$ 676185071 676527619 677115500 678447723 679560900 680271626 680827916 681298018 681834996 682017624
3836.5F82017624j48952N40555J181304J238466J020491N59270k40564j052499J72555
$$ 682017624 681868672 682409227 683590531 684828997 685849488 686408758 686168194 685115695 685288250
3854.8F85288250J785458J481056O14345M4286J97530M92036J76370K78712Q29637
$$ 685288250 687073708 688554764 689169109 689213395 689410925 689902961 690079331 690358043 691187680
3873.2F91187680R96530Q49962K25246R8526N83053N03421M95434M64201K33352N62966
$$ 691187680 692184210 693034172 693259418 693357944 693940997 694444418 694939852 695404053 695637405 696200371
3893.6F96200371P50124K23160k64764j57893K71917Q09550J063526Q46147N27084
$$ 696200371 696950495 697173655 696908891 696750998 697022915 697832465 698895991 699742138 700269222
3912G00269222K22087j32382j05679L45052M82439K83242K71976L23653J75714K11597
$$ 700269222 700491309 700358927 700253248 700598300 701080739 701363981 701635957 701959610 702135324 702346921
3932.3G02346921M88877M46618J28627k1398J05202L73781L93331K01106K91884M39405
$$ 702346921 702835798 703282416 703411043 703389645 703494847 703868628 704261959 704463065 704754949 705194354
3952.7G05194354L29793K20120J83224J05679J39833K88665L30150K44200J16229O8665
$$ 705194354 705524147 705744267 705927491 706033170 706173003 706461668 706791818 707036018 707152247 707220912
3973.1G07220912J62005K70963K65956K49624K64228J96457J20341J38700J94014J91390
$$ 707220912 707382917 707653880 707919836 708169460 708433688 708630145 708750486 708889186 709083200 709274590
3993.5G09274590J85430K37763
$$ 709274590 709460020 709697783
3997.6G09697783
$$ 709697783
##END=$$ End of the data block
