##TITLE=$$ Begin of the data block
##JCAMP-DX=5.00 $$ ACD/SpecManager v 10.08
##SPECTROMETER/DATA SYSTEM=Alpha
##DATE=29 Dec 2014 15:06:02
##DATA TYPE=INFRARED SPECTRUM
##DATA CLASS=XYDATA
##ORIGIN=
##OWNER=
##NPOINTS=1765
##FIRSTX=399.76428223
##LASTX=3997.64306641
##MAXX=3997.64306641
##MINX=399.76428223
##MAXY=0.83238328
##MINY=0.17831108
##XFACTOR=1.0000000000
##YFACTOR=1.000000000000000e-9
##FIRSTY=0.52301925
##DELTAX=2.03961372
##XUNITS=1/CM
##YUNITS=ARBITRARY UNITS
##XYDATA=(X++(Y..Y))
399.8E23019254n921662m497349l023386j246512N93782J791477K008736J313686k563
418.1E14035463j059949j239419k083480l372908l710568l423303l242702l027349
434.4D92875785k282232p05630J601636L992498N339116N408168M734397L364861J572788
452.8E15901387J56462m60029o06835r68515k031446l248751l974319m026174l762365
471.2D96979415l362566k740532k578348k614736j961619p31915L36855O50019N4419
489.5D84030992j008481j755208j917213j740575j632392k090007k921641l622890
505.8D67342585m081994m003018l752023l940195m662305n625606n706817m463315
522.1D31107312k838939j487881n88685j24485L96699J581103L757506O105513P093072
$$ plain form
399.8 523019254 517097592 512600243 509576857 508330345 508924127 510715604 512724340 514038026 514035463
418.1 514035463 512975514 511736095 509652615 506279707 502569139 499145836 495903134 492875785
434.4 492875785 490593553 489887923 491489559 495482057 500821173 506229341 510963738 514328599 515901387
452.8 515901387 516057849 515597820 514990985 514022470 511991024 508742273 504767954 500741780 496979415
471.2 496979415 493616849 490876317 488297969 485683233 483721614 482989699 483326554 483976573 484030992
489.5 484030992 483022511 481267303 479350090 477609515 475977123 473887116 470965475 467342585
505.8 467342585 463260591 459257573 455505550 451565355 446903050 441277444 435570627 431107312
522.1 431107312 428268373 426780492 426191807 426067322 426464021 428045124 431802630 437908143 445001215
540.5D45001215O182253M019797J783609K82139n57333j212299k052307l307492m652113
558.9D45487469n480855o010920o765425p798523q321643p390827n022734j881480
575.2C96815062J460313M534603O798833P937938Q023143P332325O056011M473030
591.5D43431258K794951J215280o7890p58290o98507k78801K15411O12438P39783Q41081
611.9D48046714J415789K453327L590346M413903M539877M153996L704280L541410
628.2D75859642L616214L528952K989680K083391J270711J037360J387447J845747
644.5D93619144J942843J546025R37134O61284R79305J491338J711785J522422J063585
662.9E05474865P58052R99689J633883J846254K015471K074182J689434J320601J339614
$$ plain form
540.5 445001215 451183468 455203265 456986874 457269013 456711680 455499381 453447074 450139582 445487469
558.9 445487469 440006614 433995694 427230269 419431746 411110103 403719276 398696542 396815062
575.2 396815062 398275375 402809978 409608811 417546749 425569892 432902217 438958228 443431258
591.5 443431258 446226209 447441489 447373599 446615309 445916802 445638001 445853412 446465850 447205633 448046714
611.9 448046714 449462503 451915830 455506176 459920079 464459956 468613952 472318232 475859642
628.2 475859642 479475856 483004808 485994488 488077879 489348590 490385950 491773397 493619144
644.5 493619144 495561987 497108012 498045146 498706430 499685735 501177073 502888858 504411280 505474865
662.9 505474865 506232917 507232606 508866489 510712743 512728214 514802396 516491830 517812431 519152045
681.2E19152045J670599J836300J382947M73917l80218j049042j652599k306938l001928
699.6E16125083l562808l758192l312111k041459k17617J652360L164113M193067M943729
717.9E17186165N763292O656170P299483P457256O914199N845606M822552M113615
734.3E66058338L623068L144920K354681R76742p44224k379060l624916m386723m890322
752.6E60132504n415321n865693n895019n217790l760100j651287Q76189L416180N684674
771E42304337P670164R409845J0643899J0872484J0006070Q453429O804823N557418
787.3F11722469M924715M748464M759609M749179M724145M770219M692436M426658
803.6F49517894M064023L425241K480626J576066R82106Q35895Q80480O24955j23203
$$ plain form
681.2 519152045 520822644 522658944 524041891 524515808 524135590 523086548 521433949 519127011 516125083
699.6 516125083 512562275 508804083 505491972 503450513 503232896 504885256 508049369 512242436 517186165
717.9 517186165 522949457 529605627 536905110 544362366 551276565 557122171 561944723 566058338
734.3 566058338 569681406 572826326 575181007 576157749 575413525 573034465 569409549 565022826 560132504
752.6 560132504 554717183 548851490 542956471 537738681 533978581 532327294 533203483 536619663 542304337
771 542304337 549974501 559384346 570028245 580900729 590906799 599360228 606165051 611722469
787.3 611722469 616647184 621395648 626155257 630904436 635628581 640398800 645091236 649517894
803.6 649517894 653581917 657007158 659487784 661063850 662045956 662881851 663762331 664387286 664264083
822F64264083j305938k694547l822982m516542n119443n737484o193280o398976o269216
840.3F22205675n739034n027473m444181m253149m542828n164027n899430o343305
856.6E80792248n735278k962828K077759P494569J1381924J3602733J4601112J4066457
873F35318696J1719347Q070111L985286K40624k688408m785180o204188p014573p288039
891.3F31353676p069468o498099n871176n458296n503058o137967p210016q455873
907.6E79149723r649038j0680020j1559725j2104094j1908591j0577500q067906n068808
923.9D99534041k548904q51601M00931J615613K863199M099548N309820O409466O880582
942.3E23712695N635202K120614k707720p373274j1125922j3875127j5803635j7240256
$$ plain form
822 664264083 662958145 660263598 656440616 651924074 646804631 641067147 634873867 628474891 622205675
840.3 622205675 616466641 611439168 606994987 602741838 598199010 593034983 587135553 580792248
856.6 580792248 575056970 572094142 574171901 581666470 593048394 606651127 621252239 635318696
873 635318696 647038043 655108154 659093440 659334064 656645656 651860476 645656288 638641715 631353676
891.3 631353676 624284208 617786109 611914933 606456637 600953579 594815612 587605596 579149723
907.6 579149723 569500685 558820665 547260940 535156846 523248255 512670755 504602849 499534041
923.9 499534041 496985137 496133536 496534467 498150080 501013279 505112827 510422647 516832113 523712695
942.3 523712695 529347897 531468511 528760791 521387517 510261595 496386468 480582833 463342577
958.6D63342577j8406093j9349128k0161867k0920575k1633088k2236497k2556662
972.9C18078667k2440672k1720290k0287037j8198922j5588716j2673676r789482p212102
989.2A90167770m970670l093362j623794n49943J47835N15029N59121K64615k53171
1007.6A81163430p61822j019403q26851k44274N49644J400545K224714L019005L694594
1025.9A89199582M117757M244521M136100L735260K887189J784355R52780O22660O81594
1044.3B12361798J013189J669392K819225M453198O234720P789120R136006J0464922
1060.6B55941570J1666298J1856228R315342K878367n699425j1972279j2855977r408265
1076.9B51721859m805297r97871J752108L703535N119592O276876P231802P689029
$$ plain form
958.6 463342577 444936484 425587356 405425489 384504914 362871826 340635329 318078667
972.9 318078667 295637995 273917705 253630668 235431746 219843030 207169354 197379872 190167770
989.2 190167770 185197100 182103738 180479944 179930001 180077836 180592865 181151986 181416601 181163430
1007.6 181163430 180401608 179382205 178555354 178311080 178860724 180261269 182485983 185504988 189199582
1025.9 189199582 193317339 197561860 201697960 205433220 208320409 210104764 211057544 211680204 212361798
1044.3 212361798 213374987 215044379 217863604 222316802 228551522 236340642 245476648 255941570
1060.6 255941570 267607868 279464096 288779438 291657805 285958380 273986101 261130124 251721859
1076.9 251721859 246916562 245918691 247670799 251374334 256493926 262770802 270002604 277691633
1093.2B77691633P304936N986363M040986K142370J034588J099854K196700L662645
1109.6C05160075M735023N057246M723221L999799L080815K244890J904935K342641
1125.9C33248645L475279M785537N320460M247308J525759k125620n697817q350909
1142.2C36428642r659737r708643q829802p353962n557030l619075j637608L05653
1158.5B90368438K233475M335672O709814R260863J1722922J3807357J5376657J6364247
1174.8C70179445J6736179J6652584J6248405J5491307J4362842J2826234J0863095
1189.1D73360091Q560539O191194M152417K748549K033621J852870K007186K403021
1205.4E03309488L042758L911495M926741N781651O075561N645692M526794K916992
$$ plain form
1093.2 277691633 284996569 290982932 295023918 297166288 298200876 299300730 301497430 305160075
1109.6 305160075 309895098 314952344 319675565 323675364 326756179 329001069 330906004 333248645
1125.9 333248645 336723924 341509461 346829921 351077229 352602988 350477368 344779551 336428642
1142.2 336428642 326768905 317060262 308230460 300876498 295319468 291700393 290062785 290368438
1158.5 290368438 292601913 296937585 303647399 312908262 324631184 338438541 353815198 370179445
1174.8 370179445 386915624 403568208 419816613 435307920 449670762 462496996 473360091
1189.1 473360091 481920630 488111824 492264241 495012790 497046411 498899281 500906467 503309488
1205.4 503309488 506352246 510263741 515190482 520972133 527047694 532693386 537220180 540137172
1221.7E40137172J259029o7056r99987j628160k071142k373457k420664k163470j650929
1240.1E28021336q86500L3736R10580J588404K046168K355695K477944K272546J746237
1258.4E40566146J163304Q68500J108765J823366K549410K759337K244890J232982
1274.8E54316700K04145n09858q67903r63092j022100j224458j474560j676678j853228
1293.1E44928968k032280k295733k600550k753139k740800k689064k550065k178669
1309.4E25088668j744568j571537j638948j758278j901448k280235l229916m703283
1325.8E06260455o105841o814181o606251n654604m330158k941996j610130m54277
1342.1D71743017L02971O67959O99371M26531J0610m65334r03099j130939j164049
$$ plain form
1221.7 540137172 541396201 541329145 540329158 538700998 536629856 534256399 531835735 529672265 528021336
1240.1 528021336 527134836 527168572 528079152 529667556 531713724 534069419 536547363 538819909 540566146
1258.4 540566146 541729450 542597950 543706715 545530081 548079491 550838828 553083718 554316700
1274.8 554316700 554520845 554010987 553143084 552179992 551157892 549933434 548458874 546782196 544928968
1293.1 544928968 542896688 540600955 538000405 535247266 532506466 529817402 527267337 525088668
1309.4 525088668 523344100 521772563 520133615 518375337 516473889 514193654 510963738 506260455
1325.8 506260455 500154614 493340433 486734182 481079578 476749420 473807424 472197294 471743017
1342.1 471743017 472045988 472713947 473413318 473839849 473850459 473385125 472482026 471351087 470187038
1360.4D70187038j030743n88030k37047j21832K09540P66128J341403J642227J622111
1378.8D73790795J565486J907080K960235M525513N211621M218936K707183J150936
1395.1D98037785k22534j129597j399249j515984j904160k117455k253682k398163
1411.4D85096961k130389j583695j302213r25004n7042N28812Q70496J224190J592279
1429.8D83314395J942605K021968K100676K317697K199412K061247J782895J147836
1446.1D98888731K36362o35117j234442j675218k568037k424597j46568J297503K690703
1464.5D94429320M512161N773485P541597J1077881J2512326J0965347R593904Q856952
1480.8E65262973Q433581P610619P106840P181943O859064N434990M630446M928947
$$ plain form
1360.4 470187038 469156295 468568265 468331218 468209386 468418926 469185054 470526457 472168684 473790795
1378.8 473790795 475356281 477263361 480223596 484749109 489960730 494179666 496886849 498037785
1395.1 498037785 497815251 496685654 495286405 493770421 491866261 489748806 487495124 485096961
1411.4 485096961 482966572 481382877 480080664 479155660 479098618 479627430 480497926 481722116 483314395
1429.8 483314395 485257000 487278968 489379644 491697341 493896753 495958000 497740895 498888731
1446.1 498888731 499125093 498489976 497255534 495580316 493012279 490587682 490441114 491738617 494429320
1464.5 494429320 498941481 504714966 512256563 523334444 535846770 546812117 556406021 565262973
1480.8 565262973 573696554 581307173 588414013 595595956 602455020 607890010 612520456 617449403
1497.1F17449403M916727M274667L475189L063559L427029L250182K754867K608239
1513.4F45219862K456367K379060K155662K098560K160430K086520K119124J876116
1529.7F62551701J468062J184881J076579R07779Q82268R49323Q17299N80788K60472
1548.1F70679152P5042J31965J94788k6047r40144j356006m31895m03881n72801q20637
1568.5F66529536j125633r71258j277089j918316j412571r46641j238346j628756j994968
1586.8F54015958k250135k343773k294541k287984k446651k774239l159225l350675
1603.2F33108735l348827l378749l605902l738344l756046m500568n326927l951907
1619.5F01501465l213883l918826l965855l840744l648639k689719k188921k442777
$$ plain form
1497.1 617449403 622366130 626640797 630115986 633179545 636606574 639856756 642611623 645219862
1513.4 645219862 647676229 650055289 652210951 654309511 656469941 658556461 660675585 662551701
1529.7 662551701 664019763 665204644 666281223 667189002 668071270 669020593 669837892 670418680 670679152
1548.1 670679152 670754194 670886159 671080947 671054900 670114756 668758750 668326855 667922974 667350173 666529536
1568.5 666529536 665403903 664432645 663155556 661237240 659824669 658878028 657639682 656010926 654015958
1586.8 654015958 651765823 649422050 647127509 644839525 642392874 639618635 636459410 633108735
1603.2 633108735 629759908 626381159 622775257 619036913 615280867 610780299 605453372 601501465
1619.5 601501465 598287582 594368756 590402901 586562157 582913518 580223799 578034878 575592101
1635.8E75592101j585186n59747k17199M6134M78744J477182J964211K146662L180444
1654.1E82523346L321230L163278L591359M390299M813195M295766M369378N137205
1670.5F15605056N039990N427480O111741N543709M885912N133211O671966O253361
1686.8F60672426N277634N338132M628718M196584M082024L798783M220784L552318
1703.1F95767403K748131K590120K244056K018570K037168K248645K803504K850771
1719.4G15308368K213478J922190K069712K182901K193987K001107K003491K055049
1735.7G31950283J685560J736522K140700K406121K453029K361953K493203K819240
1752G50046611K759039K727032K738118K375603K092838J812041J543462J538098J619279
$$ plain form
1635.8 575592101 574006915 573447168 573229969 573276103 573754847 575232029 577196240 579342902 582523346
1654.1 582523346 585844576 589007854 592599213 596989512 601802707 606098473 610467851 615605056
1670.5 615605056 620645046 626072526 632184267 637727976 642613888 647747099 654419065 660672426
1686.8 660672426 665950060 671288192 675916910 680113494 684195518 687994301 692215085 695767403
1703.1 695767403 698515534 701105654 703349710 705368280 707405448 709654093 712457597 715308368
1719.4 715308368 717521846 719444036 721513748 723696649 725890636 727891743 729895234 731950283
1735.7 731950283 733635843 735372365 737513065 739919186 742372215 744734168 747227371 750046611
1752 750046611 752805650 755532682 758270800 760646403 762739241 764551282 766094744 767632842 769252121
1770.4G69252121J733840J628518J187921R16302R98556J225532J333594J235723R15945
1788.8G80428052O22630P52986J036167J123905J103341J004398Q35538O73533O64532
1807.1G88245082Q39233J070321J040161P61926N20885M65333N35190O84381Q49664
1825.5G95012176P22945M06861L12507M10795N19097O48916O11067K99036K683Q7738
1845.9G99033821L15368M46796N13673M12941J69039j5140K9922K14874L49045K80738
1866.3H01751077J50681J96457K56002K59757L48568M86314M82678L43979K21073J82450
1886.7H04679036K56598M34280M79340L35336J84715P2062N5909J53541K58327K49445
1907.1H07158589J44840M4584k9564m4346Q5175K86341K76863J56284R3520N6505Q2433
$$ plain form
1770.4 769252121 770985961 772614479 773802400 774718702 775717258 776942790 778276384 779512107 780428052
1788.8 780428052 781050682 781803668 782839835 783963740 785067081 786071479 786907017 787580550 788245082
1807.1 788245082 789084315 790154636 791194797 791956723 792477608 792942941 793478131 794162512 795012176
1825.5 795012176 795735121 796141982 796454489 796865284 797384381 798033297 798644364 798943400 798946083 799033821
1845.9 799033821 799349189 799795985 800309658 800722599 800891638 800876498 800906420 801121294 801470339 801751077
1866.3 801751077 801901758 802098215 802354217 802613974 802962542 803448856 803931534 804275513 804496586 804679036
1886.7 804679036 804935634 805369914 805849254 806184590 806369305 806441367 806497276 806650817 806909144 807158589
1907.1 807158589 807303429 807348013 807318449 807274103 807359278 807645619 807922482 808078766 808172286 808228791 808311224
1929.5H08311224J72675K46822K20538Q3387q3864r5487J20223L26216L48687K40207
1949.9H09890628J12355O1631J18673K49624L50475K93374J33753L3736Q0884J91331
1970.3H11516464K36153K15054J61648R2148K0922N424O1631J23680J21951M5895k3961
1992.7H12577009k7299q523N722K0623J1563o7591k07126k94447l00646k81275k97844
2015.2H11130166l40879l90530n08844o59109o29901l43144j64509k66314m14133m75406
2035.6H06937397m58062m14491l40760k84731k98202l03268k56897j92523j07467k5093
2056H04255903J7047K9921O736K38O9439J37449J16765P3910N3942L0637M709j20M7744
2082.5H04844320J18553J40131J03593O8366N9784J01387J81318K51412K75254K32458
$$ plain form
1929.5 808311224 808483899 808730721 808951259 809034646 808950782 808855295 808975518 809301734 809650421 809890628
1949.9 809890628 810002983 810064614 810183287 810432911 810783386 811076760 811210513 811244249 811325133 811516464
1970.3 811516464 811752617 811967671 812129319 812221467 812242389 812247813 812309444 812433124 812555075 812600970 812577009
1992.7 812577009 812549710 812541187 812546909 812567532 812579095 812511504 812304378 812009931 811709285 811428010 811130166
2015.2 811130166 810789287 810398757 809889913 809230804 808600903 808257759 808093250 807826936 807412803 806937397
2035.6 806937397 806479335 806064844 805724084 805439353 805141151 804837883 804580986 804388463 804280996 804255903
2056 804255903 804272950 804302871 804309607 804309845 804379284 804516733 804633498 804707408 804761350 804791987 804796696 804796576 804844320
2082.5 804844320 804962873 805103004 805206597 805274963 805334747 805436134 805617452 805868864 806144118 806376576
2102.9H06376576J46926O3717O1989J51932K28763K04027R4235j7703n4300O735J08839
2125.3H07371736J35421M4287o2287j01805m4227R0242J90735J58786M1724o5744r7573
2147.7H07661295L755J66833K47658K02119J26720J03831J77562L54529M85181M95375
2168.1H10024858M75883M27306L78012M50611N81563O45757N94198M59731L62694L63648
2188.5H14764261M46499N25534N28097M60088L30627K57135L59535N16832N83887N28872
2208.9H19301367L74794K60413K93314M11153N01096N11110M20093K71082J66834J84357
2229.3H22695613L13044M24742M03226K70784J45792J20759J97530K82944L00288K54452
2249.7H25409174J62125P5221J02520K31564L35693L55780K77043J37209O8129J47402
$$ plain form
2102.9 806376576 806523502 806587219 806649208 806801140 807029903 807233930 807328165 807310462 807256162 807262897 807371736
2125.3 807371736 807507157 807551444 807489157 807387352 807343125 807433367 807624102 807782888 807824612 807758868 807661295
2147.7 807661295 807665050 807831883 808079541 808281660 808408380 808512211 808689773 809044302 809529483 810024858
2168.1 810024858 810500741 810928047 811306059 811756670 812338233 812983990 813578188 814037919 814400613 814764261
2188.5 814764261 815210760 815736294 816264391 816724479 817055106 817312241 817671776 818188608 818772495 819301367
2208.9 819301367 819676161 819936574 820229888 820641041 821142137 821653247 822073340 822344422 822511256 822695613
2229.3 822695613 823008657 823433399 823836625 824107409 824253201 824373960 824571490 824854434 825154722 825409174
2249.7 825409174 825571299 825646520 825749040 825980604 826316297 826672077 826949120 827086329 827154458 827301860
2270.1H27301860K49982K92897K87473K18690J32262O4731Q7500K05218K93613K95698
2290.5H29429924K09630R6440L5644N8114J51515K31386K39491J96219J07109N8115
2310.9H30813587J40369K48909K90930K84195J86920J0371m1425Q6248K07841J55330
2331.3H32383275l1292k07782k79188j51515k3604j36316m22477n84066l89278K8968
2351.7H30186725M02987N67615M84407Q4221l71277n71311n44846m98176n41210o28292
2372.1H28570843o97553p07269o47485n02408l15964k07007k23696l23236m00842l54230
2392.5H24191153k24173j30594j37746k41101l83019m60029m12166l11494k87473l64602
2412.9H21238756m69565n53608n97060n88357n07534m30107m89473o38008p50065p34926
$$ plain form
2270.1 827301860 827551842 827844739 828132212 828350902 828483164 828547895 828635395 828840613 829134226 829429924
2290.5 829429924 829639554 829735994 829771638 829829752 829981267 830212653 830452144 830648363 830755472 830813587
2310.9 830813587 830953956 831202865 831493795 831777990 831964910 831975281 831933856 832020104 832227945 832383275
2331.3 832383275 832351983 832144201 831865013 831713498 831689894 831553578 831131101 830547035 830157757 830186725
2351.7 830186725 830589712 831157327 831641734 831725955 831354678 830783367 830238521 829740345 829199135 828570843
2372.1 828570843 827873290 827166021 826518536 826016128 825700164 825493157 825269461 824946225 824545383 824191153
2392.5 824191153 823966980 823836386 823698640 823457539 823074520 822614491 822202325 821890831 821603358 821238756
2412.9 821238756 820769191 820215583 819618523 819030166 818522632 818092525 817603052 816965044 816214979 815480053
2433.3H15480053o14106n35071n47350o30259p53343q06511p38084o13272n08487n25654
2453.7H09207916o59525p48396p29442o34432n17129m74513n15223o01053o74367o45935
2474.1H03007901n61774m86910m43578m97818o09577o35624n27978l76522k96474l39269
2494.5G98232377m26174m49359m27306l68237k61903k06173k67863m10259n16474m71413
2514.9G94427216l48389l19064l91364m88579n85616o38544o28352n73576n18024n61178
2535.3G89374530p03752q10146q12352p41482o35027n90265o73235q04066q64745q00848
2555.6G81938612o63876n70536o02722p04288p64192p63177p01785n92113n33998o09875
2576G75432050p52806q29936p59243n76675m46082m58240n28812n76377n92053n43356
$$ plain form
2433.3 815480053 814865947 814330876 813783526 813153267 812399924 811593413 810855329 810242057 809733570 809207916
2453.7 809207916 808548391 807799995 807070553 806436121 805918992 805444479 804929256 804328203 803653836 803007901
2474.1 803007901 802446127 801959217 801515639 801017821 800408244 799772620 799244642 798868120 798571646 798232377
2494.5 798232377 797806203 797356844 796929538 796561301 796299398 796093225 795825362 795415103 794898629 794427216
2514.9 794427216 794078827 793759763 793368399 792879820 792294204 791655660 791027308 790453732 789935708 789374530
2535.3 789374530 788670778 787860632 787048280 786306798 785671771 785081506 784408271 783604205 782739460 781938612
2555.6 781938612 781274736 780704200 780101478 779397190 778632998 777869821 777168036 776575923 776041925 775432050
2576 775432050 774679244 773849308 773090065 772513390 772067308 771609068 771080256 770503879 769911826 769368470
2596.4G69368470m06146k99096l73602n69225p09176p47919p14064o41107o75976q69751
2616.8G63362408j053691j127959j102149j016676r81987j083970j277983j430392
2633.2G54287601j411140j272679j206398j232982j295387j384199j412034j329184
2649.5G43743598j217424j180649j227319j274765j272798j221418j172125j174271
2665.8G34002829j167655j140893j142979j124799j038372r42171r17256r49740r97722
2684.1G24581242j053214j072824j046956j031995j039445j081884j157344j209378
2700.5G15888202j231372j231373j233160j257122j268029j265824j264810j263917
2716.8G05872595j225471j130462j066804j048028r85802r43362r73165r57787q79944
$$ plain form
2596.4 769368470 768962324 768663228 768289626 767720401 767011225 766263306 765549242 764908135 764232159 763362408
2616.8 763362408 762308717 761180758 760078609 759061933 758079946 756995976 755717993 754287601
2633.2 754287601 752876461 751603782 750397384 749164402 747869015 746484816 745072782 743743598
2649.5 743743598 742526174 741345525 740118206 738843441 737570643 736349225 735177100 734002829
2665.8 734002829 732835174 731694281 730551302 729426503 728388131 727445960 726528704 725578964 724581242
2684.1 724581242 723528028 722455204 721408248 720376253 719336808 718254924 717097580 715888202
2700.5 715888202 714656830 713425457 712192297 710935175 709667146 708401322 707136512 705872595
2716.8 705872595 704647124 703516662 702449858 701401830 700416028 699472666 698499501 697541714 696661770
2735.1F96661770q20577q09431q40366q73565q79229q40723p73251p34151p29978p37428
2755.5F88623071p36058p01308o43671n84960n69284o54876p89166q62956q60571q46565
2775.9F81373656q70049r33647j040697j175106j273036j296639j305938j368821j488387
2794.3F70621336j643181j763344j789153j778304j841605j971901k086520k181649
2810.6F55565679k260625k300859k327859k405942k559006k735138k842963k866208
2826.9F35267079k907157k993107l095090l273607l521263l765345l998577m225672
2843.2F07487261m470944m702330m696130m280627l621042l036737k714038k754331
2859.5E77211082l177106l813863m475057n069673n553008n924642o215453o397187
$$ plain form
2735.1 696661770 695841193 695031762 694191396 693317831 692438602 691597879 690824628 690090477 689360499 688623071
2755.5 688623071 687887013 687185705 686542034 685957074 685387790 684732914 683943748 683080792 682220221 681373656
2775.9 681373656 680503607 679569960 678529263 677354157 676081121 674784482 673478544 672109723 670621336
2794.3 670621336 668978155 667214811 665425658 663647354 661805749 659833848 657747328 655565679
2810.6 655565679 653305054 651004195 648676336 646270394 643711388 640976250 638133287 635267079
2826.9 635267079 632359922 629366815 626271725 622998118 619476855 615711510 611712933 607487261
2843.2 607487261 603016317 598313987 593617857 589337230 585716188 582679451 579965413 577211082
2859.5 577211082 574033976 570220113 565745056 560675383 555122375 549197733 542982280 536585093
2875.9E36585093o329596n894661n131186m247426l407300k603114j865744j297653
2892.2E05808413r29892p46429p60257r25482j176536j491487j851618k277583k829760
2910.5D92819369l496945m139096m591107m724294m516810m047066l410220k636224
2926.8D61257607j672209n36382P65801K211719L643603M895269N820156O358802O649971
2945.2D89394337O844371O978333P052362P039428O955147O852686O696105O411374
2961.5E44224143O009519N553663N123973M762530M507959M357576M201949M089236
2977.8E82830548M008353L752351L360510L005266K717137K474785K188504J813352
2994.2F06150806J465499J138986P85350M56512J35899k02656n13673p74204j058937
$$ plain form
2875.9 536585093 530255497 524360836 519229650 514982224 511574924 508971810 507106066 505808413
2892.2 505808413 504878521 504132092 503371835 502446353 501269817 499778330 497926712 495649129 492819369
2910.5 492819369 489322424 485183328 480592221 475867927 471351117 467304051 463893831 461257607
2926.8 461257607 459585398 459049016 459814817 462026536 465670139 470565408 476385564 482744366 489394337
2945.2 489394337 496238708 503217041 510269403 517308831 524263978 531116664 537812769 544224143
2961.5 544224143 550233662 555787325 560911298 565673828 570181787 574539363 578741312 582830548
2977.8 582830548 586838901 590591252 593951762 596957028 599674165 602148950 604337454 606150806
2994.2 606150806 607616305 608755291 609540641 609997153 610133052 609930396 609416723 608642519 607583582
3012.5F07583582j389622j668215j848936k006173k172947k331794k450704k465129
3028.8E91250062k490878k627313k801657k919257k888143k854585k982140l137827
3045.1E68548262l198981l161311l139854l213286l250301l251433l281713l255725
3061.5E42795658l179371l144861l223955l361046l385067l299654l170609l081084
3077.8E16950011l166318l311217l379046l392637l329993l271907l330469l366232
3094.1D90402192l265709l137022l149062l286541l276706l092795l037513l164470
3110.4D64992374l141850k959788k949297l065348l191262l315449l281385l092915
3126.7D39995080k944439k936900l000975k954542k790839k764016k929509l017753
$$ plain form
3012.5 607583582 606193960 604525745 602676809 600670636 598497689 596165895 593715191 591250062
3028.8 591250062 588759184 586131871 583330214 580410957 577522814 574668229 571686089 568548262
3045.1 568548262 565349281 562187970 559048116 555834830 552584529 549333096 546051383 542795658
3061.5 542795658 539616287 536471426 533247471 529886425 526501358 523201704 520031095 516950011
3077.8 516950011 513783693 510472476 507093430 503700793 500370800 497098893 493768424 490402192
3094.1 490402192 487136483 483999461 480850399 477563858 474287152 471194357 468156844 464992374
3110.4 464992374 461850524 458890736 455941439 452876091 449684829 446369380 443087995 439995080
3126.7 439995080 437050641 434113741 431112766 428158224 425367385 422603369 419673860 416656107
3143D16656107k928198k801329k682954k607852k687067k818674k776384k648324k590567
3161.4C92114758k573072k565891k538294k467989k419532k426445k407998k336532
3177.7C72379005k278090k284765k269983k159566k070904k098560k147972k121568
3194C54947597k078891k025366j937717j880586j875788j891464j882613j797765j704306
3212.4C37873101j699924j698226j661330j649797j629740j585335j544774j470297
3228.7C24933678j325101j250475j416535j576155j502126j382113j284987j199096
3245C13997090j225352j298607j248538j118541j060933j106620j150727j113325j040698
3263.4C03633749r68813q53509p50601q45552j013696j048297j008212r45598r14753
$$ plain form
3143 416656107 413727909 410926580 408243626 405635774 402948707 400130033 397353649 394705325 392114758
3161.4 392114758 389541686 386975795 384437501 381969512 379549980 377123535 374715537 372379005
3177.7 372379005 370100915 367816150 365546167 363386601 361315697 359217137 357069165 354947597
3194 354947597 352868706 350843340 348905623 347025037 345149249 343257785 341375172 339577407 337873101
3212.4 337873101 336173177 334474951 332813621 331163824 329534084 327948749 326403975 324933678
3228.7 324933678 323608577 322358102 320941567 319365412 317863286 316481173 315196186 313997090
3245 313997090 312771738 311473131 310224593 309106052 308045119 306938499 305787772 304674447 303633749
3263.4 303633749 302664936 301811427 301060826 300215274 299201578 298153281 297145069 296199471 295284718
3281.7B95284718r06110q41230p48962o71029o48886p35372q71450r50605r00983p19816
3302.1B87290275n48363o12884r05961j125068j090407r28581q54701q88943r06527
3320.5B79428840q40485p71255q60929r92328r73225q95679p89404o65128p13319q87334
3340.9B71039754r57250r42380q46386o92069p73132j038820j093834q90047o94960
3359.2B63110876o91891p27832o04182n45860p55369j034916j062363q12292o17266
3377.6B56258905o15448o88135o50704m78387k68430r4771j98215n10961n54264k28196
3398B51971394j6988k77519o14971n18769k26319j18345j56432k41876k68593j60605
3418.4B49370977o9886n2720J8835J79082L19898K98008L23743M59313L13014m5747
$$ plain form
3281.7 295284718 294378608 293537378 292788416 292117387 291468501 290733129 289861679 288911074 288010091 287290275
3302.1 287290275 286741912 286129028 285223067 284097999 283007592 282079011 281224310 280335367 279428840
3320.5 279428840 278588355 277817100 276956171 275963843 274990618 274094939 273305535 272640407 271927088 271039754
3340.9 271039754 270082504 269140124 268293738 267601669 266828537 265789717 264695883 263805836 263110876
3359.2 263110876 262418985 261691153 261086971 260541111 259785742 258750826 257688463 256876171 256258905
3377.6 256258905 255643457 254955322 254304618 253826231 253557801 253463030 253264815 252753854 252199590 251971394
3398 251971394 251954406 251676887 251061916 250543147 250316828 250198483 250042051 249800175 249531582 249370977
3418.4 249370977 249301091 249248371 249267206 249446288 249766186 250064194 250387937 250847250 251160264 251114517
3438.8B51114517r1522K02268M04835L99261L66450M38153N58049O26951P16895Q48025
3459.2B55583882P73043P01189R75996J160503Q53717M18693L87370P05004J053810
3477.5B62613207J061767P44045P31468J022488J038641R33439J048535J139909J114219
3495.9B71447718J076549J075626J030385Q86679Q53807R85831J211047J439333J352459
3514.2B81359434J080662J093596J331002J509756J373112J088142J087219J335919
3530.6B91258842J513332J563430J514792J436919J606017J824350J710325J483619
3546.9C03911626J600027J792670J854390J984357K156407K312034K430082K332300
3563.2C20373893K129107K528489L208041L185988K926647K979547L166706L381401
$$ plain form
3438.8 251114517 251022995 251225263 251630098 252029359 252395809 252833962 253392011 254018962 254735857 255583882
3459.2 255583882 256356925 257058114 258034110 259194613 260048330 260467023 260854393 261559397 262613207
3477.5 262613207 263674974 264419019 265150487 266172975 267211616 268145055 269193590 270333499 271447718
3495.9 271447718 272524267 273599893 274630278 275516957 276370764 277356595 278567642 280006975 281359434
3514.2 281359434 282440096 283533692 284864694 286374450 287747562 288835704 289922923 291258842
3530.6 291258842 292772174 294335604 295850396 297287315 298893332 300717682 302428007 303911626
3546.9 303911626 305511653 307304323 309158713 311143070 313299477 315611511 318041593 320373893
3563.2 320373893 322503000 325031489 328239530 331425518 334352165 337331712 340498418 343879819
3579.5C43879819L606558L598183L300101L267437L789097L885955L754466L997058
3595.8C73078674M250735M217804M193306M166454L953129L988266M247427M336595
3612.1D06432390M454345M348069M282415M858673M929542M326225L676533L814459
3628.5D41122651M941166M914552M545092M549205M443229M351049M348368M066378
3644.8D77281690L655046M143804N110443M629344L902703M299283M626215M150569
3661.1E11799097L814280L706813L304124L145575L694892L383339L074705L779471
3677.4E39702296L732085L348947L201962K964317K732456K670348K762198K780259
3693.7E63894868K613544K367974K117216K137542K422750K308488J847982J533866
$$ plain form
3579.5 343879819 347486377 351084560 354384661 357652098 361441195 365327150 369081616 373078674
3595.8 373078674 377329409 381547213 385740519 389906973 393860102 397848368 402095795 406432390
3612.1 406432390 410886735 415234804 419517219 424375892 429305434 433631659 437308192 441122651
3628.5 441122651 446063817 450978369 455523461 460072666 464515895 468866944 473215312 477281690
3644.8 477281690 480936736 485080540 490190983 494820327 498723030 503022313 507648528 511799097
3661.1 511799097 515613377 519320190 522624314 525769889 529464781 532848120 535922825 539702296
3677.4 539702296 543434381 546783328 549985290 552949607 555682063 558352411 561114609 563894868
3693.7 563894868 566508412 568876386 570993602 573131144 575553894 577862382 579710364 581244230
3710E81244230J871705K400399K192497J788437J600862J583099J618028J789152J912296
3728.4E98000705J588345J240670J256168J664341J897752J387417N58436P14183J539231
3746.7F09847248J067698Q34286J703381J818180J269937J134753J434446J315295
3763.1F20425224J043976J033485J053929J259386J347304J127899R56058R49740J025260
3781.4F30222261R58383R59337J069188J054227R44436P43270P04288Q30591N70893
3799.8F38056874O58691J072645P97689R36866J249075R42052M86731N15223P42554
3818.1F45458400M89950Q43049J156985Q54910P13825O05702O44923P34984M82083
3836.5F51984811M23670P38144Q76665R37521Q38459M50849j91450l75807J040160
$$ plain form
3710 581244230 583115935 585516334 587708831 589497268 591098130 592681229 594299257 596088409 598000705
3728.4 598000705 599589050 600829720 602085888 603750229 605647981 607035398 607593834 608308017 609847248
3746.7 609847248 610914946 611749232 613452613 615270793 616540730 617675483 619109929 620425224
3763.1 620425224 621469200 622502685 623556614 624816000 626163304 627291203 628247261 629197001 630222261
3781.4 630222261 631180644 632139981 633209169 634263396 635207832 635951102 636655390 637485981 638056874
3799.8 638056874 638715565 639788210 640585899 641522765 642771840 643713892 644200623 644715846 645458400
3818.1 645458400 645948350 646791399 647948384 648803294 649517119 650122821 650767744 651502728 651984811
3836.5 651984811 652408481 653146625 654023290 654960811 655799270 656250119 656058669 655682862 656723022
3854.8F56723022J581073Q49784L35753K42650N25952N78939L48926N73635P51078
3873.2F62510812P77602N99981K37763M60565N83887N10991O64293L45350K21192O52135
3893.6F67564571N93007J70111N2393J87397M00066P06673O95705M55260L26217J72078
3914F71323478M2200J94788M06564L70025K66493K95758K45571J38998L85582O28949
3934.4F74298406L79324J18255R4474J50501K37227K56538L10183M08470L60907K36451
3954.8F76850736J82390K27452K75016K64704K23994J90020J88648J94073J95563K08139
3975.2F79000735K40147K52009K69532K88248K08080J02281Q9646J35720J71005J88113
3995.6F80945516K10046
$$ plain form
3854.8 656723022 658304095 659153879 659489632 659732282 660258234 660837173 661186099 661759734 662510812
3873.2 662510812 663288414 663888395 664126158 664586723 665170610 665681601 666345894 666691244 666912436 667564571
3893.6 667564571 668157578 668327689 668380082 668567479 668967545 669674218 670369923 670825183 671151400 671323478
3914 671323478 671365678 671560466 671967030 672337055 672603548 672899306 673144877 673283875 673669457 674298406
3934.4 674298406 674677730 674795985 674890459 675040960 675278187 675534725 675844908 676253378 676614285 676850736
3954.8 676850736 677033126 677260578 677535594 677800298 678024292 678214312 678402960 678597033 678792596 679000735
3975.2 679000735 679240882 679492891 679762423 680050671 680258751 680361032 680450678 680586398 680757403 680945516
3995.6 680945516 681155562
3997.6F81155562
$$ plain form
3997.6 681155562
##END=$$ End of the data block
