##TITLE=$$ Begin of the data block
##JCAMP-DX=5.00 $$ ACD/SpecManager v 10.08
##SPECTROMETER/DATA SYSTEM=Alpha
##DATE=29 Dec 2014 15:06:02
##DATA TYPE=INFRARED SPECTRUM
##DATA CLASS=XYDATA
##ORIGIN=
##OWNER=
##NPOINTS=1765
##FIRSTX=399.76428223
##LASTX=3997.64306641
##MAXX=3997.64306641
##MINX=399.76428223
##MAXY=0.83318043
##MINY=0.17825301
##XFACTOR=1.0000000000
##YFACTOR=1.000000000000000e-9
##FIRSTY=0.52195805
##DELTAX=2.03961372
##XUNITS=1/CM
##YUNITS=ARBITRARY UNITS
##XYDATA=(X++(Y..Y))
399.8 521958053 515910327 511051238 507912338 507042885 508233547 510286510 512127876 513066173 512848675
418.1 512848675 512260735 511591733 509723246 506334305 502399862 498589307 495151848 492258638 490048826
436.5 490048826 489318788 490878999 494868398 500476956 506077588 510526359 513422191 514764965 514976025
454.8 514976025 514753044 514425457 513707101 511961639 508811474 504596770 500258684 496432692 493150413
473.2 493150413 490255564 487495482 484988034 483072788 482173204 482557416 483509332 483829647 483002067
491.5 483002067 481372029 479471445 477579266 475704938 473509580 470613241 467005819 463113397
507.9 463113397 459383845 455655485 451550573 446703464 441069663 435562640 431166947 428220332
524.2 428220332 426705331 426170647 426066756 426459223 428052396 431744993 437694550 444746047 450973123
542.5 450973123 454986006 456761688 457090616 456585765 455335766 453139156 449783921 445216626 439800024
560.9 439800024 433883250 427181214 419397563 411153257 403850049 398783714 396755129 398169756
577.2 398169756 402699858 409472555 417465568 425503492 432669461 438562810 443087608 446045518
593.5 446045518 447354436 447357565 446658522 445948839 445760757 446083426 446603775 447284997 448246539 449719369
613.9 449719369 452089518 455587715 459917307 464441746 468714178 472587794 476198882 479758292
630.2 479758292 483235866 486213595 488295287 489619672 490744978 492133319 493870616 495677352
646.6 495677352 497181714 498266011 499105752 500069976 501457572 503149509 504706562 505832493 506626189
664.9 506626189 507583976 509220243 511155963 513178170 515167594 516822398 518196404 519612849 521311462
683.3 521311462 523089409 524394631 524857461 524466336 523361921 521743119 519527853 516580701 513080478
701.6 513080478 509336472 505939484 503829300 503641307 505363703 508605421 512845397 517764449 523523211
720 523523211 530197799 537447095 544812560 551690698 557632089 562592089 566741467 570353866 573493004
738.3 573493004 575790048 576680124 575861454 573427618 569802940 565413773 560454607 555007815 549191773
756.7 549191773 543348372 538169801 534456670 532802105 533617795 537043750 542802811 550496340 559855402
775.1 559855402 570455372 581354380 591369092 599788427 606620252 612256050 617234826 621999621
791.4 621999621 626732945 631464362 636190653 640898287 645516872 649919450 653976440 657435656
807.7 657435656 659990609 661622643 662628651 663457036 664295852 664879143 664681792 663275123 660572350
826 660572350 656771958 652172923 646953940 641205132 635028720 628632724 622375369 616659582 611669898
844.4 611669898 607247233 602982163 598389745 593144774 587220013 580921710 575228631 572271705
860.7 572271705 574344099 581839085 593218029 606850803 621477246 635469735 647058249 655061126
877 655061126 659067571 659323037 656569004 651694953 645474851 638496816 631225467 624124050 617562711
895.4 617562711 611648977 606174290 600655019 594516575 587313235 578841329 569185615 558526158
911.7 558526158 546981037 534870803 522967517 512444854 504428685 499347329 496780336 495959610
928 495959610 496381491 497975647 500833333 504938006 510214031 516581059 523458004 529107749 531227529
946.4 531227529 528482437 521031678 509874046 496062577 480308026 463015407 444533825 425168663
962.7 425168663 405028969 384121925 362471908 340214133 317676157 295303285 273655623
977 273655623 253419131 235278741 219755024 207102567 197300762 190110460 185178772 182091475
993.3 182091475 180430010 179818749 179957390 180539146 181161433 181435168 181159630 180383131 179379299
1011.6 179379299 178553462 178253010 178735003 180114433 182345942 185351312 189047754 193203703 197478533
1030 197478533 201608703 205292702 208148822 209981635 210993186 211609617 212252557 213259891 214958206
1048.4 214958206 217803612 222280636 228562057 236385718 245493248 255911559 267552376 279346347
1064.7 279346347 288573116 291439414 285809278 273911059 261114180 251747906 246952936 245944083
1081 245944083 247679070 251391351 256548345 262834936 270016700 277637541 284906805 290886730 294951051
1099.4 294951051 297116458 298144579 299249798 301467657 305125207 309812576 314851314 319640398
1115.7 319640398 323689669 326748312 328963548 330843747 333181620 336699665 341514409 346807241
1132 346807241 351015389 352531880 350412428 344723761 336399376 326781660 317110032 308279186 300877720
1150.3 300877720 295292795 291708797 290116876 290436894 292673141 297032028 303769439 313011140
1166.7 313011140 324691176 338492453 353867590 370222151 386990994 403678179 419918120
1180.9 419918120 435379773 449709505 462515622 473375708 481947362 488146126 492281973 495017797
1197.3 495017797 497066408 498953104 500994444 503386199 506393909 510314822 515250981 521001577
1213.6 521001577 527068079 532727361 537228107 540113270 541384161 541331768 540320694 538679123 536614358
1231.9 536614358 534258544 531826198 529652238 528048933 527199984 527212441 528114200 529740930 531827450
1250.3 531827450 534187913 536622465 538829088 540544689 541723967 542628407 543760896 545583308
1266.6 545583308 548136175 550927758 553210855 554441869 554600000 554049671 553189397 552248597 551236629
1285 551236629 550047815 548616350 546951652 545098782 543060958 540761232 538168311 535408497 532656610
1303.3 532656610 529979825 527450681 525285304 523535430 521944880 520303607 518541038 516606152
1319.6 516606152 514294624 511066675 506393969 500314534 493511796 486921877 481290936 476981670
1336 476981670 474053025 472458959 472023427 472307563 472916692 473572731 473999679 474022985 473563731 472683787
1356.4 472683787 471585780 470450372 469430506 468806505 468518972 468372613 468555063 469272673 470615804
1374.7 470615804 472300798 473916054 475458235 477380097 480344325 484826207 489999264 494224310
1391 494224310 496949553 498085290 497830451 496684730 495281219 493768573 491883576 489793748 487561315
1409.4 487561315 485191613 483080000 481478661 480161041 479254603 479211479 479757041 480662942 481907427
1427.7 481907427 483479738 485377669 487376958 489492208 491857290 494110227 496214807 498050421
1444.1 498050421 499255717 499501854 498825222 497546196 495824188 493212879 490785956 490657389 491977692
1462.4 491977692 494688123 499196261 504953504 512479901 523547471 536044598 546998441 556612492
1478.7 556612492 565491498 573928416 581556022 588682353 595851839 602685809 608100533 612711668
1495 612711668 617633164 622572958 626890302 630383611 633424938 636838496 640121400 642911971 645537734
1513.4 645537734 647991896 650363564 652504981 654576659 656731546 658836484 660978794 662871540
1529.7 662871540 664331257 665487051 666553915 667445302 668293238 669295967 670187771 670796156 671063602
1548.1 671063602 671118617 671220899 671423733 671437204 670541048 669200659 668748856 668308377 667692304 666858733
1568.5 666858733 665744960 664762259 663491011 661637127 660255313 659292161 658053577 656435370 654434502
1586.8 654434502 652185380 649868667 647578537 645240664 642759383 640015304 636882901 633505642
1603.2 633505642 630139470 626795471 623224258 619472623 615697384 611222506 605942905 602012515
1619.5 602012515 598795235 594861150 590896606 587074280 583434761 580748260 578555584 576119959
1635.8 576119959 574591160 574067235 573846936 573914170 574479938 576041460 578008950 580138266 583353221
1654.1 583353221 586691439 589837551 593432724 597869158 602720201 607012987 611372650 616493583
1670.5 616493583 621488273 626884401 633001208 638546348 643436730 648570299 655204237 661452353
1686.8 661452353 666741908 672054529 676637232 680794477 684852719 688630223 692852497 696425557
1703.1 696425557 699177027 701737761 703930318 705910146 707924604 710165679 712999225 715894341
1719.4 715894341 718133926 720076442 722155035 724328279 726515174 728496790 730450630 732481778
1735.7 732481778 734176278 735924363 738076866 740483165 742916882 745267868 747787297 750627279
1752 750627279 753352523 756018817 758714914 761087000 763205886 765040576 766596556 768148184 769753516
1770.4 769753516 771450877 773099840 774351656 775291502 776262581 777466118 778809786 780068099 780984581
1788.8 780984581 781581998 782326996 783387840 784530342 785633147 786628067 787451386 788112223 788781524
1807.1 788781524 789631903 790683985 791706622 792463958 792970359 793440044 794004023 794703126 795533359
1825.5 795533359 796223760 796630859 796975493 797391891 797904134 798581064 799209476 799479425 799450219 799533129
1845.9 799533129 799858212 800326884 800852180 801248133 801400959 801398635 801476002 801724911 802044868 802276552
1866.3 802276552 802402735 802586913 802845538 803143978 803534925 804014087 804466844 804803371 805028141 805207551
1886.7 805207551 805458784 805893481 806373537 806707501 806907296 807010710 807091534 807243466 807465136 807675779
1907.1 807675779 807810247 807866752 807870448 807868123 807963967 808226049 808489561 808657467 808773696 808851600 808942139
1929.5 808942139 809112191 809344172 809527457 809575915 809483349 809392452 809521794 809863269 810223162 810456336
1949.9 810456336 810546458 810600042 810736954 810997427 811338365 811618686 811745107 811776996 811841369 812024295
1970.3 812024295 812308073 812588930 812770605 812850177 812862813 812870979 812940598 813062906 813152254 813168824 813180506
1992.7 813180506 813197494 813185632 813199282 813252449 813282967 813218892 812991560 812659621 812343001 812068582 811773956
2015.2 811773956 811419666 810995340 810448050 809780300 809176564 808862031 808722615 808473408 808056712 807572961
2035.6 807572961 807108879 806691647 806352973 806069851 805778861 805486321 805227101 805030644 804951847 804978848
2056 804978848 805015147 805030346 805045903 805059493 805090785 805175006 805279672 805371463 805435300 805446386 805429816 805455804
2080.4 805455804 805555642 805694997 805847704 805977583 806058526 806127667 806226254 806385338 806635141 806906819
2100.8 806906819 807098210 807212949 807305634 807418466 807580233 807802558 807985604 808022738 807973087 807933509
2121.2 807933509 807956994 808071196 808217883 808279991 808215201 808105052 808069468 808160603 808357060 808545411
2141.6 808545411 808590114 808483958 808356106 808368683 808561087 808833838 809053659 809165359 809246182 809439123
2162 809439123 809806645 810270905 810744882 811215281 811655343 812056899 812521577 813115060 813770533 814349115
2182.4 814349115 814782202 815144122 815535009 815989673 816507459 817069292 817556798 817870378 818106294 818444908
2202.8 818444908 818956971 819567621 820117772 820484281 820726335 821021974 821455181 821970522 822479546 822888613
2223.2 822888613 823161721 823355794 823554635 823846161 824238896 824625075 824907422 825095177 825249255 825434804
2243.6 825434804 825679660 825954139 826205015 826373279 826459467 826567948 826791406 827111721 827467442 827766001
2264 827766001 827921689 828003287 828148782 828374922 828649879 828937888 829161882 829294503 829369605 829483271
2284.4 829483271 829728425 830070555 830376446 830532849 830563188 830568910 830627441 830785215 831046402 831339240
2304.8 831339240 831541419 831625164 831701815 831857383 832065046 832290113 832513690 832667887 832722664 832745075
2325.2 832745075 832816839 832998157 833180428 833115935 832816184 832542062 832430422 832425237 832370639 832015693
2345.6 832015693 831424296 830996215 830993593 831377506 831879795 832292318 832379103 832003295 831406355 830836892
2366 830836892 830320776 829836309 829295576 828655422 827998400 827400684 826924503 826597333 826362193 826128006
2386.4 826128006 825817883 825425506 825062752 824831128 824706316 824580789 824334323 823936343 823478401 823077142
2406.8 823077142 822763145 822463810 822103143 821657836 821106732 820491791 819917619 819430768 818990171 818488717
2427.2 818488717 817854166 817126870 816413581 815781713 815235198 814706564 814067245 813291907 812485099 811758637
2447.6 811758637 811169088 810682595 810164154 809497416 808718443 807966352 807356715 806880236 806425929 805891573
2467.9 805891573 805230498 804528832 803907037 803370714 802900672 802441061 801901996 801293433 800700426 800202847
2488.3 800202847 799841166 799557090 799233437 798815012 798338413 797889590 797528803 797248185 797001064 796729088
2508.7 796729088 796357632 795871615 795386314 795023084 794740677 794385433 793869436 793237269 792601049 792001069
2529.1 792001069 791433275 790904760 790321708 789602518 788805723 788000762 787250042 786635995 786100447 785450697
2549.5 785450697 784619629 783731341 782927990 782253623 781669796 781091630 780418992 779647171 778881907 778185487
2569.9 778185487 777576625 777037680 776451826 775729895 774926126 774178445 773574352 773083508 772615314 772111893
2590.3 772111893 771558642 770977616 770447969 770050228 769739151 769339502 768759787 768056512 767317057 766614735
2610.7 766614735 765960097 765244305 764347911 763304174 762228787 761175156 760155201 759149611 758040786
2629.1 758040786 756727576 755272806 753857315 752601445 751429319 750212908 748918414 747556567
2645.4 747556567 746176660 744857311 743631482 742452204 741240561 739970624 738667905 737396479
2661.7 737396479 736217260 735086739 733951211 732817531 731679261 730549455 729483306 728507161
2678 728507161 727600813 726704359 725720942 724640429 723535061 722465634 721454620 720463574 719426453
2696.4 719426453 718287766 717053890 715782702 714523017 713283479 712044358 710791707 709520102
2712.7 709520102 708254814 707029819 705848694 704731941 703665316 702582479 701543450 700610876
2729 700610876 699694872 698769271 697891772 697062552 696234107 695375741 694495380 693607390 692765772 692034006
2749.4 692034006 691337466 690566003 689775527 689048171 688373208 687747538 687174082 686581612 685876489 685067058
2769.8 685067058 684232831 683412015 682572484 681678891 680731177 679685056 678493917 677219212 675945878
2788.2 675945878 674675524 673344016 671871364 670220792 668455005 666659534 664853394 663009405
2804.5 663009405 661066413 658978164 656765163 654487550 652183354 649855852 647478044 644971907
2820.8 644971907 642268598 639423788 636535645 633607984 630619228 627520263 624212921 620663583
2837.1 620663583 616889417 612881899 608636141 604161918 599490404 594824195 590521038 586822152
2853.4 586822152 583716989 580986083 578255355 575107872 571302414 566831410 561757028 556144476
2869.7 556144476 550127029 543854654 537436485 531102121 525225461 520095289 515820503 512407362
2886.1 512407362 509795904 507896841 506595314 505679667 504921913 504155993 503230453 502040029 500540257
2904.4 500540257 498675257 496374369 493527532 490017802 485868812 481294781 476609617 472097039
2920.7 472097039 468013704 464567423 461913526 460242003 459728450 460543185 462830156 466514289 471342713
2939.1 471342713 477054089 483373851 490055382 496931046 503916562 510987937 518071532 525057435
2955.4 525057435 531908870 538616121 545081675 551158547 556755185 561898232 566677511 571208298
2971.7 571208298 575596750 579853117 584000945 588039458 591811657 595195770 598226428 600950241
2988 600950241 603418171 605633616 607478201 608952165 610116303 610953391 611494124 611700594 611495495
3006.4 611495495 610961378 610192537 609144330 607763410 606097102 604230344 602210104 600070357 597800314
3024.7 597800314 595379829 592907131 590411603 587779045 584945798 581993103 579103231 576285660
3041.1 576285660 573359013 570246935 567038476 563856542 560707808 557522058 554299176 551038921
3057.4 551038921 547737181 544456542 541221142 538003743 534750104 531417489 528052568 524726331
3073.7 524726331 521536291 518477023 515341759 512050211 508693039 505309284 501964509 498692244
3090 498692244 495389879 492040634 488750786 485561222 482358873 479047835 475765526 472650826 469587922
3108.4 469587922 466427892 463312447 460353106 457359880 454253852 451057553 447768122 444513530
3124.7 444513530 441375434 438334584 435350150 432351202 429385245 426571161 423800051 420852393
3141 420852393 417825103 414920300 412124753 409445524 406861186 404150307 401267678 398460597 395794690
3159.4 395794690 393167943 390578777 388031483 385501295 382997394 380545974 378136843 375742495
3175.7 375742495 373374790 371068627 368802369 366553277 364351541 362214118 360109597 357993096
3192 357993096 355860531 353739619 351689637 349726498 347810507 345920920 344024986 342123032 340302676
3210.3 340302676 338588893 336903423 335221559 333561122 331915081 330278277 328674495 327127218
3226.7 327127218 325640351 324259222 322964638 321551472 319982499 318471789 317102224 315848738
3243 315848738 314684272 313501835 312201738 310873777 309676766 308573782 307445437 306312084 305236071
3261.3 305236071 304201633 303184271 302280277 301561296 300794601 299794257 298712909 297705829 296765417
3279.7 296765417 295850664 294956356 294069737 293215334 292502999 291902661 291216046 290369809 289419085 288482994
3300.1 288482994 287740380 287192106 286572158 285685688 284590364 283457786 282429814 281509817 280655980
3318.4 280655980 279843986 279066861 278316021 277451187 276426464 275427341 274548292 273770183 273086578
3336.8 273086578 272353679 271439433 270439863 269458443 268591464 267901540 267139435 266102225 265008688
3355.2 265008688 264102697 263379931 262674987 261937559 261364102 260899305 260183692 259112656 258020878
3373.5 258020878 257199466 256522924 255838573 255145580 254527152 254068345 253813595 253739595 253536820 252967477
3393.9 252967477 252363801 252180696 252242953 251959980 251280636 250740677 250526428 250404507 250249743 250017941
3414.3 250017941 249746293 249572963 249482036 249421760 249473348 249676958 249989256 250288874 250615001 251051068
3434.7 251051068 251336038 251295894 251228362 251443088 251888067 252344280 252734512 253189117 253757298 254362762
3455.1 254362762 255056202 255880117 256618738 257311821 258285642 259427130 260260195 260658383 261037350
3473.4 261037350 261719853 262740999 263802201 264573485 265338033 266365796 267373681 268278509 269326478
3491.8 269326478 270492077 271650434 272757560 273836166 274897665 275851667 276739329 277759254 279026806
3510.2 279026806 280472875 281815469 282880753 283915311 285178185 286636800 287998497 289107680
3526.5 289107680 290206939 291554600 293138027 294812262 296363503 297767699 299362302 301205218
3542.8 301205218 302943021 304450750 306056589 307839811 309705257 311734945 313949198 316307485
3559.1 316307485 318751663 321078628 323171109 325653374 328885943 332101434 335008234 337967277
3575.4 337967277 341121584 344505429 348192126 351899296 355230540 358493477 362316459 366246194
3591.7 366246194 370022416 374026239 378294051 382568300 386844039 391018629 394898832 398866862
3608.1 398866862 403198153 407625288 412128150 416514993 420781076 425518304 430380672 434799850
3624.4 434799850 438620001 442449927 447293878 452195227 456789851 461355031 465786189 470133096
3640.7 470133096 474455029 478474826 482112318 486236185 491369128 496128947 500130117 504402816
3657 504402816 508940399 513001204 516762376 520504832 523909330 527114511 530799448 534208119 537368953
3675.4 537368953 541180611 544864118 548184395 551376641 554296136 556983709 559699059 562537432
3691.7 562537432 565335512 567946553 570301175 572429061 574598014 577010512 579293609 581111133
3708 581111133 582625568 584515214 586944520 589173019 591032565 592714131 594315112 595889270 597584903
3726.4 597584903 599414170 600996435 602230847 603462160 605169415 607120335 608492911 608965278
3742.7 608965278 609610021 611197233 612326145 613119721 614800453 616708815 618068516 619193673 620559216
3761 620559216 621879339 622998595 624070108 625091791 626294792 627626657 628790736 629764974 630679548
3779.4 630679548 631660283 632592380 633568048 634672880 635713577 636614144 637348115 638058186 638909757
3797.7 638909757 639567375 640308321 641407192 642170846 643017471 644235909 645189941 645615518 646039724
3816.1 646039724 646799147 647401392 648362696 649542034 650343299 651046216 651684582 652301788 652984560
3834.4 652984560 653479517 653923571 654615462 655428350 656355739 657241821 657767951 657650232 657293379 658250272
3854.8 658250272 659753680 660619736 661020815 661280632 661776483 662352026 662739992 663350046 664045393
3873.2 664045393 664705396 665273368 665548682 666043580 666663289 667116642 667685390 668073773 668408573 669125974
3893.6 669125974 669722974 669850171 669884205 670101404 670521736 671251893 671936750 672311008 672572255 672790408
3914 672790408 672919750 673126221 673542798 673921704 674116790 674391627 674717724 674892187 675224721 675818145
3934.4 675818145 676232755 676363826 676418245 676583886 676888824 677140832 677368999 677724183 678063333 678254128
3954.8 678254128 678415537 678697467 679051638 679371059 679627001 679823220 679989576 680134237 680290401 680505693
3975.2 680505693 680743158 680943787 681175530 681472182 681716084 681868553 682001829 682154953 682306468 682465613
3995.6 682465613 682669759
3997.6 682669759
##END=$$ End of the data block
