##TITLE=$$ Begin of the data block
##JCAMP-DX=5.00 $$ ACD/SpecManager v 10.08
##SPECTROMETER/DATA SYSTEM=Alpha
##DATE=29 Dec 2014 15:06:02
##DATA TYPE=INFRARED SPECTRUM
##DATA CLASS=XYDATA
##ORIGIN=
##OWNER=
##NPOINTS=1765
##FIRSTX=399.76428223
##LASTX=3997.64306641
##MAXX=3997.64306641
##MINX=399.76428223
##MAXY=0.83427125
##MINY=0.17844944
##XFACTOR=1.0000000000
##YFACTOR=1.000000000000000e-9
##FIRSTY=0.52454573
##DELTAX=2.03961372
##XUNITS=1/CM
##YUNITS=ARBITRARY UNITS
##XYDATA=(X++(Y..Y))
399.8E24545729n963623n016625l323138j122952R09329K048433J992345J002729k59758
$$ 524545729 518582106 513565481 510242343 509119391 510028720 512077153 514069498 515072227 514812469
418.1E14812469q46683j216829k277613l238380l684938l663003l194183k801061k251595
$$ 514812469 513965786 512748957 510471344 507232964 503548026 499885023 496690840 493889779 491638184
436.5D91638184q54612J399070M057586N676777N493164M424989K925515J320899J67012
$$ 491638184 490783572 492182642 496240228 501917005 507410169 511835158 514760673 516081572 516248584
454.8E16248584l09348l83914p46429j912594l269493l972352l917634l623158l389746
$$ 516248584 515939236 515555322 514808893 512896299 509626806 505654454 501736820 498113662 494723916
473.2D94723916k973735k660811k465189j975417r70840K07960O57141J28478r38803
$$ 494723916 491750181 489089370 486624181 484648764 483677924 483885884 484543025 484671503 483732700
491.5D83732700j825481j968861j673967j600474k079844k894312l618360l964752
$$ 483732700 481907219 479938358 478264391 476663917 474584073 471689761 468071401 464106649
507.9D64106649l797144l728270m219920n022019n587518n340457m342139k959579
$$ 464106649 460309505 456581235 452361315 447339296 441751778 436411321 432069182 429109603
524.2D29109603j530707n33163j14620L74138J652390L794670O018460P138044O293714
$$ 429109603 427578896 427045733 426931113 427305251 428957641 432752311 438770771 445908815 452202529
542.5D52202529L912776J702488L79294n20289j295417k207816l400505m692733n526841
$$ 452202529 456115305 457817793 458197087 457676798 456381381 454173565 450773060 446080327 440553486
560.9D40553486n947500o689102p692486q132606p391543n195379j923770J511425
$$ 440553486 434605986 427916884 420224398 412091792 404700249 399504870 397581100 399092525
577.2C99092525M477978O763339Q054704Q093446P233083N948693M448622K735108
$$ 399092525 403570503 410333842 418388546 426481992 433715075 439663768 444112390 446847498
593.5D46847498J094312q7857n85378m54902p6503K99990N21809O45191Q55982J385272
$$ 446847498 447941810 447853953 447268575 446813673 446737170 447037160 447558969 448204160 449060142 450445414
613.9D50445414K398997L641963M441440M547954M259854L830880L611744L599107
$$ 450445414 452844411 456486374 460927814 465475768 469735622 473566502 477178246 480777353
630.2D80777353L475338K943695K027184J294285J108795J371622J767785J849472
$$ 480777353 484252691 487196386 489223570 490517855 491626650 492998272 494766057 496615529
646.6D96615529J545280J164586R63091J060069J373351J621306J504779J078367P50839
$$ 496615529 498160809 499325395 500288486 501348555 502721906 504343212 505847991 506926358 507677197
664.9E07677197R92477J764357J966417K022207J984596J505435J215875J483619J865566
$$ 507677197 508669674 510434031 512400448 514422655 516407251 517912686 519128561 520612180 522477746
683.3E22477746J831234J302719N02944l49224j132965j718998k260089k933383l556192
$$ 522477746 524308980 525611699 526114643 525765419 524632454 522913456 520653367 517719984 514163792
701.6E14163792l813803l373265k055586j66356J756251L265857M253447M981339N805612
$$ 514163792 510349989 506976724 504921138 504754782 506511033 509776890 514030337 519011676 524817288
720E24817288O692171P281721P369399O893337N994260M960477M109800L610194L143787
$$ 524817288 531509459 538791180 546160579 553053916 559048176 564008653 568118453 571728647 574872434
738.3E74872434K247214Q19982q19028k371132l611624m417778m956603n464792n907774
$$ 574872434 577119648 577939630 577120602 574749470 571137846 566720068 561763465 556298673 550390899
756.7E50390899n972922n249560l691971j591623Q62480L390967N690039P685542R396910
$$ 550390899 544417977 539168417 535476446 533884823 534747303 538138270 543828309 551513851 560910761
775.1E60910761J0613144J0898590J0088622Q516372O835878N567133M923523M734814
$$ 560910761 571523905 582422495 592511117 601027489 607863367 613430500 618354023 623088837
791.4F23088837M701018M708707M733980M794240M765332M463315L958523L336966
$$ 623088837 627789855 632498562 637232542 642026782 646792114 651255429 655213952 658550918
807.7F58550918K505183J619578J033723Q31604P64430N02646j92464j356840k718687
$$ 658550918 661056101 662675679 663709402 664541006 665305436 665808082 665615618 664258778 661540091
826F61540091l842473m630685n259096n817891o269097o428063o252527n763888n043567
$$ 661540091 657697618 653066933 647807837 641989946 635720849 629292786 623040259 617276371 612232804
844.4F12232804m393995m175722m566312n291820n942165o315828n723655k909243
$$ 612232804 607838809 603663087 599096775 593804955 587862790 581546962 575823307 572914064
860.7E72914064K163470P516503J1346579J3579964J4524877J3922811J1601269P969916
$$ 572914064 575077534 582594037 593940616 607520580 622045457 635968268 647569537 655539453
877F55539453L910899J99616k775490m862368o202340p007838p308781p160663o644488
$$ 655539453 659450352 659649968 656874478 652012110 645809770 638801932 631493151 624332488 617688000
895.4F17688000n912304n402744n521833o232441p278860q443713r590208j0680080
$$ 617688000 611775696 606372952 600851119 594618678 587339818 578896105 569305897 558625817
911.7E58625817j1606633j2137294j1890054j0477900p971645n056798k561897q33482
$$ 558625817 547019184 534881890 522991836 512513936 504542291 499485493 496923596 496090114
928D96090114L95298J554936K817601M129350N378724O448567O850779N544602K036214
$$ 496090114 496485412 498040348 500857949 504987299 510366023 516814590 523665369 529209971 531246185
946.4E31246185k772510p454097j1170447j3837844j5779853j7303437j8487930j9385040
$$ 531246185 528473675 521019578 509849131 496011287 480231434 462927997 444440067 425055027
962.7D25055027k0155877k0896882k1596014k2184730k2525757k2431553k1689981
$$ 425055027 404899150 384002268 362406254 340221524 317695767 295264214 273574233
977B73574233k0225644j8118724j5512601j2617096r708032p074371m863262l084928
$$ 273574233 253348589 235229865 219717264 207100168 197392136 190317765 185454503 182369575
993.3A82369575j685113o20737J43229N57781N70446K54124k46256p41154j017526
$$ 182369575 180684462 180063725 180206954 180764735 181335181 181589305 181343049 180601895 179584369
1011.6A79584369q60557k74375N59002J421809K215192K988815L686443M115835M224554
$$ 179584369 178723812 178449437 179008439 180430248 182645440 185634255 189320698 193436533 197661087
1030A97661087M088476L660023K875880J872003J034379O27994O59347J009479J676068
$$ 197661087 201749563 205409586 208285466 210157469 211191848 211819842 212479189 213488668 215164736
1048.4B15164736K861962M518002O274864P796466R088934J0393664J1605352J1765421
$$ 215164736 218026698 222544700 228819564 236616030 245704964 256098628 267703980 279469401
1064.7B79469401R212315K840489n626828j1848956j2775034r343624m746943j001373
$$ 279469401 288681716 291522205 285895377 274046421 261271387 251927763 247180820 246179447
1081B46179447J720026L711611N147487O259560P166207P630318P269145N961507M056692
$$ 246179447 247899473 251611084 256758571 263018131 270184338 277814656 285083801 291045308 295102000
1099.4B95102000K186090J042992J095533K233625L684818M693836N013287M705966
$$ 295102000 297288090 298331082 299426615 301660240 305345058 310038894 315052181 319758147
1115.7C19758147L994435L095359K263426J917065K381593L514260M758894N255699
$$ 319758147 323752582 326847941 329111367 331028432 333410025 336924285 341683179 346938878
1132C46938878M213184J523108k147824n732745q343786r612262r653717q799494p348209
$$ 346938878 351152062 352675170 350527346 344794601 336450815 326838553 317184836 308385342 301037133
1150.3C01037133n527914l563553j600653L12299K252876M396409O762296R258390
$$ 301037133 295509219 291945666 290345013 290657312 292910188 297306597 304068893 313327283
1166.7C13327283J1683732J3765216J5335589J6333610J6736806J6662091J6251385
$$ 313327283 325011015 338776231 354111820 370445430 387182236 403844327 420095712
1180.9D20095712J5481323J4324635J2786150J0848314Q566111O196261M145890K745748
$$ 420095712 435577035 449901670 462687820 473536134 482102245 488298506 492444396 495190144
1197.3D95190144K035677J866549K051086K434611L037512L908217M925132N777538
$$ 495190144 497225821 499092370 501143456 503578067 506615579 510523796 515448928 521226466
1213.6E21226466O085336N631030M454016K847970J244843n0009r74595j615346k069890
$$ 521226466 527311802 532942832 537396848 540244818 541489661 541439652 540465057 538849711 536779821
1231.9E36779821k355456k405942k162278j618623q37565N2452R08971J600623K082288
$$ 536779821 534424365 532018423 529856145 528237522 527399957 527452409 528361380 529962003 532044291
1250.3E32044291K382398K465844K242983J734316J168132Q73983J101196J806020
$$ 532044291 534426689 536892533 539135516 540869832 542037964 542911947 544013143 545819163
1266.6E45819163K546132K765715K252817J245499K12610m90845q23438r34779j021982
$$ 545819163 548365295 551131010 553383827 554629326 554841936 554351091 553527653 552592874 551570892
1285E51570892j208722j460850j679540j849294k048790k306223k555907k718031k745629
$$ 551570892 550362170 548901320 547221780 545372486 543323696 541017473 538461566 535743535 532997906
1303.3E32997906k674281k513349k168775j771331j588106j628339j770318j929998
$$ 532997906 530323625 527810276 525641501 523870170 522282064 520653725 518883407 516953409
1319.6E16953409k279640l216683m707039o106496o789088o577015n622744m277349
$$ 516953409 514673769 511457086 506750047 500643551 493854463 487277448 481654704 477377355
1336D77377355k888054j585245m71830K41548N94735O58721M31686L5525m53145q83072
$$ 477377355 474489301 472904056 472432226 472673774 473268509 473927230 474358916 474394441 473941296 473058224
1356.4D73058224j098752j153440j040577o03438k56956j55717J54943P26074J350730
$$ 473058224 471959472 470806032 469765455 469162017 468905061 468749344 468904287 469630361 470981091
1374.7D70981091J658291J617253J565486J916170K954841M475444N133659M171222
$$ 470981091 472639382 474256635 475822121 477738291 480693132 485168576 490302235 494473457
1391D94473457K668560J091957k40922j108915j398444j539349j901627k054602k189487
$$ 494473457 497142017 498233974 497993052 496884137 495485693 493946344 492044717 489990115 487800628
1409.4D87800628k373636k123415j551867j222998q71747r4474M94927Q92192J259029
$$ 487800628 485426992 483303577 481751710 480528712 479656965 479562491 480057418 480949610 482208639
1427.7D82208639J610727J953810K032250K101988K337664K232790K085388J823365
$$ 482208639 483819366 485773176 487805426 489907414 492245078 494477868 496563256 498386621
1444.1D98386621J195550K44678o57142j231312j636178k530306k453953j95682J303196
$$ 498386621 499582171 499826849 499169707 497938395 496302217 493771911 491317958 491122276 492425472
1462.4D92425472K723276M510284N765766P559180J1083424J2466371J0901332R562671
$$ 492425472 495148748 499659032 505424798 512983978 524067402 536533773 547435105 556997776
1478.7E56997776Q862674Q456648P629454P098853P159114O869078N465209M643977
$$ 556997776 565860450 574317098 581946552 589045405 596204519 603073597 608538806 613182783
1495F13182783M927039M903555M270196L497720L105819L480733L296971K786755K627433
$$ 613182783 618109822 623013377 627283573 630781293 633887112 637367845 640664816 643451571 646079004
1513.4F46079004K471387K389074K154707K095938K148986K060771K115786J905561
$$ 646079004 648550391 650939465 653094172 655190110 657339096 659399867 661515653 663421214
1529.7F63421214J484930J175523J081884R15348Q54969R59576Q70883O16729K85983
$$ 663421214 664906144 666081667 667163551 668078899 668933868 669893444 670764327 671381056 671667039
1548.1F71667039P8857J05918J78158l0875r63986j341045l86715l98278o07968q46624
$$ 671667039 671745896 671851814 672029972 671999097 671035111 669694066 669307351 668909073 668301105 667454481
1568.5F67454481j101613r25481j254559j924574j415134r38832j242519j651287k011597
$$ 667454481 666352868 665427387 664172828 662248254 660833120 659894288 658651769 657000482 654988885
1586.8F54988885k245188k318084k268970k296388k485276k802550l151477l312051
$$ 654988885 652743697 650425613 648156643 645860255 643374979 640572429 637420952 634108901
1603.2F34108901l290355l315926l564119l727377l751099m480004n283177l897846
$$ 634108901 630818546 627502620 623938501 620211124 616460025 611980021 606696844 602798998
1619.5F02798998l184139l921807l976703l835916l630817k678216k177954k381801
$$ 602798998 599614859 595693052 591716349 587880433 584249616 581571400 579393446 577011645
1635.8E77011645j476228m79043j72436R9957N80251J555920J976788K170741L214360
$$ 577011645 575535417 575056374 574883938 574983895 575564146 577120066 579096854 581267595 584481955
1654.1E84481955L328383L191828L647626M447102M838407M299701M371821N131543
$$ 584481955 587810338 591002166 594649792 599096894 603935301 608235002 612606823 617738366
1670.5F17738366N027831N406439O086767N523562M872501N117297O655693O287396
$$ 617738366 622766197 628172636 634259403 639782965 644655466 649772763 656428456 662715852
1686.8F62715852N273104N238950M529834M143417M063606L793717M175603L506243
$$ 662715852 667988956 673227906 677757740 681901157 685964763 689758480 693934083 697440326
1703.1F97440326K724290K542377K174019J965642K008796K230704K810776K880097
$$ 697440326 700164616 702706993 704881012 706846654 708855450 711086154 713896930 716777027
1719.4G16777027K226233J940847K097189K177477K182484K016663J962781J963317
$$ 716777027 719003260 720944107 723041296 725218773 727401257 729417920 731380701 733344018
1735.7G33344018J656712J751899K171457K426207K429903K314031K481878K824545
$$ 733344018 735000730 736752629 738924086 741350293 743780196 746094227 748576105 751400650
1752G51400650K730190K687097K709091K364814K103686J843274J591742J578808J609683
$$ 751400650 754130840 756817937 759527028 761891842 763995528 765838802 767430544 769009352 770619035
1770.4G70619035J687884J617193J222015R44137R83119J197100J328826J244545R19819
$$ 770619035 772306919 773924112 775146127 776090264 777073383 778270483 779599309 780843854 781763673
1788.8G81763673O33538P82847J052082J118898J091778R77159P87139O40511O89268
$$ 781763673 782397211 783180058 784232140 785351038 786442816 787419975 788207114 788847625 789536893
1807.1G89536893Q94666J096130J048088P64310M90546M40538N50091O94156Q21471
$$ 789536893 790431559 791527689 792575777 793340087 793830633 794271171 794821262 795515418 796336889
1825.5G96336889O79553M06503L51370M13775N03362O61253O20783K84016j7166J02699
$$ 796336889 797016442 797422945 797774315 798188090 798691452 799352705 799973488 800257504 800240338 800343037
1845.9H00343037L64720M79162M99964L68178J44482J0192O5148K10285L20971K70128
$$ 800343037 800707757 801186919 801686883 802055061 802199543 802209735 802274883 802485168 802806139 803076267
1866.3H03076267J41740J58191K20418K77340M08709N13315M59850L24548K30431K02775
$$ 803076267 803218007 803376198 803596616 803873956 804282665 804795980 805255830 805580378 805810809 806013584
1886.7H06013584K60711M31776M77016L25203J92582J08183Q6427J48654K33113K48969
$$ 806013584 806274295 806706071 807183087 807508290 807700872 807809055 807895482 808044136 808277249 808526218
1907.1H08526218J74165O3359k5928m4763N8651K65360K98977J72019Q3268N8412J08123
$$ 808526218 808700383 808763742 808737814 808693051 808751702 809017062 809316039 809488058 809571326 809629738 809737861
1929.5H09737861J94252K31743J73509N4717o3658n5790J49965L40462L57330K49743
$$ 809737861 809932113 810163856 810337365 810392082 810328424 810272634 810422599 810763061 811120391 811370134
1949.9H11370134R4414K3902J13964K75790L71993K95758J14322L099N5492J93179
$$ 811370134 811464548 811488450 811602414 811878204 812250197 812545955 812660277 812663376 812718868 812912047
1970.3H12912047K83420K75075J84596P9095J2577K1875Q5175J34826R8466N186k3365
$$ 812912047 813195467 813470542 813655138 813734233 813746810 813768685 813853860 813988686 814087152 814092338 814068973
1992.7H14068973l159q34J9609L3737j2160r9122k11656k78354k67088k47956k78949
$$ 814068973 814065814 814064980 814084589 814118326 814106166 814007044 813795388 813517034 813249946 813001990 812723041
2015.2H12723041l44396m24027n27680o34730o08623l45469j57475k59996m10974m67121
$$ 812723041 812378645 811954618 811426938 810792208 810183585 809838116 809680641 809420645 809009671 808542550
2035.6H08542550m63248m09484l29077k80261k70545k73526k60294k11298j22726m0114
$$ 808542550 808079302 807669818 807340741 807060480 806789935 806516409 806256115 806044817 805922091 805881977
2056H05881977J1802L9816K7358J8656O5089J30653J41144J03474M1604n663L576N3466
$$ 805881977 805893779 805933595 805960953 805979609 806044698 806175351 806316495 806419969 806461573 806455910 806459486 806512952
2080.4H06512952J07109J30892J23024R6917P2837O1631J04368J98126K71201K67625
$$ 806512952 806620061 806750953 806873977 806970894 807043731 807105362 807209730 807407856 807679057 807946682
2100.8H07946682J96516J15574P8082J15156J79947K12013J86205R3341j3649n2095
$$ 807946682 808143198 808258772 808336854 808452010 808631957 808843970 809030175 809123516 809109867 809057772
2121.2H09057772k622J00612J61052R1135m9591j17540m5240Q4281J79529J78457O0141
$$ 809057772 809055150 809155762 809316814 809407949 809358358 809240818 809195578 809279859 809459388 809637845 809697986
2143.7H09697986q3089j21474Q94J91509K85864K19763J00433O3777J81616L91185
$$ 809697986 809614897 809493423 809494317 809685826 809971690 810191453 810291886 810355663 810537279 810928464
2164.1H10928464N10395M87566M38094M05192L98338M87089O02961O49511N88119M42207
$$ 810928464 811438859 811926425 812364519 812769711 813168049 813655138 814258099 814907610 815495729 815937936
2184.5H15937936L48091L80040M72307N25713N29826M72426L30746K53856L63231N36382
$$ 815937936 816286027 816666067 817138374 817664087 818193913 818666339 818997085 819250941 819614172 820150554
2204.8H20150554O06954N15580L45827K50399K86758M11033N20289N31972M17947K49804
$$ 820150554 820757508 821273088 821618915 821869314 822156072 822567105 823087394 823619366 824037313 824287117
2225.2H24287117J73985K41101L57569M11331L60668K37226J39177J41561K26379K84671
$$ 824287117 824461102 824702203 825059772 825471103 825831771 826068997 826208174 826349735 826576114 826860785
2245.6H26860785K60592K17915J75654J11819J12414K32339L45886L55899K73168J52350
$$ 826860785 827121377 827339292 827514946 827626765 827739179 827971518 828317404 828673303 828946471 829098821
2266H29098821P7486J20759K26736K97308L08811K31505J12295O9380J35481K49863
$$ 829098821 829176307 829297066 829523802 829821110 830129921 830361426 830473721 830543101 830678582 830928445
2286.4H30928445L30746K98321J53840L6478L0041R6500J87039K60115K63512J83224
$$ 830928445 831259191 831557512 831711352 831747830 831777871 831874371 832061410 832321525 832585037 832768261
2306.8H32768261Q4162P4506J52051K14577K48850K32815J14084R358K7060R1255J39355
$$ 832768261 832852423 832926929 833078980 833293557 833542407 833775222 833889306 833898664 833925724 834016979 834156334
2329.3H34156334J14918k3126j59085j87993j73748j34766q6725l12447n86868m60743
$$ 834156334 834271252 834248126 834089041 833901048 833727300 833592534 833505809 833193362 832606494 832145751
2349.7H32145751o5744L38912N56826N15878J74761l48568o49750n75662m72426n09918
$$ 832145751 832080007 832418919 832975745 833491623 833666384 833317816 832668066 832092404 831619978 831110060
2370.1H31110060n99801o53506o47545o03973m80116l13222k13206k06113k87831l91960
$$ 831110060 830510259 829856753 829209208 828605235 828125119 827811897 827598691 827392578 827104747 826712787
2390.4H26712787l75211k39194j20818j25289k44856l83794m60983m25219l09289k55823
$$ 826712787 826337576 826098382 825977564 825852275 825607419 825223625 824762642 824337423 824028134 823772311
2410.8H23772311l37243m70638n68986n94676n51164m80830m55320n28694o53028p33674
$$ 823772311 823435068 822964430 822395444 821800768 821249604 820768774 820313454 819784760 819131732 818398058
2431.2H18398058p07149o11007n26309n07355o13689p84040q46684p38442n64217m78328
$$ 818398058 817690909 817079902 816553593 816046238 815432549 814648509 813801825 813063383 812499166 812020838
2451.6H12020838n32806o55889p53880p48753o26982m91976m61877n39601o57975p17879
$$ 812020838 811488032 810832143 810078263 809329510 808702528 808210552 807748675 807209074 806551099 805833220
2472H05833220o57975n48780m62294m47988n17071o03854o11186m88818l23176k59877
$$ 805833220 805175245 804626465 804164171 803716183 803199112 802595258 801984072 801495254 801172078 800912201
2492.4H00912201l35931m50910m87446m45843l68297k62916k03610k66671l94285m67300
$$ 800912201 800576270 800125360 799637914 799192071 798823774 798560858 798357248 798090577 797696292 797228992
2512.8G97228992m52757l88980l33845l85642n05925n63323n75066n97477n92887n61476
$$ 797228992 796776235 796387255 796053410 795667768 795161843 794598520 794023454 793425977 792833090 792271614
2533.2G92271614n88238o90878p82013q01682p40945o12021n50032o54459q20994q86798
$$ 792271614 791683376 790992498 790210485 789408803 788667858 788055837 787505805 786851346 786030352 785143554
2553.6G85143554p93338o47544n68092n82695o69837p57039p57635o84917o11364n67675
$$ 785143554 784350216 783702672 783134580 782551885 781882048 781125009 780367374 779682457 779071093 778503418
2574G78503418n89490o98030p96556p57456o13094m85062m53115n13017n83827n95212
$$ 778503418 777913928 777215898 776419342 775661886 775048792 774563730 774110615 773597598 773013771 772418559
2594.4G72418559n18203l97444l26395l78191n54860p35819p67351o71625o14464o93202
$$ 772418559 771900356 771502912 771176517 770798326 770243466 769507647 768740296 768068671 767454207 766761005
2614.8G66761005q72731j041055j112878j089871j021266r90689j100540j307309j421332
$$ 766761005 765888274 764847219 763734341 762644470 761623204 760632515 759531975 758224666 756803334
2633.2G56803334j363397j247704j207292j230419j271903j350939j404405j338899
$$ 756803334 755439937 754192233 752984941 751754522 750482619 749131680 747727275 746388376
2649.5G46388376j220525j180112j221359j273155j290381j237333j154780j123786
$$ 746388376 745167851 743987739 742766380 741493225 740202844 738965511 737810731 736686945
2665.8G36686945j119912j140058j183152j139879j033724r72747r41694r23157r50634
$$ 736686945 735567033 734426975 733243823 732103944 731070220 730097473 729155779 728232622 727281988
2684.1G27281988j028061j095474j081228j013041j004517j084745j165926j216114
$$ 727281988 726253927 725158453 724077225 723064184 722059667 720974922 719808996 718592882
2700.5G18592882j254260j250327j225114j239836j267910j264393j235843j204431
$$ 718592882 717338622 716088295 714863181 713623345 712355435 711091042 709855199 708650768
2716.8G08650768j178980j121998j071513j086056j043141r57906r40859r06885q49187
$$ 708650768 707471788 706349790 705278277 704192221 703149080 702191174 701250315 700343430 699494243
2735.1F99494243q33392q51274q75413q70884q50022q10325p45177p24971p50900p39634
$$ 699494243 698660851 697809577 696934164 696063280 695213258 694402933 693657756 692932785 692181885 691442251
2755.5F91442251p10726o94990o53803n93960n86450o79076p85709q25464q23081q13365
$$ 691442251 690731525 690036535 689382732 688788772 688202322 687523246 686737537 685912073 685088992 684275627
2775.9F84275627q63314r63211j059234j173794j266181j298190j320600j361609j461208
$$ 684275627 683412313 682449102 681389868 680216074 678949893 677651703 676331103 674969494 673508286
2794.3F73508286j624345j750589j781821j775205j834214j966834k095818k201558
$$ 673508286 671883941 670133352 668351531 666576326 664742112 662775278 660679460 658477902
2810.6F58477902k262532k281428k324938k420009k561390k731264k850830k869010
$$ 658477902 656215370 653933942 651609004 649188995 646627605 643896341 641045511 638176501
2826.9F38176501k883733k979576l121972l306210l538132l774047l993094m224658
$$ 638176501 635292768 632313192 629191220 625885010 622346878 618572831 614579737 610355079
2843.2F10355079m501343m744052m742206m334211l646076l048300k760709k801537
$$ 610355079 605853736 601109684 596367478 592033267 588387191 585338891 582578182 579776645
2859.5E79776645l192067l833771m509926n109251n609810o006241o317913o486178
$$ 579776645 576584578 572750807 568240881 563131630 557521820 551515579 545197666 538711488
2875.9E38711488o353914n871892n149603m311979l444314k629519j919925j333654
$$ 538711488 532357574 526485682 521336079 517024100 513579786 510950267 509030342 507696688
2892.2E07696688r25600p43986p55131q89778j160979j532257j893818k293825k833069
$$ 507696688 506771088 506027102 505271971 504382193 503221214 501688957 499795139 497501314 494668245
2910.5D94668245l497779m176050m646183m738837m501432m043639l437728k665072
$$ 494668245 491170466 486994416 482348233 477609396 473107964 469064325 465626597 462961525
2926.8D62961525j664371m93645Q15421K259523L676384M853428N724549O328792O694346
$$ 462961525 461297154 460803509 461618930 463878453 467554837 472408265 478132814 484461606 491155952
2945.2D91155952O874681O991058P095456P114232P024884O890774O744206O502569
$$ 491155952 498030633 505021691 512117147 519231379 526256263 533147037 539891243 546393812
2961.5E46393812O096661N613625N179643M830301M580438M430473M309833M203558
$$ 546393812 552490473 558104098 563283741 568114042 572694480 577124953 581434786 585638344
2977.8E85638344M064799L780543L418863L094018K792895K536237K266049J878202
$$ 585638344 589703143 593483686 596902549 599996567 602789462 605325699 607591748 609469950
2994.2F09469950J517415J201988Q31484N01275J89424j66059m76777p26223j021564
$$ 609469950 610987365 612189353 613020837 613522112 613711536 613545477 613068700 612342477 611320913
3012.5F11320913j370251j646579j834571j990438k123594k282262k447903k507090
$$ 611320913 609950662 608304083 606469512 604479074 602355480 600073218 597625315 595118225
3028.8E95118225k517343k599955k759754k904058k892852k842724k946675l124833
$$ 595118225 592600882 590000927 587241173 584337115 581444263 578601539 575654864 572530031
3045.1E72530031l227651l184140l124594l187299l241241l257215l300250l299772
$$ 572530031 569302380 566118240 562993646 559806347 556565106 553307891 550007641 546707869
3061.5E46707869l238202l181040l239989l363729l387451l314256l169179l065765
$$ 546707869 543469667 540288627 537048638 533684909 530297458 526983202 523814023 520748258
3077.8E20748258l149987l302693l396213l443301l387213l283262l315389l387332
$$ 520748258 517598271 514295578 510899365 507456064 504068851 500785589 497470200 494082868
3094.1D94082868l310561l153771l145308l293454l307462l147840l074944l170461
$$ 494082868 490772307 487618536 484473228 481179774 477872312 474724472 471649528 468479067
3110.4D68479067l173143l027469l009289l091872l204763l342718l296315l101409
$$ 468479067 465305924 462278455 459269166 456177294 452972531 449629813 446333498 443232089
3126.7D43232089k993852l019690l062725k974183k825707k832889k980084l020227
$$ 443232089 440238237 437218547 434155822 431181639 428355932 425523043 422542959 419522732
3143D19522732k913266k809137k695143k621562k734690k891213k840430k684861k608091
$$ 419522732 416609466 413800329 411105186 408483624 405748934 402857721 400017291 397332430 394724339
3161.4C94724339k589762k576172k553135k528370k478093k417207k399087k385914
$$ 394724339 392134577 389558405 387005270 384476900 381998807 379581600 377182513 374796599
3177.7C74796599k331257k304882k287477k196938k106487k095461k134860k166420
$$ 374796599 372465342 370160460 367872983 365676045 363569558 361474097 359339237 357172817
3194C57172817k157748k070606j969993j943677j932860j911163j902044j859158j757443
$$ 357172817 355015069 352944463 350974470 349030793 347097933 345186770 343284726 341425568 339668125
3212.4C39668125j658678j623929j671076j726925j695394j617849j550108j482398
$$ 339668125 338009447 336385518 334714442 332987517 331292123 329674274 328124166 326641768
3228.7C26641768j388877j315505j432866j577943j480311j338542j307517j265019
$$ 326641768 325252891 323937386 322504520 320926577 319446266 318107724 316800207 315535188
3245C15535188j242847j305758j286269j148730j086205j150966j193434j112163j002997
$$ 315535188 314292341 312986583 311700314 310551584 309465379 308314413 307120979 306008816 305005819
3263.4C05005819r63122q91238p91699q62807j004488j049607j035572r61721q79704
$$ 305005819 304042697 303151459 302359760 301496953 300492465 299442858 298407286 297445565 296565861
3281.7B96565861q38221q41438q73387p99716o78420p14600q54552r51498r10849p05510
$$ 296565861 295727640 294886202 294012815 293213099 292534679 291820079 290965527 290014029 289103180 288397670
3302.1B88397670n26637o31303r36985j149565j133591r69588q59201q57443q72522
$$ 288397670 287871033 287239730 286302745 285153180 284019589 283050001 282190800 281333357 280460835
3320.5B80460835q21084p66009q72434j012682r87679q96096q12829p22885p60049
$$ 280460835 279639751 278873742 278001308 276988626 276000947 275104851 274292022 273569137 272809088
3338.8B72809088r20355r78291r61185r00566p43181p56293r68367j037568q89719
$$ 272809088 271888733 270910442 269949257 269048691 268305510 267549217 266580850 265543282 264653563
3357.2B64653563p27832p18027p61718o54071n58973p63982j088619j075149p61002
$$ 264653563 263925731 263207704 262445986 261791915 261232942 260468960 259380341 258305192 257544190
3375.5B57544190n87106o06626o76155o65009n13316k62677m7803k09570o07461o45429
$$ 257544190 256957084 256350458 255674303 255009294 254495978 254233301 254185498 253975928 253368467 252723038
3395.9B52723038k40981K1845k79486o30886m58985j68085j45764j82747k14488k62022
$$ 252723038 252482057 252503902 252224416 251593530 251134545 250966460 250820696 250637949 250423461 250161439
3416.3B50161439k14487j18107m6953M9755K19583L50684K90841K80440L91126K78562
$$ 250161439 249946952 249828845 249781892 249831647 250051230 250401914 250692755 250973195 251364321 251642883
3436.7B51642883j9640q4072J75804M22567M81009M53979M70191N28425O10233P61807
$$ 251642883 251623243 251539171 251714975 252137542 252618551 253072530 253542721 254071146 254681379 255443186
3457.1B55443186Q61913P09593O44982R59813J157314Q40396L99798M09066P42883
$$ 255443186 256305099 257014692 257659674 258619487 259776801 260617197 261016995 261426061 262168944
3475.5B62168944J060545J070559P56503P43746J034111J014173Q97259J019895J117348
$$ 262168944 263229489 264300048 265056551 265800297 266834408 267848581 268745840 269765735 270883083
3493.8B70883083J122713J118005J150667J159609J010209Q78483R68605J206130J414299
$$ 270883083 272005796 273123801 274274468 275434077 276444286 277322769 278291374 279497504 280911803
3512.2B80911803J361877J144856J111537J267434J422345J323223J110792J149953
$$ 280911803 282273680 283418536 284530073 285797507 287219852 288543075 289653867 290803820
3528.5B90803820J382738J566738J659960J607686J494169J636595J813292J702488
$$ 290803820 292186558 293753296 295413256 297020942 298515111 300151706 301964998 303667486
3544.8C03667486J542240J659006J785696J841455K021551K223492K381355K453357
$$ 303667486 305209726 306868732 308654428 310495883 312517434 314740926 317122281 319575638
3561.1C19575638K306133K106488K533972L261983L245622K953113L006339L199756
$$ 319575638 321881771 323988259 326522231 329784214 333029836 335982949 338989288 342189044
3577.5C42189044L408938L658981L695160L393769L302455L818244L948092L775150
$$ 342189044 345597982 349256963 352952123 356345892 359648347 363466591 367414683 371189833
3593.8C71189833L981292M316479M355729M298597M210889L949374L956020M271746
$$ 371189833 375171125 379487604 383843333 388141930 392352819 396302193 400258213 404529959
3610.1D04529959M444271M561842M434913M350603M865259M911273M373640L803760
$$ 404529959 408974230 413536072 417970985 422321588 427186847 432098120 436471760 440275520
3626.4D40275520L869027M837811M873127M607349M575909M405528M327088M340351
$$ 440275520 444144547 448982358 453855485 458462834 463038743 467444271 471771359 476111710
3642.7D76111710M069954L688246M156679N136758M757077L994494M259825M584491
$$ 476111710 480181664 483869910 488026589 493163347 497920424 501914918 506174743 510759234
3659E10759234M123688L742576L670990L341079L154278L668487L404975L109336L807366
$$ 510759234 514882922 518625498 522296488 525637567 528791845 532460332 535865307 538974643 542782009
3677.4E42782009L782510L413618L218949K909601K643466K650797K876759K888143
$$ 542782009 546564519 549978137 553197086 556106687 558750153 561400950 564277709 567165852
3693.7E67165852K620339K304792K084971K181232K482235K328754J796067J414537
$$ 567165852 569786191 572090983 574175954 576357186 578839421 581168175 582964242 584378779
3710E84378779J792610K485156K360701J894415J623869J557290J519025J677095J895011
$$ 584378779 586171389 588656545 591017246 592911661 594535530 596092820 597611845 599288940 601183951
3728.4F01183951J622796J219988J203060J688719J959026J415074N53190P17044J586318
$$ 601183951 602806747 604026735 605229795 606918514 608877540 610292614 610845804 611562848 613149166
3746.7F13149166J145542Q60989J628637J769364J249075J045585J333654J326382
$$ 613149166 614294708 615155697 616784334 618553698 619802773 620848358 622182012 623508394
3763.1F23508394J139879J108527J077473J288534J394748J149833R14932Q91924J049161
$$ 623508394 624648273 625756800 626834273 628122807 629517555 630667388 631582320 632474244 633523405
3781.4F33523405J013875R49859J002789J005769R60648Q04126P69019Q88288O22988
$$ 633523405 634537280 635487139 636489928 637495697 638456345 639260471 640029490 640917778 641540766
3799.8F41540766O59466J034319P38800Q43524J229883J015484N13732M50731O96897
$$ 641540766 642200232 643234551 643973351 644816875 646046758 647062242 647575974 648026705 648723602
3818.1F48723602M97937R35019J250624Q59916P32243O39439N71013O22391N03123
$$ 648723602 649221539 650156558 651407182 652267098 652999341 653638780 654209793 654832184 655335307
3836.5F55335307N08666P33435Q28863R05513Q36492N27859l3558l31998Q47459J436591
$$ 655335307 655843973 656577408 657406271 658311784 659148276 659676135 659642577 659310579 660158038 661594629
3856.9F61594629Q29816L69430K95579N87046N92232L22938N86927P53999P41362O27160
$$ 661594629 662424445 662793875 663089454 663676500 664268732 664591670 665178597 665932596 666673958 667301118
3877.3F67301118L05295M86374N72145M18306N54740L28720K49922O88374N99444J23680
$$ 667301118 667606413 668092787 668664932 669083238 669637978 669966698 670216620 670904994 671504438 671628118
3897.7F71628118M2378K74599M86791P24733O98209M53472K88129J52528Q0168K54035
$$ 671628118 671670496 671945095 672431886 673156619 673854828 674308300 674596429 674748957 674829125 675083160
3918.1F75083160M73142L75509J83285K60830L08215J62065K67446N10752M08411J87040
$$ 675083160 675556302 675931811 676115096 676375926 676684141 676846206 677113652 677624404 678032815 678219855
3938.5F78219855R6619J76728L56614L02911J81377K79784L45886K83182K44975K68519
$$ 678219855 678316474 678493202 678849816 679152727 679334104 679613888 679959774 680242956 680487931 680756450
3958.9F80756450K77638K53737K60234K60532J91033J06931J13487K11715K80202K57254
$$ 680756450 681034088 681287825 681548059 681808591 681999624 682106555 682220042 682431757 682711959 682969213
3979.3F82969213K48909K70247K10524J12474R2744J43648J96874K28762K46704
$$ 682969213 683218122 683488369 683698893 683811367 683904111 684047759 684244633 684473395 684720099
3997.6F84720099
$$ 684720099
##END=$$ End of the data block
