##TITLE=$$ Begin of the data block
##JCAMP-DX=5.00 $$ ACD/SpecManager v 10.08
##SPECTROMETER/DATA SYSTEM=Alpha
##DATE=29 Dec 2014 11:22:02
##DATA TYPE=INFRARED SPECTRUM
##DATA CLASS=XYDATA
##ORIGIN=
##OWNER=
##NPOINTS=1765
##FIRSTX=399.76428223
##LASTX=3997.64306641
##MAXX=3997.64306641
##MINX=399.76428223
##MAXY=0.83513415
##MINY=0.28677350
##XFACTOR=1.0000000000
##YFACTOR=1.000000000000000e-9
##FIRSTY=0.56623775
##DELTAX=2.03961372
##XUNITS=1/CM
##YUNITS=ARBITRARY UNITS
##XYDATA=(X++(Y..Y))
399.8E66237748k562881q88586j045644j654685r95516J150727L024995L299594J611948
418.1E68177700k228796m071117k487838k30730j98364k738357n148768m713774j684189
436.5E44675767J466155L102005L398597K612531K166093L260314M369498L150522
452.8E68201482j51753k701759k824963j030385J70171q62121l463388n085289m087270
471.2E48164725j926601p09474j051843k449453l029883j390636J142085K110362P18236
489.5E41577518j859128l285647k425313o17087K20418j201451l883004m897356l581166
507.9E20047784j821816j664460l211677n085885n805970m464894j998306l60429m57018
526.2D95177329j389832j315176M56810L145516N278736N628228M408539L111243K829730
$$ y = [566237748, 563674867, 562786281, 561740637, 560085952, 559090436, 560241163, 563266158, 566565752, 568177700, 565948904, 561877787, 559389949, 559159219, 558960855, 556222498, 551073730, 546359956, 544675767, 546141922, 549243927, 552642524, 555255055, 557421148, 560681462, 565050960, 568201482, 568049729, 565347970, 562523007, 561492622, 561662793, 560800672, 557337284, 552251995, 548164725, 546238124, 545528650, 544476807, 542027354, 538997471, 537606835, 538748920, 540859282, 541577518, 539718390, 536432743, 534007430, 533390343, 533610761, 532409310, 528526306, 523628950, 520047784, 518225968, 516561508, 513349831, 508263946, 502457976, 497993082, 495994776, 495634347, 495177329, 493787497, 492472321, 492929131, 496074647, 501353383, 506981611, 511390150, 514501393, 517331123]
544.6E17331123L131092K383053j2934k670646l828883l165245k160668k443135m378498
562.9E04185259o780117p810414o601542m085154j831204m21345N96822K225458M915089
581.3D84392852P691562Q578390O755471L698707J509308J117647J755834J732647
597.6E17232418L33667j488328j986146n98908J431168K469897J825690N53191L92914
616E20165563J988172M216433N231976M370868K543569J470029K069593L493130L830850
634.3E49380183K292156K22743n47707M69446K171278K840161J794160k5451q00908
652.7E57796061L12507K135515K798498J664996k53141j266896K07066L678382L313660
671E70386648J399040J81675k72572Q37446K653539L331363K017081j96815j458287
$$ y = [517331123, 520462215, 522845268, 522832334, 520161688, 516332805, 513167560, 511006892, 508563757, 504185259, 497405142, 489594728, 482993186, 478908032, 477076828, 476655483, 477252305, 479477763, 484392852, 492084414, 500662804, 507418275, 511116982, 512626290, 513743937, 515499771, 517232418, 517566085, 516077757, 514091611, 513492703, 514923871, 517393768, 519219458, 519772649, 520165563, 522153735, 526370168, 531602144, 535973012, 538516581, 539986610, 542056203, 545549333, 549380183, 551672339, 551895082, 551347375, 551816821, 553988099, 556828260, 558622420, 558596969, 557796061, 558108568, 560244083, 563042581, 564707577, 564454436, 563187540, 563394606, 567072988, 570386648, 571785688, 571967363, 571694791, 572532237, 575185776, 578517139, 580534220, 580337405, 578879118]
689.4E78879118q93354M58359O37889j158476l579080m651367l606380j281440N16415
707.7E65321684Q31842M79222Q74042K606690M983842O675244O513655M863262L679335
726.1E96828818M171849N562543O044865M618645K065599K32875K81573J364707J478553
744.5F22650027m34994l326536n214512n143523l832102k897263l257334m205227m180431
762.8E90158105k200425J220703M378558N922913N981863N924821O964922Q683085
779.1F27034545R381831Q011996N240560K904773K583444M008591N262136M883588
795.4F69311464L310561K106786K393186L769636M607320L674567J436174k55585q1063
813.8F90273046J437843K435148J547456q48234l010869l449678k533794k058446l268659
$$ y = [578879118, 577985764, 578444123, 579082012, 577923536, 574344456, 569693089, 566086709, 564805269, 565321684, 566153526, 566632748, 567506790, 570113480, 575097322, 581772566, 588286221, 593149483, 596828818, 601000667, 606563210, 612608075, 617226720, 619292319, 619525194, 619806767, 621171474, 622650027, 622215033, 618888497, 613673985, 608530462, 604698360, 601801097, 598543763, 594338536, 590158105, 587957680, 589178383, 593556941, 599479854, 605461717, 611386538, 618351460, 627034545, 636416376, 644428372, 649668932, 652573705, 655157149, 659165740, 664427876, 669311464, 672622025, 674728811, 677121997, 680891633, 685498953, 689173520, 690609694, 690354109, 690273046, 691710889, 694146037, 695693493, 694845259, 691834390, 688384712, 685850918, 683792472, 680523813]
832.2F80523813n659104p525086p470965n403996k693593j610578k795100m316509
848.5F43048882m435896l460169k878189l529132m458070l445982O47187O209075J0508955
866.8F38206661J2237847J1572897R397090P137298N600154L999889J188040k633750
883.2F86706126n901337p100224o255150m940629m696846n640686o534457o200314
899.5F39436483m881024m006088m738152o876826r062111j0080219r817242r067178
915.8E80907643q575499q129239o942392m765749k151012J4126J178861J463830J488507
934.1E54489076K054930L497243N130052N566419L663122l95298m867375q182108j0396421
952.5E50559640j2365937j4425636j6146719j7037571j7222791j7339141j7950385
$$ y = [680523813, 674864709, 667339623, 659868658, 654464662, 651771069, 650160491, 647365391, 643048882, 638612986, 635152817, 632274628, 628745496, 624287426, 620841444, 621488631, 627697706, 638206661, 650444508, 662017405, 671414495, 678551793, 684151947, 688151836, 689339876, 686706126, 680804789, 673704565, 667449415, 662508786, 657811940, 652171254, 645636797, 639436483, 634555459, 630549371, 625811219, 618934393, 609872282, 599792063, 589974821, 580907643, 572332144, 564202905, 557260513, 552494764, 550343752, 550357878, 551536739, 553000569, 554489076, 556544006, 560041249, 565171301, 570737720, 574400842, 574005544, 569138169, 560956061, 550559640, 538193703, 523768067, 507621348, 490583777, 473360986, 456021845, 438071460]
966.8D38071460j8998594j9687354j9311965j8021732j6348332j4641017j2908816
981.1C18153650j0889143q502066n975157l580302j698971o29425j05083M04060J141399
999.4B88318962J795381J898498J346170M17889l84212o42478k60175M45962J095265
1017.8B94031262J559705J973987K520471L207058L802598L959536L554940K756417
1034.1C17365974J925171J342862J008660P91550O37322O43552J079052K171606L792256
1052.4C30758005N403996O518692P236987Q071303R286642J0062486Q486897L225625
1068.8C89050633m238934r843349j0585457p435739l484309n08338J381069K691120
1085.1C57026696L894001N095929O038249O288826N645156M381508L024310J949101
$$ y = [438071460, 419072866, 399385512, 380073547, 362051815, 345703483, 331062466, 318153650, 307264507, 298762441, 292787284, 289206982, 287508011, 286878586, 286773503, 287177563, 288318962, 290114343, 292012841, 293359011, 293776900, 293392688, 292750210, 292490035, 292935997, 294031262, 295590967, 297564954, 300085425, 303292483, 307095081, 311054617, 314609557, 317365974, 319291145, 320634007, 321642667, 322434217, 323071539, 323715091, 324794143, 326965749, 330758005, 336162001, 342680693, 349917680, 357988983, 367275625, 377338111, 385825008, 389050633, 384811699, 374968350, 364382893, 356947154, 353462845, 352954507, 354335576, 357026696, 360920697, 366016626, 372054875, 378343701, 383988857, 388370365, 391394675, 393343776]
1101.4C93343776J315594J199573J617820K431452L413647M222542M447788L889740
1117.7D15881932K755612J671940J349360K070009L377647M472941M615456L472447
1134D39667344J361400j187503l752470o014318p640630q269727p762611o414711m749924
1152.4C95236850l210873j999437r69559K42829J903832L969639O145478Q128166R857565
1170.7D19304490J1363655J2601614J3487429J3857037J3515383J2603610J1613697
1185E08346915J0765076R787857Q288563O194234L978550K403855J866162K102792
1201.3E53734004K433122K409696K303839K676368L704071M923761N547404N118310
1217.7E82850575L834248K370477J349151P70509J78635p25925j737237k280056k067685
$$ y = [393343776, 394659370, 395858943, 397476763, 399908215, 403321862, 407544404, 411992192, 415881932, 418637544, 420309484, 421658844, 423728853, 427106500, 431579441, 436194897, 439667344, 441028744, 439841241, 436088771, 430074453, 422433823, 414164096, 406401485, 399986774, 395236850, 392025977, 390026540, 389056981, 389299810, 391203642, 395173281, 401318759, 409446925, 419304490, 430668145, 443269759, 456757188, 470614225, 484129608, 496733218, 508346915, 519111991, 528899848, 537188411, 543382645, 547361195, 549765050, 551631212, 553734004, 556167126, 558576822, 560880661, 563557029, 567261100, 572184861, 577732265, 582850575, 586684823, 589055300, 590404451, 591174960, 591353595, 590627670, 588890433, 586610377, 584542692]
1236E84542692j389742p71940n21660m44174p6532P49052J700341K232194K071142
1254.4E88091373J488686R89378Q89122J196325J689017K006232J950622J671493J411796
1272.7F01384044J275956J038790L73364n82755j265466j272679p65085l62515n82338
1291.1E99241316j377403k198637k496600k216399j824260j743853j900971k041936
1307.4E83441257j904308j315117o61791n69045j066566j760840k345324k796113l370047
1325.8E67652106m242360n148411n507469m964471l613830j931667p64132m95076m54247
1344.1E40530443k07066P4625J57714j61171q97348j666844j813472j085877j84357
1362.5E34746647j69933q35299j550079j970649j395583j51574O61909J110852J582682
$$ y = [584542692, 583152950, 582381010, 581859350, 581415176, 581338644, 582087696, 583788037, 586020231, 588091373, 589580059, 590569437, 591458559, 592654884, 594343901, 596350133, 598300755, 599972248, 601384044, 602660000, 603698790, 604072154, 603489399, 602223933, 600951254, 600186169, 599823654, 599241316, 597863913, 595665276, 593168676, 590952277, 589128017, 587384164, 585483193, 583441257, 581536949, 580221832, 579560041, 578990996, 577924430, 576163590, 573818266, 571022153, 567652106, 563409746, 558261335, 552753866, 547789395, 544175565, 542243898, 541479766, 540984690, 540530443, 540323377, 540398002, 540555716, 540394545, 539497197, 537830353, 536016881, 534931004, 534746647, 534576714, 533741415, 532191336, 530220687, 528825104, 528673530, 529335439, 530446291, 532028973]
1380.8E32028973K253056L667295N650818N796254L806412K313137J245737J47879
1397.1E56909561l70025p50900j185894j712322k339780k371133j894533j493037j256406
1415.5E43535531r00031q19563r37164j56343O81162R27329Q73208K42412J14620J716256
1435.9E45277417K751827J535058O62267P0036l26872m22478p97808j350999j505733
1454.3E45892715j018881j118482j420974O2763K656222L913641L894865O028355J0470211
1472.6E69360435J1451125R152472P671356P008315O649136O268978O727398P458448
1488.9F31747663O217182L715634L430128M740715M613996L365040K679288L628671
1505.2F64138317M676163K300620J421988K154947K563417K255678J820326K240658
$$ y = [532028973, 534282029, 537949324, 543600142, 549396396, 553202808, 555515945, 556761682, 556909561, 556539536, 555788636, 554602742, 552890420, 550550640, 548179507, 546284974, 544791937, 543535531, 542635500, 541815937, 540878773, 540722430, 541403592, 542330921, 543204129, 543446541, 543561161, 545277417, 548029244, 549564302, 550226569, 550296605, 549969733, 549547255, 548749447, 547398448, 545892715, 544873834, 543755352, 542334378, 542397141, 545053363, 548967004, 552861869, 558890224, 569360435, 580811560, 589964032, 597635388, 604643703, 611292839, 617561817, 624289215, 631747663, 637964845, 641680479, 645110607, 649851322, 654465318, 657830358, 660509646, 664138317, 668814480, 671115100, 672537088, 674692035, 677255452, 679511130, 681331456, 683572114]
1521.6F83572114K095878J775860J516343O87241P52211J171589Q87513J514017K819956
1539.9F96792722R81450j077891j000285j65522N36919L78966j88947k54929M16875
1558.3F96419358p87139j810848j388550j322746j508356j869440j718342p40886o92427
1576.6F84580624k102375k581000k272129j747489j377225j509905k172530k776444
1593F68041527k903998k607762k221883k294540k944291l561675l663421l524900l351807
1611.3F40967250l127694l215075m222572m306078l180801k564848k638698k912938
1627.6F14798546l273189k965987j513421j1147m47392j089931q07941N5850J866758
1646F06612146K412736J320422L117979M850089J711607J367569L134728M769325M531383
$$ y = [683572114, 685667992, 687443852, 688960195, 689647436, 690399647, 691571236, 692458749, 693972766, 696792722, 697774172, 696696281, 695695996, 695530474, 696067393, 696446359, 696257412, 696002483, 696419358, 695632219, 693821371, 692432821, 691110075, 689601719, 687732279, 686013937, 685273051, 684580624, 682478249, 679897249, 677625120, 675877631, 674500406, 672990501, 670817971, 668041527, 665137529, 662529767, 660307884, 658013344, 655069053, 651507378, 647843957, 644319057, 640967250, 637839556, 634624481, 630401909, 626095831, 622915030, 620350182, 617711484, 614798546, 611525357, 608559370, 607045949, 607034802, 606587410, 605497479, 604689538, 604745388, 606612146, 609024882, 610345304, 613463283, 618313372, 620024979, 621392548, 624527276, 629296601, 633827984]
1664.3F33827984L360451M081010M979074M303039M974424N380333L963053L484488
1680.7F68353856N017638P100284N182505L701686L628612L106832L890157M608870
1697G04590440M469335M268050K242088J388550J520693J542449K041817K526343K700508
1715.3G27290273K342403J075923Q42869J729787K151608J812041J429200J495183
1731.7G40169287K410769K239704J496911J710475J570046J450896K106667L065109
1748G56219864L552139K750337J660764J655638K090216K514541K717614J883686J168251
1766.3G76213050J117170J510143K014101J589834Q80122O04332M96328O69718J166939
1784.7G86261737J401961J280487J107037N96464K31266P84575J463056J288295M30763
$$ y = [633827984, 637188435, 641269445, 646248519, 650551558, 655525982, 660906315, 664869368, 668353856, 673371494, 680471778, 685654283, 689355969, 692984581, 696091413, 699981570, 704590440, 709059775, 713327825, 715569913, 716958463, 718479156, 720021605, 722063422, 724589765, 727290273, 729632676, 730708599, 731551468, 733281255, 735432863, 737244904, 738674104, 740169287, 742580056, 744819760, 746316671, 748027146, 749597192, 751048088, 753154755, 756219864, 759772003, 762522340, 764183104, 765838742, 767928958, 770443499, 773161113, 775044799, 776213050, 777330220, 778840363, 780854464, 782444298, 783324420, 783928752, 784425080, 785094798, 786261737, 787663698, 788944185, 790051222, 790647686, 790878952, 791663527, 793126583, 794414878, 794845641]
1803G94845641j5498L01481R66847J309931R56535M15266Q9109J74284P12395J302659
1823.4H01058650J279891O59883Q0287k24233J89066Q69334R08673L57509M8339J05440
1843.8H05332839K20418M76897N64933K01643k29419k48909J73450O45220P29144M00960
1864.2H08267176P7605m7981j6630K98619N98073M04001p1526k48790J21355P01487
1884.6H10083389R70483O82533m6194l94225k6345N07355P30693M62592j08421l87550
1905H12474310r9241M03523O05106L46244n6923l10719k16305L05772O90758M11093
1925.4H14553618j33514m22657k45630K79307O18994M41492K1815k56359k43545J59264
1945.8H14772785N73516N18083Q8334k79784k38359K23637O85215O39736J76072k50339
$$ y = [794845641, 794830143, 795131624, 796098471, 797408402, 798364937, 798780203, 798869312, 799043596, 799755991, 801058650, 802338541, 802998424, 803078711, 802854478, 803043544, 803912878, 804821551, 805179060, 805227399, 805332839, 805553257, 806030154, 806595087, 806796730, 806567311, 806318402, 806491852, 807137072, 807866216, 808267176, 808344781, 808296800, 808280170, 808578789, 809176862, 809580863, 809509337, 809260547, 809381902, 810083389, 811053872, 811736405, 811690211, 811295986, 811269641, 811776996, 812507689, 812970281, 812861860, 812474310, 812375069, 812778592, 813383698, 813729942, 813673019, 813362300, 813145995, 813451767, 814142525, 814553618, 814420104, 813997447, 813751817, 814031124, 814650118, 815091610, 815113425, 814857066, 814613521, 814772785, 815346301, 815864384, 815952718, 815672934, 815434575, 815658212, 816343427, 816983163, 817159235, 816908896]
1966.2H16908896l13461Q0466N34892N46933J15812l23177l49402O0379M91441N21183
1986.6H18273962J27911k93910m16458j18077L61979M74036O9141m40001n67079k24054
2007H17247450K15471K83897r6440n66006p51793n39899j67847j38104m71592o20842
2027.4H14394295n26368l15845L3974J74582j27434n69463p49767m92454N842K50279
2047.8H12077641K7180l84629n42163k42532K53916M91858K77936j60575m06623k06828
2068.2H11185181K43306N08726L31998j12593l93272k49862K12192N37038L79920n4896
2088.6H12587738l20196j82986K41577N67198M86791R6917k04801j26362K39074N43296
2109H13928246M77255N1200l41952l00526R5784M22478L64602m6134m05491l34978
$$ y = [816908896, 816595435, 816675901, 817210793, 817757726, 817873538, 817550361, 817200959, 817261338, 817752779, 818273962, 818401873, 818107963, 817691505, 817573428, 817935407, 818409443, 818478584, 818038583, 817471504, 817247450, 817462921, 817746818, 817650378, 817084372, 816332579, 815792680, 815624833, 815486729, 815015137, 814394295, 813867927, 813552082, 813586056, 813760638, 813633204, 813063741, 812313974, 811821520, 811827362, 812077641, 812104821, 811720192, 811178029, 810935497, 811189413, 811681271, 811959207, 811798632, 811392009, 811185181, 811428487, 811937213, 812269211, 812156618, 811763346, 811513484, 811725676, 812262714, 812642634, 812587738, 812267542, 812084556, 812326133, 812893331, 813380122, 813477039, 813272238, 813145876, 813384950, 813928246, 814405501, 814456701, 814114749, 813814223, 813910007, 814332485, 814697087, 814650953, 814245462, 813910484]
2129.4H13910484J00255M93527M68910K9861l57925l16501O4492M38392M67897J06334
2149.8H15405726k82704k81454J12296N40077O28412K97248j18970j90080J86623P01308
2170.2H16998482Q93414O01351J63138L5942L37898P56383Q58247N30184Q6129n1976
2190.6H21209192K37763O72579Q28266N52356J20223o1095J65343O04570Q41022O09398
2211H25779617J23799j19746J11163N53369P83742N85436J06156k00569j6094M74930
2231.4H28181803P74801N73397Q4877k33889j39475K81632O20961N27501P6354k94864
2251.8H30453098j86622K97606O69062N66780R2626k77698j77562K87234O92249O47962
2272.2H33064735J82331k47062k35676J87993O07490O26683J92702l14593l86298M1545
$$ y = [813910484, 814010739, 814504266, 814973176, 815003037, 814645112, 814328611, 814393103, 814831495, 815299392, 815405726, 815123022, 814841568, 814953864, 815493941, 816122353, 816419601, 816300631, 816110551, 816297174, 816998482, 817891896, 818493247, 818656385, 818692327, 819030225, 819786608, 820644855, 821175039, 821261168, 821209192, 821446955, 822119534, 822947800, 823500156, 823620379, 823559284, 823724627, 824329197, 825170219, 825779617, 825903416, 825783670, 825894833, 826448202, 827231944, 827817380, 827923536, 827722967, 827706873, 828181803, 828956604, 829530001, 829614878, 829380989, 829241514, 829523146, 830144107, 830671608, 830747962, 830453098, 830266476, 830564082, 831233144, 831799924, 831892550, 831614852, 831437290, 831724524, 832416773, 833064735, 833247066, 833000004, 832764328, 832952321, 833559811, 834186494, 834379196, 834064603, 833678305, 833719850]
2292.5H33719850N03957N48065J51157l43800m58359p6592M01735N22673J65463l52502
2312.9H34781647n56946k66314K57790N01574J68740m01497o32822k88427L11375M67419
2333.3H34342539J3948n52297p33435l47018L25322M90904m1962n17070o93977n54919
2353.7H31732035J8716M96506K58625l94941q14616m87626L01361O46711L25083k39849
2374.1H31842005n64456l57270K01523N38349K99097k69950o53803n67556r9957L08991
2394.5H30676973K35021k64525p23064o91474k00271K36988J96576k87235q07464q88586
2414.9H27482939m53532M5776Q3030m02570r12726r57608n43297n6803N0724l59297
2435.3H23976636r13262j066447o82294j53542J0014l45230q74222j054465o87540
$$ y = [833719850, 834223807, 834771872, 834923029, 834579229, 834120870, 834044278, 834446013, 834968686, 835134149, 834781647, 834224701, 833958387, 834216177, 834717751, 834886491, 834484994, 833852172, 833563745, 833875120, 834342539, 834356487, 833804190, 833070755, 832723737, 833049059, 833539963, 833498001, 832980931, 832286954, 831732035, 831750751, 832247257, 832505882, 832110941, 831296325, 830808699, 831110060, 831756771, 832081854, 831842005, 831277549, 830920279, 831121802, 831660151, 831959248, 831689298, 831035495, 830467939, 830367982, 830676973, 830911994, 830647469, 829924405, 829232931, 829032660, 829269648, 829466224, 829178989, 828371525, 827482939, 827029407, 827075183, 827158213, 826755643, 825842917, 824885309, 824342012, 824285209, 824335933, 823976636, 823063374, 821996927, 821314633, 821161091, 821171105, 820825875, 819951653, 818897188, 818209648]
2453.7H18209648j28567M8041l27110q62539j039624o93262j57237O9917j84954p00950
2474.1H14233363j010716p70927k12908J05262j14798o45697r58622p42137j62602
2492.4H09720218K37525P0870m43519p80642o34968j31965K48254J27375l89159q31604
2512.8H07192385p76231k94864J19924Q1241l92019q81553r25660m97520n5134q0765
2533.2H03489804n63800j034916j080572o76692j93238j11043n35727j022637j069307
2551.6G97201872o46472j58131n5194m55678r96709j133859p45654k30253n1915l72768
2572G92355239r02176j135826q32915k71857n126k73227p50840r43899o61493j25348
2592.4G86452532J84476m5359n87165r13740p44402k47002O5327k14279q45551j219034
$$ y = [818209648, 818081081, 818129122, 817802012, 816939473, 815899849, 815206587, 815049350, 815119267, 814934313, 814233363, 813222647, 812451720, 812238812, 812344074, 812229276, 811583579, 810624957, 809882820, 809720218, 809957743, 810028613, 809585094, 808804452, 808169484, 808037519, 808285773, 808413148, 808023989, 807192385, 806416154, 806121290, 806241214, 806322455, 805930436, 805048883, 804123223, 803625703, 803570569, 803489804, 802926004, 801891088, 800810516, 800133824, 799940586, 799829543, 799293816, 798271179, 797201872, 796555400, 796397269, 796342075, 795886397, 794889688, 793755829, 793010175, 792779922, 792728007, 792355239, 791453063, 790317237, 789484322, 789212465, 789207339, 788934112, 788183272, 787239373, 786577880, 786452532, 786637008, 786591649, 786004484, 785090744, 784346342, 784099340, 784164667, 783950388, 783104837, 781885803]
2612.8G81885803j050115n74171k70069m39882r54450j351892j276315q60035n34356
2631.1G74574518o35505j127541j559376j510680j050711o49690o96183j129984j529456
2649.5G64685392j509606j068950o23465o19173j053214j465380j446009j036346n97119
2667.8G55266130n27263q87930j272738j288116r18984m82917l67523p03930j200200
2686.2G47616529j345217r94146n45978m27842p31290j223027j470745j247585q11815
2704.5G38818884o24776q96394j383424j605153j348615r05812o88254q34227j169384
2722.9G29362845j292049r75013m67718k08497l87728p83503j027823r21726n08368
2741.2G22790420j66297l07679p89762j066088q91507m99010k17319k57074o31750
$$ y = [781885803, 780835688, 780261517, 779991448, 779551566, 778597116, 777245224, 775968909, 775108874, 774574518, 773939013, 772811472, 771252096, 769741416, 768690705, 768041015, 767344832, 766214848, 764685392, 763175786, 762106836, 761483371, 760864198, 759810984, 758345604, 756899595, 755863249, 755266130, 754738867, 753850937, 752578199, 751290083, 750371099, 749888182, 749520659, 748816729, 747616529, 746271312, 745277166, 744731188, 744303346, 743572056, 742349029, 740878284, 739630699, 738818884, 738194108, 737297714, 735914290, 734309137, 732960522, 732054710, 731366456, 730532229, 729362845, 728070796, 727095783, 726628065, 726419568, 726031840, 725248337, 724220514, 723298788, 722790420, 722624123, 722316444, 721526682, 720460594, 719569087, 719070077, 718852758, 718595684, 717963934]
2759.6G17963934r99987r54449n57304k14994k50637o75738j109421j150668q40962
2778G11209774n65410o42955j067817j522303j633405j373947j070857j028836j318514
2796.3G00985730j744747j971722j824737j531183j503528j829028k241432k432645
2812.6F85906708k270639j986205j966358k338588k883553l229559l250837l144443
2828.9F64836526l148019l339589l520727l404558l033996k664387k469778k609968
2845.3F40645504l005862l286124l188908k755522k376080k497196l120661l796935
2861.6F16618216m105091m063129m019619m223227m666686n136490n271196m908324
2877.9E80224454m275322l655552l161908k733051k164185j428545p86304n09084o59883
$$ y = [717963934, 716963947, 716009498, 715452194, 715237200, 714986563, 714310825, 713201404, 712050736, 711209774, 710644364, 710001409, 708933592, 707411289, 705777884, 704403937, 703333080, 702304244, 700985730, 699240983, 697269261, 695444524, 693913341, 692409813, 690580785, 688339353, 685906708, 683636069, 681649864, 679683506, 677344918, 674461365, 671231806, 667980969, 664836526, 661688507, 658348918, 654828191, 651423633, 648389637, 645725250, 643255472, 640645504, 637639642, 634353518, 631164610, 628409088, 626033008, 623535812, 620415151, 616618216, 612513125, 608449996, 604430377, 600207150, 595540464, 590403974, 585132778, 580224454, 575949132, 572293580, 569131672, 566398621, 564234436, 562805891, 562019587, 561510503, 560850620]
2896.3E60850620j005470j182914j088560r84430j152933j621902k211988k721906
2912.6E48880517l048002l220916l339827l411234l328800k947032k148330j073420
2928.9E26362956l0637R13441J830935K737046L661573M520833N057216N130291M944920
2947.2E55128574M870296N048036N306662N456030N380452N060136M669249M403651
2963.6E95323086M316628M273712M069329L728628L461838L442049L695547L930807
2979.9F26241624L726542L118515K553702K301991K356350K407432K057433J429260
2996.2F46192849Q56399N08189M62950M83572K49148k34068p22349j016259j085937
3014.5F45694494j092732j262963j615524j937449k080262k046227j848876j724899
$$ y = [560850620, 559845150, 558662236, 557573676, 556589246, 555436313, 553814411, 551602423, 548880517, 545832515, 542611599, 539271772, 535860538, 532531738, 529584706, 527436376, 526362956, 526332319, 527245760, 529076695, 531813741, 535475314, 539996147, 545053363, 550183654, 555128574, 559998870, 565046906, 570353568, 575809598, 581190050, 586250186, 590919435, 595323086, 599639714, 603913426, 607982755, 611711383, 615173221, 618615270, 622310817, 626241624, 629968166, 633086681, 635640383, 637942374, 640298724, 642706156, 644763589, 646192849, 647049248, 647557437, 648020387, 648503959, 648753107, 648519039, 647796690, 646780431, 645694494, 644601762, 643338799, 641723275, 639785826, 637705564, 635659337, 633810461, 632085562]
3030.9F32085562j957894k415001k712071k542436k144754k087057k444565k816141
3047.2F12965643k846241k619981k415121k365231k601505k944827k977669k663612
3063.5E91531456k335370k342880k650857k898216k872467k579630k265453k287149
3079.8E71299434k575398k834081k976895k886414k618909k534032k629519k654790
3096.1E49589396k633155k640664k615154k483428k366602k500177k757847k661943
3112.4E28930426k227128k033472k251625k638578k941072k868951k474844k189696
3128.8E09305060k243459k453327k523244k380341k231986k255171k322465k309740
3145.1D90585327k290457k195180j991123j969397k174049k302438k328724k296418
$$ y = [632085562, 630127668, 627712667, 625000596, 622458160, 620313406, 618226349, 615781784, 612965643, 610119402, 607499421, 605084300, 602719069, 600117564, 597172737, 594195068, 591531456, 589196086, 586853206, 584202349, 581304133, 578431666, 575852036, 573586583, 571299434, 568724036, 565889955, 562913060, 560026646, 557407737, 554873705, 552244186, 549589396, 546956241, 544315577, 541700423, 539216995, 536850393, 534350216, 531592369, 528930426, 526703298, 524669826, 522418201, 519779623, 516838551, 513969600, 511494756, 509305060, 507061601, 504608274, 502085030, 499704689, 497472703, 495217532, 492895067, 490585327, 488294870, 486099690, 484108567, 482139170, 479965121, 477662683, 475333959, 473037541]
3161.4D73037541k114624j893192j820267j894712k005518k059519j954853j761228
3177.7D57533628j699120j806617j937836j946479j813561j651347j593291j638145
3194D43447232j691371j733690j697541j537382j427591j477719j587122j620323j508504
3212.4D29165989j349538j263529j249999j342953j482665j466364j280278j079201
3228.7D18651462r76295j081764j396597j540482j316041j061320r31799q86679j028299
3247.1D08432186j233816j173646r05782q00431r53137j097501j070171r53496p88033
3265.4C99456173o02484n58614p62046r76979r76652q92699q25375p69824p95663q71420
3285.8C91424417q10027n72413m40746o19024q92312j024246r58830p06315m90278
$$ y = [473037541, 470922917, 469029725, 467209458, 465314746, 463309228, 461249709, 459294856, 457533628, 455834508, 454027891, 452090055, 450143576, 448330015, 446678668, 445085377, 443447232, 441755861, 440022171, 438324630, 436787248, 435359657, 433881938, 432294816, 430674493, 429165989, 427816451, 426552922, 425302923, 423959970, 422477305, 421010941, 419730663, 418651462, 417675167, 416593403, 415196806, 413656324, 412340283, 411278963, 410347164, 409460485, 408432186, 407198370, 406024724, 405118942, 404318511, 403365374, 402267873, 401197702, 400244206, 399456173, 398853689, 398295075, 397533029, 396556050, 395579398, 394686699, 393861324, 393091500, 392295837, 391424417, 390614390, 390041977, 389601231, 388982207, 388089895, 387065649, 386106819, 385400504, 384910226]
3304.2C84910226n76496r32336j265496j298756j103967r55343q95709q79407q97229
3322.5C76105487r10818r89110j095086j093089j036227r70125r06676r71318j078278
3340.9C67054760j087009j152486j164407r68068r63867j219303j280427j110404j009524
3359.2C57099265j080692j077145p93815o24984r65775j444935j452267j069665p98136
3377.6C47791851p84010r09805r82613q77976n81146j93744j91003o83606q57502m27366
3398C41303080j29848m22299q15273p18534m75913m47988m59671m65185m03911j88797
3418.4C36775661r6500k22624j76430J28091L50773K79516K11299K82973J09225j83373
3438.8C37458611q6278K34455N20944O70761M64350L34054N18084O55025P21693P79152
$$ y = [384910226, 384333730, 383401394, 382135898, 380837142, 379733175, 378777832, 377882123, 377002716, 376105487, 375194669, 374205559, 373110473, 372017384, 370981157, 370011032, 369104356, 368133038, 367054760, 365967751, 364815265, 363650858, 362682790, 361718923, 360499620, 359219193, 358108789, 357099265, 356018573, 354941428, 354147613, 353522629, 352556854, 351111919, 349659652, 348589987, 347791851, 347007841, 346098036, 345115423, 344237447, 343656301, 343462557, 343271554, 342587948, 341730446, 341303080, 341173232, 340750933, 339935660, 339217126, 338741213, 338293225, 337833554, 337368369, 336964458, 336775661, 336679161, 336456537, 336280107, 336408198, 336758971, 337038487, 337249786, 337532759, 337641984, 337458611, 337372333, 337606788, 338127732, 338798493, 339262843, 339596897, 340114981, 340770006, 341491699, 342270851]
3459.2C42270851O80983O85752J082152J309126Q99136L84391L91960P08073J016051
3477.5C49428475J201063R84103O60717P87705R90332R28074R82672J184165J192749
3495.9C58340055R42170R42588J341433J231968P25001Q21620J158715J206666J103759
3514.2C67813975J015424J028389J196027J505464J457304J180202J209318J194477
3530.6C77600580J138121J402527J460225J134902J242131J800627K128571J640916
3546.9C89548600J074403J484990J905561J628846J550823J844049J789391J625031
3563.2D02451694K587885L830045K906680J616538J819640K467126K812534K969385
3579.5D23461527K790004K617895L407121M106164L121078K564371L370165L802747
$$ y = [342270851, 342951834, 343637586, 344719738, 346028864, 346928000, 347312391, 347704351, 348412424, 349428475, 350629538, 351613641, 352274358, 353062063, 354052395, 354980469, 355963141, 357147306, 358340055, 359282225, 360224813, 361566246, 362798214, 363523215, 364344835, 365503550, 366710216, 367813975, 368829399, 369857788, 371053815, 372559279, 374016583, 375196785, 376406103, 377600580, 378738701, 380141228, 381601453, 382736355, 383978486, 385779113, 387907684, 389548600, 390623003, 392107993, 394013554, 395642400, 397193223, 399037272, 400826663, 402451694, 405039579, 408869624, 411776304, 413392842, 415212482, 417679608, 420492142, 423461527, 426251531, 428869426, 432276547, 436382711, 439503789, 442068160, 445438325, 449241072]
3595.8D49241072L636509L650099L399670K991647L353894M058063L960132L714144
3612.1D78005230L572017L595233M665673M844755L027409K028942L334433N924046
3628.5E08997738N275965L007829L013373L386020L524363L625155L239810L034294
3644.8E37104547M277527O176830M806041K298534K868533M050255L429771K778768
3661.1E67790806K656460K622783L227830M170299L443479K869845M093051L429174
3677.4E94303727J970053J828909J802087K166867L526926M018366K359748J358092
3693.7F13334775J473546J707792K166629K448142J772940J270234J673639K498448
3710F28346145K484024J386165R72808J268685J524806J544296J552582J422823J096546
$$ y = [449241072, 452877581, 456527680, 459927350, 462918997, 466272891, 470330954, 474291086, 478005230, 481577247, 485172480, 489838153, 494682908, 497710317, 499739259, 503073692, 508997738, 514273703, 517281532, 520294905, 523680925, 527205288, 530830443, 534070253, 537104547, 541382074, 547558904, 552364945, 554663479, 557532012, 561582267, 565012038, 567790806, 570447266, 573070049, 576297879, 580468178, 583911657, 586781502, 590874553, 594303727, 596273780, 598102689, 599904776, 602071643, 605598569, 609616935, 611976683, 613334775, 614808321, 616516113, 618682742, 621130884, 622903824, 624174058, 625847697, 628346145, 630830169, 632216334, 633189142, 634457827, 635982633, 637526929, 639079511, 640502334, 641598880]
3728.4F41598880J215399J911044K363443J699209N05030L20852J384437J916647R39191
3746.7F53854132J216173K086699J149654L26574P34389J087546P14481O29068J108884
3765.1F62907600J427532J394033Q50320L82781O67810J377404J480520P27832M56214
3783.5F71672046O54340P07626P94947Q23200Q66533R03904P73847J157701J361370
3801.8F79715514P54297P18534N31435q9049J26361J025081J406729J147211J297176
3820.2F86633289P50601n126K52426N16891N99265O13153O95229J057446J034141N79774
3840.6F92727089L89695J48237k03252q0824R30786K175868J075923n91695m26829
3858.9F96144998L89338J031637Q78155N75483O65903M47392J92583J27256K98142
$$ y = [641598880, 642814279, 644725323, 647088766, 648787975, 649293005, 649613857, 650998294, 652914941, 653854132, 655070305, 657157004, 658306658, 658633232, 659367621, 660455167, 661169648, 661798716, 662907600, 664335132, 665729165, 666579485, 666962266, 667630076, 669007480, 670488000, 671215832, 671672046, 672326386, 673034012, 673828959, 674652159, 675518692, 676422596, 677196443, 678354144, 679715514, 680469811, 681188345, 681719780, 681630731, 681757092, 682782173, 684188902, 685336113, 686633289, 687383890, 687378764, 687631190, 688148081, 688747346, 689360499, 690055728, 691113174, 692147315, 692727089, 693116784, 693265021, 693061769, 692980945, 693911731, 696087599, 697163522, 696571827, 696144998, 696534336, 697565973, 698444128, 699019611, 699685514, 700132906, 700325489, 700452745, 700750887]
3877.3G00750887O94335N22256M13596N33700J55867L03983O48797K16901k9206L70264
3897.7G04581380Q41617J022697O64532q3148l88861j62959J31726M56929P33137N54920
3918.1G08351970J28269J20819L59952K85685J88649L21448K52664N7816R6023K33531
3938.5G10396826M23134M88817K44022J57714K94923L28780K57492J17957n36L4571
3958.9G12743700K18033L39628K99096K67684K58446K04980K23458L16024K99752J46448
3979.3G15317249N6446R8944J58429K35080L08455K65359J31071N0426J05261
3997.6G16726720
$$ y = [700750887, 701445222, 701967478, 702381074, 702914774, 703070641, 703374624, 704023421, 704240322, 704211116, 704581380, 705422997, 706445694, 707110226, 707027078, 706638217, 706475258, 706606984, 707063913, 707797050, 708351970, 708480239, 708601058, 708961010, 709246695, 709435344, 709756792, 710009456, 710067272, 710163295, 710396826, 710819960, 711308777, 711552799, 711710513, 712005436, 712334216, 712591708, 712709665, 712709129, 712743700, 712961733, 713301361, 713600457, 713868141, 714126587, 714331567, 714555025, 714871049, 715170801, 715317249, 715373695, 715472639, 715631068, 715866148, 716174603, 716439962, 716571033, 716621459, 716726720]
##END=$$ End of the data block
