##TITLE=$$ Begin of the data block
##JCAMP-DX=5.00 $$ ACD/SpecManager v 10.08
##SPECTROMETER/DATA SYSTEM=Alpha
##DATE=29 Dec 2014 11:22:02
##DATA TYPE=INFRARED SPECTRUM
##DATA CLASS=XYDATA
##ORIGIN=
##OWNER=
##NPOINTS=1765
##FIRSTX=399.76428223
##LASTX=3997.64306641
##MAXX=3997.64306641
##MINX=399.76428223
##MAXY=0.83566999
##MINY=0.28661707
##XFACTOR=1.0000000000
##YFACTOR=1.000000000000000e-9
##FIRSTY=0.56585318
##DELTAX=2.03961372
##XUNITS=1/CM
##YUNITS=ARBITRARY UNITS
##XYDATA=(X++(Y..Y))
$$ plain form
399.8 565853179 562589049 561163962 559885442 558046043 557073414 558905780 562806249 566184580 566961229
418.1 566961229 564063370 560497999 558734834 558335841 557544172 554730356 550190985 546239495 544810176
436.5 544810176 546238899 549421966 552630484 554838359 557015538 560447931 564586639 567343771
452.8 567343771 567158461 564608157 561841190 560963929 561238050 560202301 556677163 551868498 547920883
471.2 547920883 545911610 545078099 543793738 541268110 538374424 536988974 538045526 540179491 540964067
489.5 540964067 539234757 536036789 533501208 532787681 532986760 531808376 528230131 523837149 520377219
507.9 520377219 518294990 516580880 513557374 508551419 502566159 497798979 495674163 495485038 495211452
526.2 495211452 493705690 492131323 492496759 495811313 501272023 506898165 511201978 514211297 517009974
$$ packed form
399.8E65853179l264130j425087j278520j839399r72629J832366L900469L378331P76649
418.1E66961229k897859l565371j763165l98993p91669k813816m539371l951490j429319
436.5E44810176J428723L183067L208518K207875K177179L432393M138708K757132
452.8E67343771j85310k550304k766967q77261K74121j035749l525138m808665l947615
471.2E47920883k009273q33511j284361k525628k893686j385450J056552K133965P84576
489.5E40964067j729310l197968k535581p13527J99079j178384l578245m392982l459930
507.9E20377219k082229j714110l023506n005955n985260m767180k124816j89125k73586
526.2D95211452j505762j574367L65436L314554N460710N626142M303813L009319K798677
$$ plain form
544.6 517009974 520138323 522506773 522556365 519962430 516026378 512684584 510492563 508061409 503710926
562.9 503710926 497069150 489381731 482701182 478443712 476620227 476384312 477135539 479396284 484290928
581.3 484290928 491904229 500372887 507033587 510661721 512215793 513409972 515210152 516979694
597.6 516979694 517295420 515819967 513920188 513408899 514842689 517234445 519007444 519570529 520018339
616 520018339 522040486 526223660 531429112 535821199 538366199 539841771 541997135 545573175 549460053
634.3 549460053 551829278 552044749 551406622 551843286 554033935 556862652 558613956 558543384 557698488
652.7 557698488 557974994 560116827 562968731 564633191 564351082 563100994 563257337 566868246 570284426
671 570284426 571830511 572083116 571765780 572540760 575211048 578596175 580587029 580317199 578887045
$$ packed form
544.6E17009974L128349K368450M9592k593935l936052l341794k192021k431154m350483
562.9E03710926o641776p687419o680549m257470j823485k35915P51227K260745M894644
581.3D84290928P613301Q468658O660700L628134J554072J194179J800180J769542
597.6E16979694L15726j475453j899779n11289J433790K391756J772999N63085M47810
616E20018339K022147M183174N205452M392087K545000J475572K155364L576040L886878
634.3E49460053K369225K15471o38127M36664K190649K828717J751304p0572q44896
652.7E57698488K76506K141833K851904J664460k82109j250088J56343L610909L416180
671E70284426J546085K52605l17336P74980K670288L385127J990854k69830j430154
$$ plain form
689.4 578887045 578139901 578722119 579351604 578149557 574550331 569847703 566205621 564914942 565409482
707.7 565409482 566191673 566615403 567499697 570180118 575288057 582075953 588551521 593295217 596947610
726.1 596947610 601184726 606799245 612827063 617417693 619500697 619781196 620126188 621506929 622918844
744.5 622918844 622420907 619059563 613786578 608601809 604801714 601941526 598637402 594369233 590208948
762.8 590208948 588063598 589311302 593694568 599603295 605546951 611451447 618409514 627059400
779.1 627059400 636433721 644448876 649674177 652629077 655287504 659270346 664509952 669469714
795.4 669469714 672802746 674852848 677265346 681135178 685775936 689352155 690643191 690318286 690282583
813.8 690282583 691795647 694291294 695890963 695031643 691975653 688493311 685874045 683693171 680360556
$$ packed form
689.4E78887045p47144N82218O29485j202047l599226m702628l642082j290679M94540
707.7E65409482P82191M23730Q84294K680421N107939O787896O475568M743696L652393
726.1E96947610M237116N614519O027818M590630K083004K80499L44992J380741J411915
744.5F22918844m97937l361344n272985n184769l800095k860188l304124m268169m160285
762.8E90208948k145350J247704M383266N908727N943656N904496O958067Q649886
779.1F27059400R374321Q015155N225301K954900K658427L982842N239606M959762
795.4F69469714L333032K050102K412498L869832M640758L576219J291036l24905l5703
813.8F90282583J513064K495647J599669q59320l055990l482342k619266k180874l332615
$$ plain form
832.2 680360556 674759209 667356253 659920394 654458284 651714504 650085390 647287428 642957449
848.5 642957449 638476014 635003865 632176101 628670752 624185085 620744824 621445477 627686918 638218641
866.8 638218641 650475621 662025928 671393454 678510010 684081674 688032866 689124882 686418116
883.2 686418116 680561185 673540711 667298913 662319779 657569289 651903093 645364106 639151871
899.5 639151871 634273112 630250871 625444174 618514895 609473884 599452198 589648187 580539405
915.8 580539405 571968079 563889503 556952238 552175820 550047696 550083697 551248729 552676976 554159820
934.1 554159820 556238413 559738219 564869106 570444167 574060380 573606014 568750143 560622931 550261557
952.5 550261557 537862182 523341775 507110000 490048528 472856730 455575407 437685788
$$ packed form
832.2F80360556n601347p402956p435859n462110k743780j629114k797962m329979
848.5F42957449m481435l472149k827764l505349m485667l440261P00653O241441J0531723
866.8F38218641J2256980J1550307R367526P116556N571664L951192J092016k706766
883.2F86418116n856931p020474o241798m979134m750490n666196o538987o212235
899.5F39151871m878759m022241m806697o929279r041011j0021686r804011r108782
915.8E80539405q571326q078576o937265m776418k128124L6001J165032J428247J482844
934.1E54159820K078593L499806N130887N575061L616213m54366m855871q127212j0361374
952.5E50261557j2399375j4520407j6231775j7061472j7191798j7281323j7889619
$$ plain form
966.8 437685788 418713689 399003476 379685789 361709893 345423371 330847561 317975998
981.1 317975998 307061940 298559964 292688370 289179534 287439764 286754131 286617070 287026405 288201869
999.4 288201869 290019512 291923881 293263853 293685138 293322027 292671859 292381108 292840689 293983161
1017.8 293983161 295558304 297503829 299996674 303204149 307001770 310925961 314455569 317235559
1034.1 317235559 319187582 320514709 321510017 322312921 322968960 323648810 324763030 326945662 330721289
1052.4 330721289 336077929 342530042 349709868 357761085 367054641 377127856 385650218 388932228
1068.8 388932228 384719491 374888182 364295810 356825620 353346169 352855891 354238659 356961757
1085.1 356961757 360891193 365978450 371976376 378233939 383877158 388257712 391290247 393265337
$$ packed form
966.8D37685788j8972099j9710213j9317687j7975896j6286522j4575810j2871563
981.1C17975998j0914058q501976n871594l508836j739770o85633j37061M09335J175464
999.4B88201869J817643J904369J339972M21285l63111o50168k90751M59581J142472
1017.8B93983161J575143J945525K492845L207475L797621L924191L529608K779990
1034.1C17235559J952023J327127R95308Q02904O56039O79850J114220K182632L775627
1052.4C30721289N356640O452113P179826Q051217R293556J0073215Q522362L282010
1068.8C88932228m212737r831309j0592372p470190l479451m90278J382768K723098
1085.1C56961757L929436N087257N997926O257563N643219M380554L032535J975090
$$ plain form
1101.4 393265337 394570947 395737320 397351265 399803668 403262407 407544732 411999196 415830344
1117.7 415830344 418517113 420154691 421514899 423602760 426991463 431445152 435989350 439416468
1134 439416468 440823048 439722419 436029136 430038750 422405303 414129108 406342626 399916500 395190924
1152.4 395190924 392003298 389997810 389022529 389305532 391273409 395240545 401322454 409428507 419303507
1170.7 419303507 430690497 443345517 456862837 470672637 484132707 496729225 508348048
1185 508348048 519103348 528894365 537194729 543370843 547328055 549737394 551604807 553681135
1201.3 553681135 556080222 558484077 560825348 563573956 567329645 572239757 577754319 582843244
1217.7 582843244 586623490 588940859 590270996 591049790 591245472 590542853 588825703 586536229 584461927
$$ packed form
1101.4C93265337J305610J166373J613945K452403L458739M282325M454464L831148
1117.7D15830344K686769J637578J360208K087861L388703M453689M544198L427118
1134D39416468J406580j100629l693283n990386p633447q276195p786482o426126m725576
1152.4C95190924l187626k005488r75281K83003J967877L967136O081909Q106053R875000
1170.7D19303507J1386990J2655020J3517320J3809800J3460070J2596518J1618823
1185E08348048J0755300R791017Q300364O176114L957212K409339J867413K076328
1201.3E53681135K399087K403855K341271K748608L755689M910112N514562N088925
1217.7E82843244L780246K317369J330137P78794J95682p02619j717150k289474k074302
$$ plain form
1236 584461927 583094120 582334399 581803262 581355453 581292093 582048535 583748400 585977852 588040531
1254.4 588040531 589535475 590549886 591469228 592708886 594437659 596444905 598365068 600010812
1270.7 600010812 601425529 602711260 603745878 604116917 603528440 602246881 600969017 600221813 599873424
1289 599873424 599265277 597836137 595609963 593134284 590959907 589170277 587451756 585569918 583531797
1307.4 583531797 581607759 580265224 579583108 579017282 577975214 576215327 573856592 571089447 567759991
1325.8 567759991 563500643 558304250 552788317 547859073 544290125 542390347 541623592 541098058 540597618
1344.1 540597618 540343344 540426135 540636837 540497065 539581239 537882626 536051571 535001218 534869552
1362.5 534869552 534681022 533779740 532198071 530254543 528899133 528755307 529383898 530439615 531996846
$$ packed form
1236E84461927j367807p59721n31137m47809o3360P56442J699865K229452K062679
1254.4E88040531J494944J014411R19342J239658J728773K007246J920163J645744
1270.7F00010812J414717J285731J034618L71039n88477j281559j277864p47204l48389
1289E99873424o08147j429140k226174k475679k174377j789630j718521j881838k038121
1307.4E83531797j924038j342535o82116n65826j042068j759887k358735k767145l329456
1325.8E67759991m259348n196393n515933m929244l568948j899778p66755n25534n00440
1344.1E40597618k54274Q2791K10702j39772r15826j698613j831055j050353j31666
1362.5E34869552j88530r01282j581669j943528j355410j43826O28591J055717J557231
$$ plain form
1380.8 531996846 534289181 538012981 543656766 549381912 553137779 555468619 556783438 556987822
1397.1 556987822 556614578 555827558 554633796 552922428 550557911 548186719 546336830 544885874 543643177
1415.5 543643177 542732060 541907549 541005790 540874362 541521728 542397797 543257117 543515265 543655097 545397341
1435.9 545397341 548132896 549617410 550257266 550363362 550096750 549690604 548858523 547485232 545991600
1454.3 545991600 544982970 543830276 542376399 542457044 545147657 549038768 552903771 558978915 569546342
1472.6 569546342 581036985 590147197 597750425 604725480 611383915 617685974 624475777 631977201
1488.9 631977201 638137937 641777575 645213485 650014937 654655039 658013165 660700798 664396644
1505.2 664396644 669155955 671414733 672772229 674931765 677522898 679768264 681567430 683812857
$$ packed form
1380.8E31996846K292335L723800N643785N725146L755867K330840J314819K04384
1397.1E56987822l73244p87020j193762j711368k364517k371192j849889j450956j242697
1415.5E43643177r11117q24511r01759j31428O47366Q76069Q59320K58148J39832J742244
1435.9E45397341K735555J484514O39856J06096k66612m06146q32081j373291j493632
1454.3E45991600j008630j152694j453877Q0645K690613L891111L865003O075144J0567427
1472.6E69546342J1490643R110212P603228O975055O658435O302059O789803P501424
1488.9F31977201O160736L639638L435910M801452M640102L358126K687633L695846
1505.2F64396644M759311K258778J357496K159536K591133K245366J799166K245427
$$ plain form
1521.6 683812857 685929954 687709272 689188302 689852297 690638125 691828549 692694843 694236517 697112143
1539.9 697112143 698070705 696946859 695928216 695772469 696318150 696699262 696525395 696295679 696763039
1558.3 696763039 695977926 694102645 692652047 691292346 689799845 687972248 686270416 685514688 684753895
1576.6 684753895 682581425 679993927 677748621 676014602 674625158 673093379 670903027 668119431
1593 668119431 665219367 662611365 660368443 658047378 655103266 651553154 647899568 644404888 641075253
1611.3 641075253 637937129 634713829 630487442 626175761 623026311 620515108 617889225 614940107
1627.6 614940107 611615419 608637989 607193589 607262313 606777549 605635047 604844391 604974031 606944621
1646 606944621 609440267 610833347 614043593 618849754 620440602 621784985 624974012 629810154 634338677
$$ packed form
1521.6F83812857K117097J779318J479030O63995P85828J190424Q66294J541674K875626
1539.9F97112143R58562j123846j018643j55747N45681L81112j73867k29716M67360
1558.3F96763039p85113j875281j450598j359701j492501j827597j701832p55728p60793
1576.6F84753895k172470k587498k245306j734019j389444j531779k190352k783596
1593F68119431k900064k608002k242922k321065k944112l550112l653586l494680l329635
1611.3F41075253l138124l223300m226387m311681l149450k511203k625883k949118
1627.6F14940107l324688k977430j444400O8724m84764j142502p90656J29640J970590
1646F06944621K495646J393080L210246M806161J590848J344383L189027M836142M528523
$$ plain form
1664.3 634338677 637669683 641786814 646811128 651108384 656093836 661481917 665431559 668946445
1680.7 668946445 674048483 681206584 686348021 689969838 693528295 696615219 700558841 705252886
1697 705252886 709745049 713946402 716131568 717502296 718989551 720497489 722537518 725096405 727852702
1715.3 727852702 730203748 731211245 732001185 733704925 735836506 737657547 739125073 740689397
1731.7 740689397 743186772 745407343 746829987 748502076 750060380 751530230 753674388 756750584
1748 756750584 760265112 762967348 764622986 766293228 768371105 770860255 773547053 775392294 776548982
1766.3 776548982 777705967 779315829 781416297 782973289 783778369 784361243 784855306 785504699 786681652
1784.7 786681652 788115799 789397717 790483594 791068673 791311324 792111576 793562114 794798195 795176685
$$ packed form
1664.3F34338677L331006M117131N024314M297256M985452N388081L949642L514886
1680.7F68946445N102038P158101N141437L621817L558457L086924L943622M694045
1697G05252886M492163M201353K185166J370728J487255J507938K040029K558887K756297
1715.3G27852702K351046J007497P89940J703740K131581J821041J467526J564324
1731.7G40689397K497375K220571J422644J672089J558304J469850K144158L076196
1748G56750584L514528K702236J655638J670242K077877K489150K686798J845241J156688
1766.3G76548982J156985J609862K100468J556992Q05080N82874M94063O49393J176953
1784.7G86681652J434147J281918J085877N85079K42651Q00252J450538J236081L78490
$$ plain form
1803 795176685 795171618 795553982 796602905 797923684 798825920 799195528 799273431 799434304 800149381 801496923
1823.4 801496923 802803516 803452253 803525329 803284287 803444147 804287672 805176079 805512786 805552304 805688381
1843.8 805688381 805945635 806425333 806971848 807158768 806924462 806668818 806858063 807548106 808302999 808697343
1864.2 808697343 808766663 808706224 808649838 808920622 809530020 809936702 809842050 809599519 809765518 810491741
1884.6 810491741 811454535 812116981 812028885 811604738 811592877 812132955 812872052 813306570 813171089 812784016
1905 812784016 812717557 813173175 813794076 814105451 814037442 813768268 813587785 813898146 814563990 814924181
1925.4 814924181 814744890 814310908 814099550 814426243 815064430 815500796 815515161 815260828 815018594 815175712
1945.8 815175712 815750718 816250801 816292405 815966070 815732360 816013634 816723168 817328095 817463040 817204297
$$ packed form
1803G95176685n067L82364J048923J320779R02236L69608P7903J60873P15077J347542
1823.4H01496923J306593O48737P3076k41042J59860Q43525Q88407L36707L9518J36077
1843.8H05688381K57254M79698N46515J86920k34306k55644J89245O90043P54893L94344
1864.2H08697343O9320o0439n6386K70784O09398M06682r4652k42531J65999P26223
1884.6H10491741R62794O62446q8096m24147j1861N40078P39097M34518j35481l87073
1905H12784016o6459M55618O20901L11375o8009k69174j80483L10361O65844L60191
1925.4H14924181j79291m33982k11358L26693O38187M36366J4365k54333k42234J57118
1945.8H15175712N75006N00083M1604l26335k33710K81274P09534O04927J34945k58743
$$ plain form
1966.2 817204297 816919208 817032516 817590058 818138003 818212688 817834139 817464471 817550719 818087101 818629384
1986.6 818629384 818748951 818451762 818035185 817917943 818296134 818783224 818845987 818395257 817836046 817633867
2007 817633867 817860484 818129599 818009436 817432225 816678345 816159010 816025376 815890610 815387011 814734876
2027.4 814734876 814206421 813918829 813983917 814160764 814007699 813416719 812692165 812253952 812261283 812465131
2047.8 812465131 812471092 812106550 811577976 811308086 811536849 812035620 812318325 812147915 811739445 811550379
2068.2 811550379 811819196 812349200 812694609 812559545 812125504 811881423 812130690 812696159 813090384 813027084
2088.6 813027084 812696457 812542737 812828183 813402832 813865662 813906014 813627660 813465714 813724577 814304352
2109 814304352 814779997 814820409 814502716 814214587 814313650 814777255 815185726 815157533 814770520 814433694
$$ packed form
1966.2H17204297k85089J13308N57542N47945P4685l78549l69668Q6248N36382N42283
1986.6H18629384J19567k97189m16577j17242L78191M87090O2763m50730n59211k02179
2007H17633867K26617K69115j20163n77211p53880n19335j33634j34766n03599o52135
2027.4H14734876n28455k87592O5088J76847j53065n90980p24554m38213P331K03848
2047.8H12465131N961l64542n28574k69890K28763M98771K82705j70410m08470j89066
2068.2H11550379K68817N30004L45409j35064m34041k44081K49267N65469L94225o3300
2088.6H13027084l30627j53720K85446N74649M62830M0352k78354j61946K58863N79775
2109H14304352M75645M0412l17693k88129R9063M63605M08471k8193l87013l36826
$$ plain form
2129.4 814433694 814482510 814925909 815388203 815431535 815076292 814760983 814850569 815318167 815781593 815871775
2149.8 815871775 815596759 815321445 815419197 815948963 816576838 816874266 816753268 816560030 816756725 817486227
2170.2 817486227 818391919 818964720 819082618 819101870 819458604 820241451 821125865 821667969 821755052 821714222
2190.6 821714222 821957827 822625756 823450565 824003279 824121952 824044824 824205399 824833214 825679243 826266587
2211 826266587 826394320 826310217 826455176 827027977 827807367 828355908 828416348 828199029 828182876 828651488
2231.4 828651488 829425633 829987764 830031455 829757631 829620898 829957902 830662727 831245542 831318080 831000865
2251.8 831000865 830783963 831051171 831733823 832330167 832438469 832168758 831973016 832221270 832884908 833534122
2272.2 833534122 833739579 833498299 833236039 833420038 834066868 834721327 834908724 834577978 834176362 834194958
$$ packed form
2129.4H14433694M8816M43399M62294M3332l55243l15309Q9586M67598M63426R0182
2149.8H15871775k75016k75314R7752N29766O27875K97428j20998j93238J96695P29502
2170.2H17486227R05692N72801J17898J9252L56734P82847Q84414N42104Q7083m0830
2190.6H21714222K43605O67929Q24809N52714J18673p7128J60575O27815Q46029N87344
2211H26266587J27733q4103J44959N72801P79390N48541O0440k17319j6153M68612
2231.4H28651488P74145N62131M3691k73824j36733L37004P04825N82815P2538l17215
2251.8H31000865k16902K67208O82652N96344J08302k69711j95742K48254O63638O49214
2272.2H33534122K05457k41280k62260J83999O46830O54459J87397l30746m01616J8596
$$ plain form
2292.5 834194958 834676921 835213006 835355937 835025311 834585786 834517777 834959209 835527480 835669994 835264206
2312.9 835264206 834704757 834494054 834812045 835315049 835433424 835002005 834407091 834163249 834433198 834851623
2333.3 834851623 834913552 834414601 833635926 833229482 833569169 834102273 834089994 833568215 832815349 832181096
2353.7 832181096 832130253 832539082 832703352 832271397 831510663 831069410 831399202 832129776 832502425 832252562
2374.1 832252562 831711650 831413209 831656098 832202733 832500637 832213342 831528008 830963135 830896080 831217229
2394.5 831217229 831423759 831140220 830462754 829833210 829645097 829857051 830017388 829681993 828833580 827968478
2414.9 827968478 827593327 827681363 827734053 827283561 826368630 825453639 824943841 824882805 824904084 824507594
2435.3 824507594 823575020 822505653 821833313 821705759 821724653 821358263 820458174 819409549 818758488
$$ packed form
2292.5H34194958M81963N36085J42931l30626m39525o8009M41432N68271J42514m05788
2312.9H35264206n59449k10703L17991N03004J18375m31419n94914k43842K69949M18425
2333.3H34851623O1929m98951p78675m06444L39687N33104j2279n21779p52866o34253
2353.7H32181096n0843M08829J64270m31955p60734m41253L29792P30574L72649k49863
2374.1H32252562n40912k98441K42889N46635K97904k87295o85334n64873o7055L21149
2394.5H31217229K06530k83539o77466o29544j88113K11954J60337l35395q48413q65102
2414.9H27968478l75151Q8036N2690m50492r14931r14991n09798o1036K1279l96490
2435.3H24507594r32574j069367o72340j27554J8894l66390r00089j048625o51061
$$ plain form
2453.7 818758488 818647504 818665087 818298459 817430615 816396832 815705359 815558314 815630317 815412581 814682305
2474.1 814682305 813700199 812985897 812801361 812907696 812794328 812139392 811162353 810430765 810283422 810515523
2494.5 810515523 810582161 810131907 809350312 808733821 808622122 808867693 808960199 808543324 807730019 806998849
2514.9 806998849 806743562 806877434 806920528 806467831 805557787 804642141 804175436 804138362 804061830 803505123
2535.3 803505123 802464187 801364481 800678134 800482094 800378263 799880624 798872530 797758400 797082067
2553.6 797082067 796941400 796897888 796419442 795411468 794310927 793599784 793377995 793316305 792916298 791984320
2574 791984320 790856600 790076852 789828420 789799213 789504766 788723290 787759185 787138164 787067056 787254810
2594.4 787254810 787169456 786549807 785647452 784946918 784727037 784775555 784541905 783720553 782542109 781508327
$$ packed form
2453.7H18758488j10984J7583l66628q67844j033783o91473j47045P2003k17736p30276
2474.1H14682305r82106p14302j84536J06335j13368o54936r77039p31588j47343K32101
2494.5H10515523O6638m50254p81595o16491j11699K45571R2506m16875q13305p31170
2514.9H06998849k55287J33872M3094m52697r10044r15646m66705l7074p6532n56707
2535.3H03505123j040936j099706o86347j96040j03831m97639j008094j114130o76333
2553.6G97082067j40667m3512m78446j007974j100541p11143k21789o1690m00007r31978
2574G91984320j127720p79748k48432k9207k94447p81476r64105o21021p1108J87754
2594.4G87254810q5354o19649r02355p00534k19881M8518k33650q21352j178444j033782
$$ plain form
2614.8 781508327 780941963 780668676 780185699 779171526 777788460 776521564 775706649 775213361 774566650
2633.2 774566650 773397863 771805346 770284235 769246936 768620551 767947257 766816080 765275121 763788521
2651.5 763788521 762746572 762102664 761456192 760404050 758929074 757476866 756477296 755922854 755418479
2669.9 755418479 754540563 753245473 751919508 751006544 750561059 750184000 749412775 748165846 746841967
2688.2 746841967 745915711 745421231 744984686 744211078 742965877 741507232 740277529 739488423 738878906
2706.6 738878906 737941265 736498654 734883428 733559906 732678592 731987417 731127083 729961336 728703201
2724.9 728703201 727742732 727277160 727089822 726705194 725882888 724830627 723930895 723455787 723290086
2743.3 723290086 722975612 722202361 721138597 720237255 719730914 719476700 719174802 718555272 717617810
$$ packed form
2614.8G81508327n66364k73287m82977j014173j383066j266896q14915m93288o46711
2633.2G74566650j168787j592517j521111j037299o26385o73294j131177j540959j486600
2651.5G63788521j041949o43908o46472j052142j474976j452208r99570n54442n04375
2669.9G55418479q77916j295090j325965r12964m45485l77059p71225j246929j323879
2688.2G46841967r26256m94480m36545p73608j245201j458645j229703p89106o09517
2706.6G38878906r37641j442611j615226j323522q81314o91175q60334j165747j258135
2724.9G28703201r60469m65572j87338l84628q22306j052261q99732m75108j65701
2743.3G23290086l14474p73251j063764r01342n06341k54214l01898o19530r37462
$$ plain form
2761.6 717617810 716705084 716144979 715900123 715612948 714931250 713831425 712668359 711811900 711247087
2780 711247087 710614800 709542513 708010316 706391692 705035508 703978300 702961147 701637149 699892759
2798.4 699892759 697947860 696161449 694642782 693104029 691235185 688985944 686562240 684305072
2814.7 684305072 682331383 680359423 678003311 675104558 671853900 668605566 665490806 662338495
2831 662338495 658965290 655429065 652018428 648995459 646362722 643884361 641218007 638150752 634843588
2849.3 634843588 631717145 629069090 626735151 624171853 620943606 617068768 612945080 608908772
2865.7 608908772 604891479 600611925 595906436 590805948 585577428 580678463 576405406 572727144
2882 572727144 569529295 566793442 564630866 563174784 562352121 561809719 561134458 560166895 559056580
$$ packed form
2761.6G17617810r12726n60105k44856k87175o81698j099825j163066q56459n64813
2780G11247087o32287j072287j532197j618624j356184j057208j017153j323998j744390
2798.4F99892759j944899j786411j518667j538753j868844k249241k423704k257168
2814.7F84305072j973689j971960k356112k898753l250658l248334l114760l152311
2831F62338495l373205l536225l410637l022969k632737k478361k666354l067255l307164
2849.3F34843588l126443k648055k333939k563298l228247l874838m123688m036308
2865.7F08908772m017293m279554m705489n100488n228520m898965m273057l678262
2882E72727144l197849k735853k162576j456082q22663n42402o75261r67563j110315
$$ plain form
2900.3 559056580 558026075 557062268 555873930 554190457 551962793 549261987 546191812 542918861
2916.6 542918861 539561987 536139965 532781541 529820263 527687609 526651442 526652396 527562141 529376447
2935 529376447 532122672 535819590 540360928 545386016 550477207 555421352 560304523 565365553 570685923
2953.4 570685923 576153338 581545234 586608052 591275156 595702410 600071728 604384780 608454823
2969.7 608454823 612169623 615630507 619100094 622849524 626822889 630580544 633732915 636307716
2986 636307716 638634026 641027153 643462062 645512521 646913111 647759855 648274004 648760140 649300575
3004.4 649300575 649594903 649349630 648608387 647603095 646533370 645467997 644237518 642617643 640623927
3022.7 640623927 638470829 636400759 634590149 632917583 630986094 628555775 625825703 623301208
$$ packed form
2900.3E59056580j030505r63807j188338j683473k227664k700806l070175l272951
2916.6E42918861l356874l422022l358424k961278k132654j036167R54R09745J814306
2935E29376447K746225L696918M541338N025088N091191M944145M883171N061030N320370
2953.4E70685923N467415N391896N062818M667104M427254M369318M313052M070043
2969.7F08454823L714800L460884L469587L749430L973365L757655L152371K574801
2986F36307716K326310K393127K434909K050459J400590Q46744N14149M86136N40435
3004.4F49300575K94328k45273p41243j005292j069725j065373j230479j619875j993716
3022.7F40623927k153098k070070j810610j672566j931489k430319k730072k524495
$$ plain form
3039 623301208 621177614 619101822 616666317 613860965 611018300 608382702 605965793 603601456 600985765
3057.4 600985765 598040581 595059514 592383325 590069234 587758064 585094571 582145095 579221547
3073.7 579221547 576624274 574357808 572066963 569473505 566603482 563625932 560784996 558196485
3090 558196485 555657327 553013086 550333798 547692478 545087099 542502403 540015757 537637055 535147905
3108.4 535147905 532398105 529685318 527388811 525328040 523082316 520469487 517551184 514667630
3124.7 514667630 512124658 509850383 507584155 505156279 502645314 500297487 498113334 495852500
3141 495852500 493513167 491214335 488923550 486707658 484687895 482703507 480511874 478164256 475821137
3159.4 475821137 473565787 471470684 469531000 467647851 465735167 463747054 461696386 459726393
$$ packed form
3039F23301208k123594k075792k435505k805352k842665k635598k416909k364337k615691
3057.4F00985765k945184k981067k676189k314091k311170k663493k949476k923548
3073.7E79221547k597273k266466k290845k593458k870023k977550k840936k588511
3090E58196485k539158k644241k679288k641320k605379k584696k486646k378702k489150
3108.4E35147905k749800k712787k296507k060771k245724k612829k918303k883554
3124.7E14667630k542972k274275k266228k427876k510965k347827k184153k260834
3141D95852500k339333k298832k290785k215892k019763j984388k191633k347618k343119
3159.4D75821137k255350k095103j939684j883149j912684j988113k050668j969993
$$ plain form
3175.7 459726393 457934290 456193894 454345047 452383399 450419813 448593736 446944863 445349902
3192 445349902 443692714 441991866 440296054 438648760 437120825 435657054 434134275 432546198 430952042
3210.3 430952042 429430872 428022563 426707864 425432086 424087822 422636062 421186179 419900775
3226.7 419900775 418812513 417796791 416684985 415310055 413805127 412496626 411415488 410459250
3243 410459250 409541100 408455342 407159239 405960292 405059248 404257834 403295517 402213275 401166439
3261.3 401166439 400206447 399388641 398758501 398203194 397464663 396511912 395559609 394698620 393885255 393061727
3281.7 393061727 392206520 391334534 390537471 389955908 389488071 388815582 387884021 386885434 385978967 385291070
3302.1 385291070 384812057 384276778 383375049 382097512 380747050 379601032 378674239 377822667 376910359
$$ packed form
3175.7D59726393j792103j740396j848847j961648j963586j826077j648873j594961
3192D45349902j657188j700848j695812j647294j527935j463771j522779j588077j594156
3210.3D30952042j521170j408309j314699j275778j344264j451760j449883j285404
3226.7D19900775j088262j015722j111806j374930j504928j308501j081138r56238
3243D10459250r18150j085758j296103j198947r01044q01414r62317j082242j046836
3261.3D01166439r59992q17806o30140n55307p38531r52751r52303q60989q13365q23528
3281.7C93061727q55207q71986p97063n81563m67837o72489r31561r98587r06467o87897
3302.1C85291070m79013n35279r01729j277537j350462j146018r26793q51572r12308
$$ plain form
3320.5 376910359 375947028 375003546 373997271 372912377 371861428 370816499 369783193 368849039 367877960
3338.8 367877960 366801649 365732938 364597082 363432467 362427980 361418754 360201448 358940154
3355.2 358940154 357805371 356738806 355617017 354534149 353763193 353181660 352275193 350856811 349375159
3373.5 349375159 348265290 347428679 346607268 345666111 344674587 343826234 343278229 343087673 342887729
3391.9 342887729 342206597 341342121 340871692 340647936 340136260 339305729 338598967 338144630 337766409 337399513
3412.3 337399513 336949378 336475223 336268544 336214483 336007237 335825264 335937440 336271018 336543322 336717874
3432.7 336717874 336980969 337133378 336967021 336842299 337040067 337566733 338266253 338743120 339078009 339599252
3453.1 339599252 340260476 340963185 341726452 342443079 343155891 344227910 345560253 346502215 346867204
$$ packed form
3320.5C76910359r63331r43482j006275j084894j050949j044929j033306r34154r71079
3338.8C67877960j076311j068711j135856j164615j004487j009226j217306j261294
3355.2C58940154j134783j066565j121789j082868p70956n81533r06467j418382j481652
3373.5C49375159j109869q36611q21411r41157r91524q48353n48005j90556j99944
3391.9C42887729o81132q64476m70429k23756n11676q30531p06762m54337l78221l66896
3412.3C37399513m50135m74155k06679n4061k07246j81973J12176L33578K72304J74552
3432.7C36717874K63095J52409j66357j24722J97768N26666O99520M76867L34889N21243
3453.1C39599252O61224P02709P63267P16627P12812J072019J332343R41962L64989
$$ plain form
3471.4 346867204 347216755 347921729 348942757 350139230 351138294 351840585 352647156 353614926 354545027
3489.8 354545027 355546385 356693864 357861608 358858109 359891176 361327231 362596095 363263398 364000797
3508.1 364000797 365108281 366320491 367484599 368542522 369544327 370716572 372256815 373758733
3524.4 373758733 374951988 376139075 377279371 378355324 379755765 381314129 382541686 383796573
3540.8 383796573 385605782 387789547 389496058 390574247 391979277 393813223 395467997 397101015
3557.1 397101015 398989201 400720447 402239919 404817492 408749372 411760867 413459361 415342689
3573.4 415342689 417850316 420692205 423662096 426428586 429038614 432457894 436603040 439784437
3589.7 439784437 442387491 445754439 449496359 453061044 456735104 460219264 463231176 466598183
$$ packed form
3471.4C46867204L49551P04974J021028J196473R99064P02291Q06571R67770R30101
3489.8C54545027J001358J147479J167744R96501J033067J436055J268864O67303P37399
3508.1C64000797J107484J212210J164108J057923J001805J172245J540243J501918
3524.4C73758733J193255J187087J140296J075953J400441J558364J227557J254887
3540.8C83796573J809209K183765J706511J078189J405030J833946J654774J633018
3557.1C97101015J888186J731246J519472K577573L931880L011495J698494J883328
3573.4D15342689K507627K841889K969891K766490K610028L419280M145146L181397
3589.7D39784437K603054L366948L741920L564685L674060L484160L011912L367007
$$ plain form
3606 466598183 470748335 474775642 478535652 482228875 485928684 490559667 495290130 498287171 500361443
3624.4 500361443 503715158 509617746 514951050 518057644 521069586 524378479 527862787 531511605
3640.7 531511605 534812152 537945688 542346537 548581958 553328812 555583239 558461785 562523067
3657 562523067 565941989 568690181 571341693 573978364 577188849 581312656 584761083 587716222 591832936
3675.4 591832936 595218599 597205281 599063098 600856125 603040993 606631994 610634208 612923622
3691.7 612923622 614254236 615719199 617444515 619641185 622086585 623815477 625042737 626716554
3708 626716554 629251599 631766975 633153677 634137869 635454118 637047291 638676345 640272617 641647160
3726.4 641647160 642669082 643818855 645707786 648166955 649942160 650379121 650613725 651965618 653890193
$$ packed form
3606D66598183M150152M027307L760010L693223L699809M630983M730463K997041K074272
3624.4E00361443L353715N902588N333304L106594L011942L308893L484308L648818
3640.7E31511605L300547L133536M400849O235421M746854K254427K878546M061282
3657E62523067L418922K748192K651512K636671L210485M123807L448427K955139M116714
3675.4E91832936L385663J986682J857817J793027K184868L591001M002214K289414
3691.7F12923622J330614J464963J725316K196670K445400J728892J227260J673817
3708F26716554K535045K515376J386702R84192J316249J593173J629054J596272J374543
3726.4F41647160J021922J149773J888931K459169J775205M36961K34604J351893J924575
$$ plain form
3744.7 653890193 654864967 656111062 658186316 659273207 659582615 660406291 661562741 662275553 662928998
3763.1 662928998 664025903 665363550 666697025 667536378 667929471 668632269 669987559 671386063 672132432
3781.4 672132432 672647536 673263371 673940957 674798191 675697565 676604152 677518189 678304434 679489613
3799.8 679489613 680812597 681499124 682193279 682654262 682513714 682700098 683811069 685237706 686330318
3818.1 686330318 687533617 688255072 688329339 688625336 689128876 689741194 690358281 691067100 692197263
3836.5 692197263 693250775 693763614 694097161 694231927 694038212 694004297 695021868 697188139 698179185
3854.8 698179185 697609901 697221637 697574019 698514163 699363053 699978113 700662553 701093972 701269269 701394558
3875.2 701394558 701701760 702416718 702991486 703470707 704022586 704198182 704590976 705285668 705404639 705275893
$$ packed form
3744.7F53890193R74774J246095K075254J086891L09408Q23676J156450P12812O53445
3763.1F62928998J096905J337647J333475Q39353L93093P02798J355290J398504P46369
3781.4F72132432N15104O15835O77586Q57234Q99374R06587R14037P86245J185179
3799.8F79489613J322984O86527O94155M60983j40548J86384J110971J426637J092612
3818.1F86330318J203299P21455P4267K95997N03540O12318O17087P08819J130163
3836.5F92197263J053512N12839L33547J34766j93715l3915J017571K166271R91046
3854.8F98179185n69284l88264L52382R40144Q48890O15060O84440M31419J75297J25289
3875.2G01394558L07202P14958N74768M79221N51879J75596L92794O94692J18971j28746
$$ plain form
3895.6 705275893 705653727 706498802 707440674 708070695 708022237 707636654 707452059 707563400 707992077 708710134
3916 708710134 709296644 709453464 709526539 709810436 710093558 710359812 710806251 711140573 711115181 711078942
3936.4 711078942 711281955 711727798 712195575 712377429 712537467 712934911 713338137 713584781 713707149 713722706
3956.8 713722706 713748634 713968337 714304149 714595973 714863598 715124607 715335250 715541542 715822458 716128945
3977.2 716128945 716329694 716394365 716392696 716443360 716694295 717055738 717288256 717392743 717512965 717706323
3997.6 717706323
$$ packed form
3895.6G05275893L77834Q45075R41872O30021m8458l85583j84595J11341M28677P18057
3916G08710134N86510J56820P3075K83897K83122K66254M46439L34322k5392l6239
3936.4G11078942K03013M45843M67777J81854J60038L97444M03226K46644J22368J5557
3956.8G13722706K5928K19703L35812K91824K67625K61009K10643K06292K80916L06487
3977.2G16128945K00749O4671j669N0664K50935L61443K32518J04487J20222J93358
3997.6G17706323
##END=$$ End of the data block
