##TITLE=$$ Begin of the data block
##JCAMP-DX=5.00 $$ ACD/SpecManager v 10.08
##SPECTROMETER/DATA SYSTEM=Alpha
##DATE=29 Dec 2014 11:22:02
##DATA TYPE=INFRARED SPECTRUM
##DATA CLASS=XYDATA
##ORIGIN=
##OWNER=
##NPOINTS=1765
##FIRSTX=399.76428223
##LASTX=3997.64306641
##MAXX=3997.64306641
##MINX=399.76428223
##MAXY=0.83662701
##MINY=0.28694308
##XFACTOR=1.0000000000
##YFACTOR=1.000000000000000e-9
##FIRSTY=0.56833100
##DELTAX=2.03961372
##XUNITS=1/CM
##YUNITS=ARBITRARY UNITS
##XYDATA=(X++(Y..Y))
399.8E68331003l246426j416743j312018j668334r53972J336038L529251L781318J411260
418.1E69791377k885461l898323k047181l89516p18177l082096m939497m306376j606345
436.5E45918405J576424L417968L221751J908183J674056L189385M569828L387094
452.8E68863094K205k491593k651513j195490j62542j147985l673435n095780m078805
471.2E48368156j989305p11501j184404k583682k868533j153052J167357J964748N82337
489.5E41592121j867950l227353k348363n58675J06871j385152l797293m601240l446400
507.9E20466566j776457j424789l011227n153060n929172m568666k156138l85344l56108
526.2D95705605j440168j463204M03195L187508N298107N614877M416645L074884K788305
$$ plain form
399.8 568331003 565084577 563667834 562355816 560687482 559733510 561069548 564598799 568380117 569791377
418.1 569791377 566905916 563007593 560960412 560570896 559852719 556770623 551831126 547524750 545918405
436.5 545918405 547494829 550912797 554134548 556042731 557716787 560906172 565476000 568863094
452.8 568863094 568865299 566373706 563722193 562526703 562364161 561216176 557542741 552446961 548368156
471.2 548368156 546378851 545667350 544482946 541899264 539030731 537877679 539045036 541009784 541592121
489.5 541592121 539724171 536496818 534148455 533589780 533696651 532311499 528514206 523912966 520466566
507.9 520466566 518690109 517265320 514254093 509101033 503171861 498603195 496447057 496061713 495705605
526.2 495705605 494265437 492802233 493205428 496392936 501691043 507305920 511722565 514797449 517585754
544.6E17585754L139198K393365M7684k586782l852606l240764k210558k527952m447818
562.9E04299521o748348p763028o650835m091561j664073l05175N29438K211898N053312
581.3D84871149P671714Q365691O631374L674626J574099J244188J809835J716554
597.6E17559230L73841j322985j814604m71651J485586K317250J579403M53532M69268
616E20628870K129018M279971N193889M309297K481699J443267K100944L501654L820181
634.3E49888790K326786K54691n40853M69625K165139K856493J820862m6432q48651
652.7E58346450L51429K266884K909064J651168l80635j312852K99990L698707L227174
671E71057379J352847K08378k21610Q56101K638281L267288J899540k44915j278103
$$ plain form
544.6 517585754 520724952 523118317 523166001 520579219 516726613 513485849 511275291 508747339 504299521
562.9 504299521 497551173 489788145 483137310 479045749 477381676 477076501 477605939 479817837 484871149
581.3 484871149 492542863 500908554 507539928 511214554 512788653 514032841 515842676 517559230
597.6 517559230 517933071 516610086 514795482 514323831 515809417 518126667 519706070 520159602 520628870
616 520628870 522757888 527037859 532231748 536541045 539022744 540466011 542566955 546068609 549888790
634.3 549888790 552215576 552470267 551929414 552399039 554564178 557420671 559241533 559195101 558346450
652.7 558346450 558697879 560964763 563873827 565524995 565144360 563831508 564131498 567830205 571057379
671 571057379 572410226 572618604 572396994 573253095 575891376 579158664 581058204 580813289 579535186
689.4E79535186o04212N72503N11229j335681l639757m580439l490150j249909M65453
707.7E66184223P66217L99590Q40902K706409N169272O762684O409704M764915L705740
726.1E97709656M194319N573809O077647M595518K017022K73168M04060J451194J451254
744.5F23747647n81503l521919n325377n104721l702283k815664l338515m361988m255950
762.8E90739727k194822J294375M473269N915641N912543N934059P034958Q716583
779.1F27826333R393513P998884N149484K830267K624094M077375N314231M953802
795.4F70167983L341555K075494K389729L844857M634142L548503J288890k86758k4676
813.8F90979719J504898K465010J515567q82149k968549l415168k606213k193510l434122
$$ plain form
689.4 579535186 578930974 579503477 580014706 578679025 575039268 570458829 566968679 565718770 566184223
707.7 566184223 566950440 567350030 568190932 570897341 576066613 582829297 589239001 594003916 597709656
726.1 597709656 601903975 607477784 613555431 618150949 620167971 620441139 620845199 622296393 623747647
744.5 623747647 623166144 619644225 614318848 609214127 605511844 602696180 599357665 594995677 590739727
762.8 590739727 588544905 589839280 594312549 600228190 606140733 612074792 619109750 627826333
779.1 627826333 637219846 645218730 650368214 653198481 655822575 659899950 665214181 670167983
795.4 670167983 673509538 675585032 677974761 681819618 686453760 690002263 691291153 691004395 690979719
813.8 690979719 692484617 694949627 696465194 695583045 692614496 689199328 686593115 684399605 680965483
832.2F80965483n748927p454873p396400n390048k705335j693487k899647m347324
848.5F43329442m400135l422796k863705l536582m476488l410399P24077O274283J0605574
866.8F38823271J2296140J1473060R228706P049382N587160L938794J023353k804637
883.2F86615229n952180p052779o236017m979431m732907n682707o602764o201506
899.5F39174938m787802l970981m832387o973624r062291j0018825r762168r036541
915.8E80730319q561790q156538o980658m729569k049863R1553J151383J350283J420081
934.1E54265201K092481L563404N158007N553246L603398m63843m874587q159995j0444760
952.5E50292552j2474478j4512181j6195238j7062425j7220825j7300368j7903924
$$ plain form
832.2 680965483 675216556 667761683 660365283 654975235 652269900 650576413 647676766 643329442
848.5 643329442 638929307 635506511 632642806 629106224 624629736 621219337 621943414 628217697 638823271
866.8 638823271 651119411 662592471 671821177 678870559 684457719 688396513 689419866 686615229
883.2 686615229 680663049 673610270 667374253 662394822 657661915 651979208 645376444 639174938
899.5 639174938 634387136 630416155 625583768 618610144 609547853 599529028 589766860 580730319
915.8 580730319 572168529 564011991 557031333 552301764 550251901 550343454 551494837 552845120 554265201
934.1 554265201 556357682 559921086 565079093 570632339 574235737 573771894 568897307 560737312 550292552
952.5 550292552 537818074 523305893 507110655 490048230 472827405 455527037 437623113
966.8D37623113j8983185j9693971j9305497j7964810j6248047j4547110j2836188
981.1C18044305j0830701q428156n848199l486008j697808o68973j41382M18872J181513
999.4B88543463J819074J933902J376063M00633m22657o42240k05725N09798J117230
1017.8B94429541J535684J931220K480030L180683L799498L957897L540725K770006
1034.1C17625284J958043J363873J057059Q33541N98192N77360J079798K243728L838002
1052.4C31174880N380988O460011P147491Q007288R288073J0066926Q470446L214211
1068.8C89210314m215897r765714j0522038p401943l428578m96805J328915K671719
1085.1C57379973L919125N118340O041020O237686N547523M311413L038257K022833
$$ plain form
966.8 437623113 418639928 398945957 379640460 361675650 345427603 330880493 318044305
981.1 318044305 307213604 298785448 292937249 289451241 287753433 287084460 286943078 287361950 288543463
999.4 288543463 290362537 292296439 293672502 294073135 293650478 293008238 292802513 293312311 294429541
1017.8 294429541 295965225 297896445 300376475 303557158 307356656 311314553 314855278 317625284
1034.1 317625284 319583327 320947200 322004259 322837800 323435992 324013352 325093150 327336878 331174880
1052.4 331174880 336555868 343015879 350163370 358170658 367458731 377525657 385996103 389210314
1068.8 389210314 384994417 375228703 364706665 357304722 353876144 353379339 354708254 357379973
1085.1 357379973 361299098 366417438 372458458 378696144 384243667 388555080 391593337 393616170
1101.4C93616170J363218J184612J582652K432436L441781M249096M471868L872573
1117.7D16214406K686471J636893J376509K089501L376484M449993M551113L414929
1134D39796299J362502j122743l675788n995393p645071q239865p740646o411851m702926
1152.4C95624518l149449k000213j010329K24501J923293L973812O113470Q106619
1168.7D09806222R851396J1370688J2631894J3516605J3845920J3474733J2584537
1183D97081995J1624873J0800719R842277Q307933O141126L911853K401650J915992
1199.3E52028418K122521K397656K383948K333641K733588L731847M905462N517006
1215.6E78154087N077660L750265K293408J338243P97332K02596p22349j741469k265632
$$ plain form
1101.4 393616170 394979388 396164000 397746652 400179088 403620869 407869965 412341833 416214406
1117.7 416214406 418900877 420537770 421914279 424003780 427380264 431830257 436381370 439796299
1134 439796299 441158801 440036058 436360270 430364877 422719806 414479941 406739295 400327444 395624518
1152.4 395624518 392475069 390474856 389464527 389689028 391612321 395586133 401699603 409806222
1168.7 409806222 419657618 431028306 443660200 457176805 471022725 484497458 497081995
1183 497081995 508706868 519507587 529349864 537657797 543798923 547710776 550112426 552028418
1199.3 552028418 554150939 556548595 558932543 561266184 563999772 567731619 572637081 578154087
1215.6 578154087 583231747 586982012 589275420 590613663 591410995 591613591 590891242 589149773 586884141
1234E86884141k027392j343191p55906n46992m72128o5327P92980J743674K248228
1252.3E86458087K041638J441657R91702R36151J246691J727342J997054J892567J639068
1270.7F00371957J453817J335501J055658L51370o32227j309216j266956p05064l15189
1289F00339651o21319j457631k223790k454877k162397j803338j759649j922488k052784
1307.4E83881378j890898j267969o39320n97596j096487j769960k335846k758920l330708
1325.8E68193674m257977n192935n506218m914224l542483j870394p58230n51939n23627
1344.1E41075647k31803R8646J79291j66834r12904j691938j838505j056612j23202
1362.5E35331786j93119r25124j600325j945913j329243j21892O13034J035035J537859
$$ plain form
1234 586884141 584856749 583513558 582757652 582210660 581738532 581673205 582466185 584209859 586458087
1252.3 586458087 588499725 589941382 590933084 591869235 593115926 594843268 596840322 598732889 600371957
1270.7 600371957 601825774 603161275 604216933 604568303 603936076 602626860 601359904 600654840 600339651
1289 600339651 599718332 598260701 596036911 593582034 591419637 589616299 587856650 585934162 583881378
1307.4 583881378 581990480 580722511 580083191 579485595 578389108 576619148 574283302 571524382 568193674
1325.8 568193674 563935697 558742762 553236544 548322320 544779837 542909443 542151213 541599274 541075647
1344.1 541075647 540843844 540942490 541121781 540954947 540042043 538350105 536511600 535454988 535331786
1362.5 535331786 535138667 534213543 532613218 530667305 529338062 529216170 529829204 530864239 532402098
1380.8E32402098K281726L764033N706787N725265L737211K348244J307845J79887
1397.1E57453096l76999q00074j225412j757800k368629k319992j816570j451612j224637
1415.5E44111371q42810p78138r29952j73330O10471Q61287Q61466K49147J63257J798153
1435.9E45930922K705693J407802O14465J05798k43425l50893p98762j373648j469672
1454.3E46528280r22382j153290j570940R775K664268L867745L882706O146431J0636807
1472.6E70089400J1489987R054363P544041O931305O635189O330251O878019P564723
1488.9F32517278O096840L571570L482997M889787M664540L340006K705633L818632
1505.2F65087283M869342K203941J307189K163053K618015K269804J863599K325594
$$ plain form
1380.8 532402098 534683824 538447857 544154644 549879909 553617120 555965364 557273209 557453096
1397.1 557453096 557076097 556276023 555050611 553292811 550924182 548604190 546787620 545336008 544111371
1415.5 544111371 543268561 542490423 541560471 541387141 541997612 542858899 543720365 543969512 544132769 545930922
1435.9 545930922 548636615 550044417 550658882 550764680 550521255 550170362 549371600 547997952 546528280
1454.3 546528280 545605898 544452608 542881668 542891443 545555711 549423456 553306162 559452593 570089400
1472.6 570089400 581579387 590633750 598177791 605109096 611744285 618074536 624952555 632517278
1488.9 632517278 638614118 642185688 645668685 650558472 655223012 658563018 661268651 665087283
1505.2 665087283 669956625 672160566 673467755 675630808 678248823 680518627 682382226 684707820
1521.6F84707820K071202J679540J410007O14643P74742J232862R37820J634001K966404
1539.9F98029041R54807j225769j131893j83045N81562L81231j95741j39594O61313
1558.3F97731912q53360k071201j543701j368761j478732j872003j731574o99520p34091
1576.6F85378969k243579k654373k275885j729786j381338j559019k219796k779662
1593F68535531k892614k617419k265095k354324k971471l550052l634751l485322l340781
1611.3F41423702l133654l183663m216254m329145l127933k493202k658606l005445
1627.6F15275800l361523k942622j332759J81794m89176j196921p99059J96516K098978
1646F07631028K579629J419485L268242M805624J503348J317025L246307M905582M539608
$$ plain form
1521.6 684707820 686779022 688458562 689868569 690483212 691257954 692490816 693428636 695062637 698029041
1539.9 698029041 698983848 697758079 696626186 696443141 697024703 697405934 697210193 697070599 697731912
1558.3 697731912 696878552 694807351 693263650 691894889 690416157 688544154 686812580 686113060 685378969
1576.6 685378969 683135390 680481017 678205132 676475346 675094008 673534989 671315193 668535531
1593 668535531 665642917 663025498 660760403 658406079 655434608 651884556 648249805 644764483 641423702
1611.3 641423702 638290048 635106385 630890131 626560986 623433053 620939851 618281245 615275800
1627.6 615275800 611914277 608971655 607638896 607820690 607331514 606134593 605335534 605532050 607631028
1646 607631028 610210657 611630142 614898384 619704008 621207356 622524381 625770688 630676270 635215878
1664.3F35215878L340006M184544N099178M323363M980028N341589L921390L569722
1680.7F69975698N217612P181287N036652L546595L521323L098488M034996M807294
1697G06419945M547894M137814K076089J325548J477837J514554K071739K608895K799630
1715.3G28979945K331972R24945P34866J691699K098143J762629J470029J656771K573669
1733.7G44224668K193987J397014J651227J503289J423120K164424L191352L593206
1750G61342287K608180J537025J645207K120913K558112K701938J785993J123071J177788
1768.4G78600514J658380K139032J528323P36355N40495N00024O72638J188278J438380
1786.7G89002419J314163J135289N67735J87695P93099J475453J256109L69847n6327
$$ plain form
1664.3 635215878 638555884 642740428 647839606 652162969 657142997 662484586 666405976 669975698
1680.7 669975698 675193310 682374597 687411249 690957844 694479167 697577655 701612651 706419945
1697 706419945 710967839 715105653 717181742 718507290 719985127 721499681 723571420 726180315 728979945
1715.3 728979945 731311917 732236862 732971728 734663427 736761570 738524199 739994228 741650999 744224668
1733.7 744224668 746418655 747815669 749466896 750970185 752393305 754557729 757749081 761342287
1750 761342287 763950467 765487492 767132699 769253612 771811724 774513662 776299655 777422726 778600514
1768.4 778600514 780258894 782397926 783926249 784662604 785203099 785703123 786375761 787564039 789002419
1786.7 789002419 790316582 791451871 792019606 792207301 793000400 794475853 795731962 796101809 796045482
1805.1G96045482L20614J041412J359999R07719L21150N2571K09689P84755J384199
1823.4H02427590J291633O22689Q0347k39014J46210Q30948Q64268L27169R0063K18511
1843.8H06660414K75433M22001M71294J18792k78712k52247K33710P26521P42257L79264
1864.2H09498727J17958Q106m6134K38538N62966L67582j04487k40684J64390P36415
1884.6H11303377R88484O72757q5890l90709J8418N18084O92248L99351j47938l60728
1905H13607454k4676M57764N79059K68698p9752k44736j42098L42131O78897L27885
1925.4H15770626k38419m53710j81377L43680O19114M25935M0650k21789k33769J58965
1945.8H16029906N62430M58538J9908k92122j92166K88547O99877N82636J12712k58267
$$ plain form
1805.1 796045482 796366096 797407508 798767507 799675226 799996376 800048947 800258636 801043391 802427590
1823.4 802427590 803719223 804341912 804422259 804183245 804329455 805160403 806024671 806351840 806441903 806660414
1843.8 806660414 806935847 807357848 807829142 807947934 807669222 807416975 807650685 808377206 809119463 809498727
1864.2 809498727 809616685 809624791 809578657 809817195 810380161 810747743 810643256 810402572 810566962 811303377
1884.6 811303377 812291861 812964618 812878728 812488019 812506437 813024521 813716769 814116120 813968182 813607454
1905 813607454 813582778 814040542 814619601 814888299 814808547 814563811 814421713 814763844 815442741 815770626
1925.4 815770626 815532207 815078497 814897120 815240800 815859914 816285849 816326499 816104710 815870941 816029906
1945.8 816029906 816592336 817050874 817070782 816778660 816586494 816875041 817574918 818157554 818270266 818011999
1966.2H18011999k69115J33813N72323N52178P3969l76582l71873Q2850N50509N56588
1986.6H19516659R8288l43681m28795r4295L85642M82261O2824m47095n59330j91986
2007H18480492K52246K64943j72257o26326p46131m67360p8678j19865n46455o96481
2027.4H15544128n23269k62916O4016J64151j63555n93424p17283m32372L8684K38120
2047.8H13356280j2576m07756n41329k39670K51472M79579K71499j64032m17769j86145
2068.2H12389553K96712N41329L11077j71245m16517j99914K68698N38528L47912o4015
2088.6H13842118k91288j50263K54571N67615M84526O6221k61247j43767K76983N80192
2109H15225661M55141J79l48091k68877J47581M73082L62337p3314l91662k95281J17719
$$ plain form
1966.2 818011999 817742884 817876697 818449020 819001198 819075167 818698585 818326712 818409562 818960071 819516659
1986.6 819516659 819614947 819271266 818842471 818748176 819133818 819616079 819678903 819231808 818672478 818480492
2007 818480492 818732738 818997681 818825424 818199098 817452967 816985607 816906929 816787064 816240609 815544128
2027.4 815544128 815020859 814757943 814821959 814986110 814822555 814229131 813511848 813079476 813118160 813356280
2047.8 813356280 813343704 812935948 812394619 812154949 812406421 812886000 813157499 812993467 812575698 812389553
2068.2 812389553 812686265 813227594 813538671 813367426 812950909 812750995 813019693 813558221 813906133 813842118
2088.6 813842118 813550830 813400567 813655138 814222753 814707279 814773500 814512253 814368486 814645469 815225661
2109 815225661 815680802 815680981 815332890 815064013 815211594 815684676 816047013 815973699 815582037 815286756 815404475
2131.4H15404475M88281M59135R775l82364l11017R5785M56214M60028Q7202k94268
2151.8H16473246k80857J26004N58018O20008K63929j30415j50263K59519P72714Q90792
2172.2H19402695M97222O1094K2173L98994Q33094Q84354M76301K2888l2365L14712
2192.6H22881162P08819P80642M68790O5863n1498K25305O65844Q68678N89311R5725
2213H27298641j01208J62601N93066P87735N45442M9293k24352J0193N18501P76589
2233.4H30416501N28037L3975k62857j04069L72707O79493M99368R537l13103j63734
2253.8H31695855L21090O90997N60641N7518l00228j71483L13938P25567O58035J39177
2274.2H34691107l00824k20836K65181O64592O10411J35005l37124l50237R6202N35131
$$ plain form
2131.4 815404475 815892756 816351891 816361666 815979302 815668285 815764070 816220284 816680312 816767514 816473246
2151.8 816473246 816192389 816318393 816876411 817496419 817760348 817629933 817479670 817739189 818511903 819402695
2172.2 819402695 819899917 819961011 819983184 820382178 821215272 822099626 822575927 822598815 822566450 822881162
2192.6 822881162 823589981 824370623 824839413 824905276 824853778 825079083 825744927 826613605 827202916 827298641
2213 827298641 827197433 827360034 827953100 828740835 829286277 829335570 829111218 829121411 829639912 830416501
2233.4 830416501 830944538 830978513 830715656 830611587 830984294 831663787 832163155 832172692 831859589 831695855
2253.8 831695855 832016945 832707942 833268583 833326101 833025873 832854390 833168328 833893895 834551930 834691107
2274.2 834691107 834390283 834169447 834434628 835099220 835709631 835844636 835507512 835157275 835253477 835788608
2294.6H35788608N22375P5996l93987m43876l8564M42147N39363J34945l74020n37991
2315H35714996k10464L23593N09978J29044m21822n79238k20239K67267L80993J5676
2335.4H35909784n28276p44164k80559L93212M32431r5188n66364p75158n50747J03474
2355.8H33298445N21719K03669m69267q04186m56870K97547P06374L49343l31998o21855
2376.2H32692921l04937K64287N29825K42651l31342o83904n22554j1861L48985K13563
2396.6H32437634k99692p35283o52432j41561K35319J14858l92318q55863q42452l67105
2417H28501105R5368N6386m85838r47058q79228m37439k5272O259m38929r80616j074493
2439.4H23390245o33776r8824K1159l77655r00626j039326o27041p7247J4722m23253
$$ plain form
2294.6 835788608 836310983 836386979 835992992 835549116 835510552 835952699 836492062 836627007 836252987 835714996
2315 835714996 835504532 835828125 836338103 836467147 836045325 835466087 835245848 835513115 835894108 835909784
2335.4 835909784 835381508 834637344 834356785 834749997 835182428 835087240 834520876 833745718 833194971 833298445
2355.8 833298445 833820164 834023833 833554566 832750380 832293510 832591057 833297431 833646774 833314776 832692921
2376.2 832692921 832387984 832652271 833182096 833424747 833093405 832409501 831886947 831875086 832224071 832437634
2396.6 832437634 832137942 831402659 830750227 830608666 830843985 830958843 830566525 829710662 828868210 828501105
2417 828501105 828596473 828652859 828167021 827219963 826340735 825903296 825878024 825884283 825445354 824464738 823390245
2439.4 823390245 822756469 822657645 822678804 822301149 821400523 820361197 819734156 819656909 819671631 819248378
2459.8H19248378r28759j024604o37829j18435P2360k50339p85709r99868o78897j43587
2480.2H13752711J09851j68323p26581r90093o81579p9274K51472L576n06460p59602
2500.6H10205698n64396p8798K61307P6771m85182q77976p18534j86563J69277O199
2521H07807803m99785q87871q40544m06206j5616j23263o51002j087308j053631n80490
2541.4H01662087j21533j33932o02901j076043j069247n77987j00076r4831n59389
2559.7G97326148j058817j101971o63400j81615o3896m22478r54747j128197p44283
2578.1G91006744k11299o3538l49641p61151r26435o08444n1201J87874j23084o40094
2598.5G87459731q74579o56843k08676J1265k90930q80241j216710j025438n32747
$$ plain form
2459.8 819248378 818319619 817295015 816657186 816538751 816611111 816360772 815575063 814575195 813896298 813752711
2480.2 813752711 813862562 813694239 812967658 811977565 811295986 811216712 811468184 811471760 810965300 810205698
2500.6 810205698 809641302 809562504 809823811 809900582 809415400 808537424 807818890 807632327 807801604 807807803
2521 807807803 807308018 806420147 805579603 805173397 805157781 805034518 804383516 803296208 802242577 801662087
2541.4 801662087 801540554 801406622 800803721 799727678 798658431 798080444 797980368 797885537 797326148
2559.7 797326148 796267331 795165360 794501960 794320345 794256449 793833971 792879224 791751027 791006744
2578.1 791006744 790795445 790731907 790382266 789621115 788694680 788086236 788035035 788222909 788099825 787459731
2598.5 787459731 786585152 785928309 785719633 785730898 785439968 784559727 783343017 782317579 781784832
2616.8G81784832k39491m66466j030445j397073j241207p70927m82082o80328j203119
2635.2G74273694j597166j478673r77635o27279p28548j181543j552581j451493r97126
2653.5G63681650o21319o62088j109183j499832j416504r68337n42760n20527r32396
2671.9G55408704j337409j321077q76546m06206l57389p77185j263678j329601r14991
2690.3G46824622m64678l99828p74443j279652j461685j184940p58648o44505r96351
2708.6G38859892j461685j591623j299023q80003p10547r12011j210809j222014q70109
2727G28702068m05371j93655m43995q87931j079023q77022m33147j44601l37005q15511
2747.4G23084807j070201q82685m83334k06530k87116o96242j020610q99911m79877
$$ plain form
2616.8 781784832 781545341 781078875 780048430 778651357 777410150 776639223 776157141 775476813 774273694
2635.2 774273694 772676528 771197855 770220220 769592941 768864393 767682850 766130269 764678776 763681650
2653.5 763681650 763060331 762398243 761289060 759789228 758372724 757404387 756861627 756341100 755408704
2671.9 755408704 754071295 752750218 751873672 751467466 751110077 750332892 749069214 747739613 746824622
2690.3 746824622 746359944 745960116 745185673 743906021 742444336 741259396 740500748 739856243 738859892
2708.6 738859892 737398207 735806584 734507561 733627558 732917011 732005000 730794191 729572177 728702068
2727 728702068 728296697 728103042 727659047 726771116 725692093 724815071 724381924 724237323 723900318 723084807
2747.4 723084807 722014606 721131921 720648587 720442057 720154941 719458699 718438089 717538178 717058301
2765.7G17058301j88708k94805p23600j117349j127124q05259n64336o88792j120686
2784.1G10427642j528323j573920j301050j025558j023650j373470j813829j964450
2800.4F98823392j763165j514434j549125j881540k249539k396285k238274j987994
2816.7F83243036k000689k397716k935350l251076l248095l111780l134012l407240
2833F59757078l603340l417193k975047k583325k442181k653837l084779l343523l166914
2851.4F32486939k699375k371847k546370l197134l881276m164218m071475m025578
2867.7F05529666m305303m762709n131424n205154m865945m263162l682435l231942
2884E70081592k809883k214431j434028p70271n21243o83606r83893j120866j025557
$$ plain form
2765.7 717058301 716869593 716574788 715851188 714733839 713606715 712801456 712237120 711548328 710427642
2784.1 710427642 708899319 707325399 706024349 704998791 703975141 702601671 700787842 698823392
2800.4 698823392 697060227 695545793 693996668 692115128 689865589 687469304 685231030 683243036
2816.7 683243036 681242347 678844631 675909281 672658205 669410110 666298330 663164318 659757078
2833 659757078 656153738 652736545 649761498 647178173 644735992 642082155 638997376 635653853 632486939
2851.4 632486939 629787564 627415717 624869347 621672213 617790937 613626719 609555244 605529666
2867.7 605529666 601224363 596461654 591330230 586125076 581259131 576995969 573313534 570081592
2884 570081592 567271709 565057278 563623250 562852979 562331736 561648130 560664237 559543371 558517814
2902.4E58517814r63629j194536j682937k243579k714395l026367l197133l325999
2918.7E40169239l469586l425300k961457k090931j024306j4484Q99971J810968K753973
2937E32648087L722727M558086N040050N096674M899084M849494N102515N373478N456030
2955.4E76746225N348325N064964M711748M473149M410029M347026M069984L671110
2971.7F12842560L437161L529907L854274M020334L710270L089070K584755K408028
2988F39476359K478123K474188K056182J394212Q37565N34892N43773N77628K84553
3006.4F50657475k54154p17640r59516j045346j098096j272560j614630j933992k076923
3024.7F39684618k021850j799821j717091k010763k488076k725423k451837k071261
$$ plain form
2902.4 558517814 557554185 556359649 554676712 552433133 549718738 546692371 543495238 540169239
2918.7 540169239 536699653 533274353 530312896 528221965 527197659 527183175 528083146 529894114 532648087
2937 532648087 536370814 540928900 545968950 551065624 555964708 560814202 565916717 571290195 576746225
2955.4 576746225 582094550 587159514 591871262 596344411 600754440 605101466 609171450 612842560
2971.7 612842560 616279721 619809628 623663902 627684236 631394506 634483576 637068331 639476359
2988 639476359 641954482 644428670 646484852 647879064 648716629 649251521 649795294 650372922 650657475
3006.4 650657475 650403321 649685681 648726165 647680819 646582723 645310163 643695533 641761541 639684618
3024.7 639684618 637662768 635862947 634145856 632135093 629647017 626921594 624469757 622398496
3041.1F22398496k120376k495229k803862k840936k661229k415299k325714k589941
3057.4F02145910k956331l006219k702475k344549k325892k641499k912581k902866
3073.7E80353498k606570k289832k313495k609849k866327k981723k865970k589822
3090E59229910k506435k636432k714277k676188k628863k599597k512515k431750k543688
3108.4E35980165k781332k694129k248705k030790k226829k636552k986610k906501
3124.7E15468717k496183k228618k280056k488494k573908k390563k190233k247542
3141D96573120k365827k363980k319902k168119j965106j994580k223491k362341k365798
3159.4D76443976k290308k120078j954973j914292j980841k049864k058685j945585
$$ plain form
3041.1 622398496 620278120 617782891 614979029 612138093 609476864 607061565 604735851 602145910
3057.4 602145910 599189579 596183360 593480885 591136336 588810444 586168945 583256364 580353498
3073.7 580353498 577746928 575457096 573143601 570533752 567667425 564685702 561819732 559229910
3090 559229910 556723475 554087043 551372766 548696578 546067715 543468118 540955603 538523853 535980165
3108.4 535980165 533198833 530504704 528255999 526225209 523998380 521361828 518375218 515468717
3124.7 515468717 512972534 510743916 508463860 505975366 503401458 501010895 498820662 496573120
3141 496573120 494207293 491843313 489523411 487355292 485390186 483395606 481172115 478809774 476443976
3159.4 476443976 474153668 472033590 470078617 468164325 466183484 464133620 462074935 460129350
3175.7D60129350j767635j751423j872837j961440j968682j849443j679122j607657
3192D45671111j629173j671613j704037j670569j556367j487106j526356j595854j614660
3210.3D31215376j533449j397520j286000j257599j372784j493484j442343j282841
3226.7D20149356j144439j078397j136213j370401j508951j330793j093507r66727
3243D10519928r43601j071334j234293j175314r16839q13723r79542j119882j098961
3261.3D01166439r77695p77006n93305n37961p15524r72122j004607q96782q20100
3279.7C93871337q24660r16690r35643p69020n31137m72873o76453r27478j054675
3298C86762708r67532o67930m39494n74410r66162j282990j319498j113355r32187
$$ plain form
3175.7 460129350 458361715 456610292 454737455 452776015 450807333 448957890 447278768 445671111
3192 445671111 444041938 442370325 440666288 438995719 437439352 435952246 434425890 432830036 431215376
3210.3 431215376 429681927 428284407 426998407 425740808 424368024 422874540 421432197 420149356
3226.7 420149356 419004917 417926520 416790307 415419906 413910955 412580162 411486655 410519928
3243 410519928 409576327 408504993 407270700 406095386 405178547 404364824 403385282 402265400 401166439
3261.3 401166439 400188744 399411738 398818433 398280472 397564948 396592826 395588219 394691437 393871337
3279.7 393871337 393046677 392129987 391194344 390425324 389894187 389421314 388744861 387817383 386762708
3298 386762708 385795176 385127246 384687752 384113342 383147180 381864190 380544692 379431337 378499150
3316.4C78499150r13709r56267r56536r53197j052111j129300j072675j018643r74924
3334.8C69471788r13381r83656j114338j164645j209945j125276r24468j005560j252681
3353.1C59777838j250952j114876j085043j164525j124621q02844o25283r52274j408875
3371.5C50248545j459777j144916q82238q29369r22113r75818q51005n68062k11150
3389.8C42404097k09748o85603q58754m69267k10285m69953q06391p24703m97789m08977
3410.2C37062627l67612m21524m63545k52455o4284j55598j79291N0277K57045K22832
3430.6C35688472J95235K89559J42276j58757r9122K24382N62757P44879M87924L05563
3451C38383168M92394O11931O55025P67201P69258Q05080J125187J276344Q46147L38674
$$ plain form
3316.4 378499150 377585441 376629174 375672638 374719441 373667330 372538030 371465355 370446712 369471788
3334.8 369471788 368558407 367574751 366460413 365295768 364085823 362960547 362036079 361030519 359777838
3353.1 359777838 358526886 357412010 356326967 355162442 354037821 353234977 352609694 351657420 350248545
3371.5 350248545 348788768 347643852 346761614 345932245 345010132 344034314 343183309 342615247 342404097
3389.8 342404097 342194349 341508746 340649992 340180725 339970440 339500487 338694096 337969393 337471604 337062627
3410.2 337062627 336695015 336273491 335809946 335557491 335493207 335337609 335158318 335208595 335465640 335688472
3430.6 335688472 335883707 336173266 336315542 336156785 336057663 336282045 336844802 337589681 338077605 338383168
3451 338383168 338875562 339487493 340142518 340909719 341678977 342484057 343609244 344885588 345731735 346070409
3471.4C46070409M06414P74235J050949J178175R63628P06494Q40813R67264Q70913
3489.8C53829294R50069J218885J313209J058966R91047J345277J188755O32941P89553
3508.1C63317996J215935J240075J127779J072794J074702J225650J528591J463264
3524.4C73266786J203418J241148J182913J121641J438439J556426J217574J272410
3540.8C83500755J832962K163768J682222J120776J495659J909077J645893J550078
3557.1C96901190J847804J823306J676381K673715L950149K976268J632631J847088
3573.4D15328532K537966K915681L026306K812356K698720L519743M201025L196686
3589.7D40237015K596379L360808L768474L612220L713280L544450L117472L443569
$$ plain form
3471.4 346070409 346476823 347251058 348302007 349480182 350443810 351150304 351991117 352958381 353829294
3489.8 353829294 354779363 355998248 357311457 358370423 359361470 360706747 361895502 362528443 363317996
3508.1 363317996 364533931 365774006 366901785 367974579 369049281 370274931 371803522 373266786
3524.4 373266786 374470204 375711352 376894265 378015906 379454345 381010771 382228345 383500755
3540.8 383500755 385333717 387497485 389179707 390300483 391796142 393705219 395351112 396901190
3557.1 396901190 398748994 400572300 402248681 404922396 408872545 411848813 413481444 415328532
3573.4 415328532 417866498 420782179 423808485 426620841 429319561 432839304 437040329 440237015
3589.7 440237015 442833394 446194202 449962676 453574896 457288176 460832626 463950098 467393667
3606D67393667M157692M036158L793389L718763L695399M632205M762947L033161K137333
3624.4E01360714L477157O030261N292535K988577L014326L417671L582716L674388
3640.7E32838345L293335L140688M413247O217182M701853K252876K914608M086554
3657E63858688L427863K750397K646982K670587L316938M244328L461182K916098M163325
3675.4E93456388L399193J880228J742483J752138K230584L664792M014075K235353
3691.7F14375234J302659J474917J705349K145588K476335J851797J291811J657903
3708F28281593K526403K530694J368463R44018J301468J603007J631617J541377J268863
3726.4F42997503R83239J255869K049983K500653J702190L94225K87592J437605J883924
$$ plain form
3606 467393667 471551359 475587517 479380906 483099669 486795068 491427273 496190220 499223381 501360714
3624.4 501360714 504837871 510868132 516160667 519149244 522163570 525581241 529163957 532838345
3640.7 532838345 536131680 539272368 543685615 549902797 554604650 556857526 559772134 563858688
3657 563858688 567286551 570036948 572683930 575354517 578671455 582915783 586376965 589293063 593456388
3675.4 593456388 596855581 598735809 600478292 602230430 604461014 608125806 612139881 614375234
3691.7 614375234 615677893 617152810 618858159 621003747 623480082 625331879 626623690 628281593
3708 628281593 630807996 633338690 634707153 635651171 636952639 638555646 640187263 641728640 642997503
3726.4 642997503 643980742 645236611 647286594 649787247 651489437 651883662 652171254 653608859 655492783
3744.7F55492783Q84056J305222K179146J045704J74880O85275J075387P18176O95765
3763.1F64256394J124144J347005J340091Q47280M01080P05480J401961J472533P22349
3781.4F73618317M26173N74648P08580Q97348Q88467Q95500R58145Q27432J174092
3799.8F80968702J307726P05957P16329M71055j61051J50561J118958J457572J115322
3818.1F87851131J249135O91175J4186L52561N21839N13077O09755P95305J148462
3836.5F93746626J060605N75722L42548M7862k57492J9431J140833K244651R44496
3854.8F99865282o77944m96447L03448R39846P89761N47648O95288M95374K64645K09748
3875.2G02936649L33906O66499M93109M23551N25653J38819L49820O78777J23740j05441
$$ plain form
3744.7 655492783 656376839 657682061 659861207 660906911 661081791 661767066 662842453 663560629 664256394
3763.1 664256394 665380538 666727543 668067634 668914914 669315994 670021474 671423435 672895968 673618317
3781.4 673618317 674044490 674619138 675327718 676225066 677113533 678009033 678967178 679794610 680968702
3799.8 680968702 682276428 682982385 683698714 684169769 684008718 684159279 685278237 686735809 687851131
3818.1 687851131 689100266 689791441 689805627 690158188 690680027 691193104 691802859 692598164 693746626
3836.5 693746626 694807231 695382953 695725501 695773363 695515871 695535302 696676135 698920786 699865282
3854.8 699865282 699187338 698690891 698994339 699934185 700723946 701271594 701966882 702462256 702726901 702936649
3875.2 702936649 703270555 703937054 704430163 704853714 705379367 705518186 705868006 706546783 706670523 706565082
3895.6G06565082M64976J010477J038254N35369j95027m41134j62184J55151M61757
3914G09432721P17163N34654J45972J58012L26693K34902K26736L69966K20477k5451
3934.4G12341845M3273K72632N00202M86970J92165J70827L44932L33369K22206J01745
3954.8G15010166M0353P8082K00212L25918L41356K62737J92821J79112K18689K95937
3975.2G17145383L05236J65045M7565O7234J19924K32935L48985K95699J43707N9485
3995.6G18931198J40011
3997.6G19071209
$$ plain form
3895.6 706565082 707030058 708040535 709078789 709614158 709419131 708977997 708815813 708970964 709432721
3914 709432721 710149884 710684538 710830510 710988522 711315215 711550117 711776853 712146819 712367296 712341845
3934.4 712341845 712385118 712657750 713157952 713644922 713837087 714007914 714352846 714686215 714908421 715010166
3954.8 715010166 715050519 715128601 715328813 715654731 715996087 716258824 716451645 716630757 716849446 717145383
3975.2 717145383 717450619 717615664 717663229 717730463 717850387 718083322 718432307 718728006 718871713 718931198
3995.6 718931198 719071209
3997.6 719071209
##END=$$ End of the data block
