##TITLE=$$ Begin of the data block
##JCAMP-DX=5.00 $$ ACD/SpecManager v 10.08
##SPECTROMETER/DATA SYSTEM=Alpha
##DATE=29 Dec 2014 11:22:02
##DATA TYPE=INFRARED SPECTRUM
##DATA CLASS=XYDATA
##ORIGIN=
##OWNER=
##NPOINTS=1765
##FIRSTX=399.76428223
##LASTX=3997.64306641
##MAXX=3997.64306641
##MINX=399.76428223
##MAXY=0.84076959
##MINY=0.26442409
##XFACTOR=1.0000000000
##YFACTOR=1.000000000000000e-9
##FIRSTY=0.59091586
##DELTAX=2.03961372
##XUNITS=1/CM
##YUNITS=ARBITRARY UNITS
##XYDATA=(X++(Y..Y))
399.8 590915859 582381845 576760590 575225234 575979412 576182663 575500906 575858891 578071892 580862939
418.1 580862939 581048489 577735007 573631346 571226478 570194781 567691088 562661648 557464659 555219531
436.5 555219531 556587160 559698224 562847078 565846920 569719255 574519932 578426957 579725206
452.8 579725206 578826249 577756107 577571094 577218592 575240672 571423948 567202985 564387858 562686503
471.2 562686503 559960544 555820882 552084446 550280631 550379694 550885618 550343931 548954725 548188090
489.5 548188090 548537552 548696935 547202110 544157624 541078746 539162338 537989259 535960078 532150865
507.9 532150865 527498484 523470640 520315647 516951382 512116551 506363094 501829982 499744415
524.2 499744415 499420345 499155551 498170793 497562230 499171644 503577411 509448051 514844179 519013762
542.5 519013762 522551000 525743663 527575374 526899576 524019957 520658255 518199325 516009271 512243509
560.9 512243509 506144166 498833925 491761327 485460073 479918987 475410819 472884148 473621696 478113681
579.3 478113681 485224247 492892146 499669015 505603671 511165202 515886784 518527508 518686891 517663896
597.6 517663896 517221034 517891526 518617809 518288672 517291546 517198920 518949926 521816134 524332762
616 524332762 526173592 528512001 532312095 537256360 541916370 545064151 546963632 548971355 551880777
634.3 551880777 554917276 556772232 557263553 557560384 558871210 561072588 562926352 563574255 563592494
652.7 563592494 564348400 566287220 568426609 569533050 569578946 569754362 571380973 574554682 576476872
671 576476872 576924801 577227473 578624070 581293941 583942413 585230768 585254133 585383356 586528122
689.4 586528122 587872565 587676227 585328519 582088351 579498768 577659547 575515687 572532058 569807589
707.7 569807589 569200277 571404219 575305104 579204798 582583725 586644113 592642307 599958539 606662750
726.1 606662750 611507356 615109205 619044662 623815477 628157139 630492687 630813360 630648017 631067514
744.5 631067514 631143153 629104435 624589741 619107127 614451051 610898614 607295036 602940917 598764420
762.8 598764420 596606195 597632527 601351917 606271446 611640275 618271232 627110481 637292206
779.1 637292206 646497786 653163373 657892227 662513137 667904675 673183620 677011430 679436564
795.4 679436564 682163119 686595559 692066312 696483552 698633730 699505746 700975180 703528821 705753744
813.8 705753744 706215501 705272257 704566061 705011308 705644667 704499245 700829864 696014583 691804409
832.2 691804409 688413143 684547722 679162562 673021972 667949438 664597750 661808252 658002853
848.5 658002853 652834177 647396386 642656863 638308227 633752763 630170345 630507052 636535645 647124469
866.8 647124469 659658492 671798289 682259321 691000938 698367357 703630507 705150425 702518463
883.2 702518463 697529614 692427278 687861562 682983100 677100241 670784056 665302873 661145151
899.5 661145151 657313824 652240098 645349324 637440920 629390776 620977342 611311674 600201368
915.8 600201368 588947058 579549670 573153794 569390535 567060769 565498352 565172434 566784561
932.1 566784561 570104539 574126840 578243434 582847893 588427901 593913496 596602857 594348431
948.4 594348431 587263584 577005148 564994037 551576078 536486626 519736409 501940489 483722121
964.7 483722121 465040237 445378542 424474686 402733535 380955666 359886795 340034217
979 340034217 321805775 305752993 292452723 282202750 274855435 269892067 266720355 264961988
995.3 264961988 264424086 264869392 265870661 266854018 267295271 267005563 266215175 265342772 264758676 264678538
1015.7 264678538 265309781 266889304 269530654 273154616 277471930 282049656 286606044 291078448
1032 291078448 295216590 298468649 300375283 301067591 301255345 301685363 302708685 304446965 307222635
1050.4 307222635 311593562 317994565 326331109 336046040 346693903 358157367 369748712 379032433
1066.7 379032433 382144183 376639575 364534259 351362497 341849357 337292403 336654156 338630319
1083 338630319 342447758 347691804 354179025 361703902 369590580 376771688 382401586 386210471 388366222
1101.4 388366222 389414400 390296727 392080009 395358086 399963021 405135393 409917742 413657963
1117.7 413657963 416259497 418141335 419954598 422321469 425678194 430100203 435037285 439268976
1134 439268976 441280305 439840615 434686065 426759094 417612374 408520997 400198877 393055290 387432665
1152.4 387432665 383669704 381987333 382322848 384439021 388326198 394364238 403027654 414357185
1168.7 414357185 427748203 442245632 457056195 471876681 486773759 501611590 515702128
1183 515702128 528280973 539089441 548291147 555970728 561896205 565804780 567986012 569403708
1199.3 569403708 571000040 573056102 575314403 577640355 580477178 584479511 589719236 595366895
1215.6 595366895 600240171 603716075 605966091 607362866 607913971 607307851 605470598 602967560 600644529
1234 600644529 598878860 597372472 595761657 594301105 593716562 594462812 596254885 598320484 600109220
1252.3 600109220 601642609 603175759 604694903 605864882 606499732 607013822 608196855 610405147 613088489
1270.7 613088489 615222573 616196930 616231680 615918219 615566850 615057647 614176154 612959325 611722946
1289 611722946 610699356 609621286 607956886 605545878 602805734 600323200 598294556 596339762 594027400
1307.4 594027400 591588676 589660108 588495255 587723792 586719155 585121036 582899570 580000281
1323.7 580000281 576170862 571180165 565232456 559126318 553867996 550079048 547712147 546323001
1340 546323001 545645893 545672953 546342850 547264516 547816336 547689021 547025502 546222091 545626044 545163035
1360.4 545163035 544438303 543506444 542838573 542698860 543229163 544278920 545419872 546349883 547262549
1378.8 547262549 548475623 550296009 553140700 557234764 561742425 565543234 568399966 569911599
1395.1 569911599 569757223 568463504 566979766 565659702 564048767 561958313 559539318 557077050
1411.4 557077050 555122197 553883374 552843332 551617324 550892591 551052988 551916718 553239286 554676533
1429.8 554676533 556077600 557650149 559679925 561978877 563948750 565573037 566834629 567690790
1446.1 567690790 567963600 567496717 566450179 565053403 562913060 560626626 560274363 561474502 563892484
1464.5 563892484 567551792 572376311 579221427 589190066 599623024 608195007 615753055 623120546
1480.8 623120546 630455136 637186587 643339157 649165869 654531121 659143031 663593531 668127000
1497.1 668127000 671853065 674844265 677785814 681343913 685325682 687832773 689491808 691341996
1513.4 691341996 693662405 696329653 698681951 700448036 701817393 703333616 705193400 706955671
1529.7 706955671 708327532 709204376 710097194 711541712 713288367 714002907 713793874 713575721 713784933
1548.1 713784933 714305937 714669287 714669049 714473486 713592708 711846948 710915506 709983706 708526731 706695259
1568.5 706695259 704735100 703444839 702176213 699536443 696598232 694474161 692688167 690870583
1584.8 690870583 688604057 685794830 682878137 680341005 678075850 675623834 672729909 669539094
1601.1 669539094 666517258 663920045 661356688 658152878 654474735 651108205 647799790 643986225
1617.4 643986225 640886366 638119340 634582460 631218314 628490150 626030326 624185801 622797012
1633.7 622797012 621281326 620446503 620678544 621362209 622232795 623441279 625257850 627490044 630489171
1652.1 630489171 634003401 636493087 639052689 642535627 646909118 651249826 654897630 658757806
1668.4 658757806 663425446 668146074 673121572 678110480 682341099 686473846 691528320 697820485
1684.7 697820485 702800989 706424057 709977508 713558257 717676461 721894920 725039899 727407515
1701.1 727407515 729455352 731671453 733977377 735772431 737165868 738600731 740435123 742685735
1717.4 742685735 744607389 745929539 747059107 748476148 750409782 752654731 754672408 756110787
1733.7 756110787 757213175 758720279 760815024 762935042 764681816 766362250 768439293 771112502
1750 771112502 773979902 776367366 778292835 780141652 782240450 784621835 786715925 788233638 789440572
1768.4 789440572 790769517 792384148 793877661 794905126 795573771 796207070 797165453 798432946 799610496
1786.7 799610496 800453067 800996423 801569283 802539408 803695500 804544091 804900348 805209398 805966496
1805.1 805966496 807106674 808123529 808618069 808804572 809241652 810106814 811100125 811775386 812004268
1823.4 812004268 812163115 812764525 813688457 814327657 814466178 814368784 814536393 815234840 816076159 816398442
1843.8 816398442 816127956 815954626 816252530 816883385 817323446 817257464 816983402 817057312 817615628 818250418
1864.2 818250418 818495333 818232000 817983329 818315864 818985224 819395423 819345772 819186151 819396794 820052743
1884.6 820052743 820741832 820976675 820778728 820732832 821146607 821758986 822071791 821911931 821628988 821706593
1905 821706593 822176278 822580695 822537303 822237611 822181880 822515965 822944939 823096693 822882473 822643518
1925.4 822643518 822781980 823237419 823594570 823561668 823282421 823178232 823475420 823928773 824075639 823859513
1945.8 823859513 823676407 823871732 824368536 824754477 824781895 824596882 824564576 824891269 825369179 825592101
1966.2 825592101 825453639 825292885 825436294 825825930 826139510 826153100 825967073 825898230 826103866 826397657
1986.6 826397657 826472998 826253176 826003313 826048732 826326430 826491952 826355875 826037943 825847328 825925350
2007 825925350 826049626 825897157 825438738 824964583 824707270 824578285 824277103 823591948 822777808 822399497
2027.4 822399497 822504699 822614789 822377920 821822405 821267486 820986807 820942700 820853770 820514798 820040643
2047.8 820040643 819741905 819769084 819943964 819967628 819772422 819568455 819616556 819916785 820155680 820129395
2068.2 820129395 819962144 819919467 820115268 820375025 820445120 820283055 820122123 820216000 820538461 820809126
2088.6 820809126 820847511 820762336 820802927 821085572 821464658 821690738 821675241 821592212 821712017 822072506
2109 822072506 822383821 822418392 822274685 822222054 822430134 822749317 822863102 822696030 822494209 822530687
2129.4 822530687 822814822 823074222 823065162 822859585 822757304 822919726 823205173 823337436 823200703 823002100
2149.8 823002100 823056340 823406219 823767900 823868155 823782086 823868752 824290633 824817955 825151384 825283587
2170.2 825283587 825481594 825961292 826651812 827239513 827523589 827647388 827945232 828560233 829229653 829594076
2190.6 829594076 829631925 829684198 830067933 830708385 831220090 831387579 831430197 831708550 832292676 832894862
2211 832894862 833200276 833235085 833334982 833748877 834359765 834788203 834848344 834793866 834994793 835489571 835946143
2233.4 835946143 836085379 836011469 836051881 836388230 836869240 837159455 837150216 837078571 837215662 837582171
2253.8 837582171 837926388 838017225 837916017 837905586 838181019 838602901 838874817 838916361 838911414 839072108
2274.2 839072108 839411497 839722574 839832425 839794934 839824438 840075195 840429842 840595841 840485036 840310156
2294.6 840310156 840331197 840573847 840769589 840705097 840468645 840317786 840400755 840595365 840665996 840534866
2315 840534866 840321600 840167642 840109050 840052009 839895368 839644253 839411914 839338124 839336753 839131773 838687122
2337.4 838687122 838263035 838082790 838158786 838297188 838360131 838299572 838082969 837803900 837521613 837176442
2357.8 837176442 836816490 836500466 836335540 836386502 836458027 836392283 836282015 836290240 836506903 836816311
2378.2 836816311 836977065 836912870 836786807 836776972 836848497 836812675 836571693 836207986 835917115 835821331 835791826
2400.6 835791826 835588813 835161209 834714532 834461272 834356844 834145129 833689153 833130777 832660973 832326591
2421 832326591 832036972 831630409 831031442 830400765 829935133 829598010 829211354 828648984 827955902 827353537
2441.4 827353537 826952755 826578379 826046348 825375795 824708581 824186087 823836446 823490620 822950065 822261989
2461.8 822261989 821667492 821290493 820981026 820521533 819911063 819351077 818963945 818667054 818295598 817753613
2482.2 817753613 817138731 816671431 816416860 816212475 815881908 815409422 814960182 814681888 814546585 814378679
2502.6 814378679 814010084 813520253 813148439 812980235 812845945 812536240 812062263 811619580 811340094 811131358
2523 811131358 810775220 810173929 809479177 808932900 808580637 808216274 807639837 806890905 806184351 805669606
2543.4 805669606 805281997 804816544 804142058 803368270 802733839 802294731 801864982 801279187 800553620 799864769
2563.8 799864769 799376011 799010038 798553765 797913432 797200024 796604514 796158910 795714438 795156896 794529498
2584.2 794529498 793966472 793575406 793297827 792936504 792401612 791846693 791482627 791276157 790998995 790534854
2604.6 790534854 789939642 789328396 788806736 788346767 787755013 786927044 786008358 785203516 784516335 783744752
2625 783744752 782748878 781612813 780535042 779618561 778737366 777699828 776506424 775313795 774267614
2643.4 774267614 773363650 772423804 771318376 770126998 769026041 768092573 767224610 766254127 765141547
2661.7 765141547 764044404 763118863 762322366 761508346 760568798 759523690 758571148 757846832 757200778
2680.1 757200778 756394744 755414426 754449010 753637433 752960503 752247334 751311719 750198185 749161601
2698.4 749161601 748320460 747487605 746450841 745233595 744034469 743012369 742146909 741269112 740248382
2716.8 740248382 739160776 738202095 737448335 736741602 735892653 734928906 734035790 733347833 732802689
2735.1 732802689 732178450 731367171 730517745 729813576 729246736 728665709 727955818 727144778 726408839 725877285
2755.5 725877285 725455999 724972963 724361002 723679364 723071039 722617090 722184420 721561015 720744252 719918013
2775.9 719918013 719178855 718448043 717580914 716518521 715398252 714399099 713454187 712331235 710970163
2794.3 710970163 709509671 708063543 706627548 705165386 703604281 701862276 700033009 698268592
2810.6 698268592 696534693 694688320 692633510 690412700 688200414 686103940 683994293 681670666
2826.9 681670666 679150701 676589727 674040616 671441078 668702960 665739655 662513018 659093797
2843.2 659093797 655532300 651798964 647938311 644174218 640814543 638020337 635657489 633306503
2859.5 633306503 630554795 627303839 623606980 619475603 614930809 610013962 604794741 599411428
2875.9 599411428 594124496 589263856 585048854 581528187 578678012 576513708 575037777 574109018
2892.2 574109018 573447108 572775602 571997643 571183562 570312083 569194317 567693532 565810859 563555002
2910.5 563555002 560833335 557508349 553626060 549479842 545387208 541609824 538356602 535811543
2926.8 535811543 534158289 533524096 534091949 536057949 539354026 543650568 548645675 554155290 560012758
2945.2 560012758 566018999 572005987 577915430 583717108 589432240 595133424 600751877 606074512
2961.5 606074512 610927939 615352392 619516373 623447359 627118945 630565524 633851469 637156248
2977.8 637156248 640497386 643579662 646224022 648510933 650592923 652585089 654371321 655727088
2994.2 655727088 656689048 657375455 657825887 658104777 658177197 657934010 657430530 656791329 655965269 654849708
3014.5 654849708 653426707 651714981 649810731 647886813 645963371 643900394 641709208 639486492
3030.9 639486492 637266934 634998858 632592738 630120575 627612114 624978423 622261643 619557738
3047.2 619557738 616915524 614260554 611479640 608652055 605859101 603078723 600314498 597547293
3063.5 597547293 594775379 592005610 589192688 586324811 583449006 580705464 578114450 575439811
3079.8 575439811 572594285 569714725 566811025 563874006 560988009 558118284 555225432 552365124
3096.1 552365124 549575031 546808481 544004381 541242659 538583934 535897613 533056617 530275822
3112.4 530275822 527785301 525353193 522707224 519815445 516773462 513813674 511104524 508547246
3128.8 508547246 505918443 503184259 500544131 498105705 495688140 493033737 490237206 487588286
3145.1 487588286 485115021 482798308 480599344 478231341 475568622 472913980 470487237 468164712
3161.4 468164712 465823948 463484615 461189628 458969235 456805795 454624593 452382445 450134099
3177.7 450134099 447978586 445914775 443861663 441791534 439749181 437771589 435839623 433914989
3194 433914989 431952804 429927737 427909434 426030695 424303710 422612190 420854926 419056386 417333603
3212.4 417333603 415720344 414153039 412543982 410859853 409197330 407648653 406197578 404815614
3228.7 404815614 403494030 402178168 400738418 399198741 397732258 396343559 394984812 393736124
3245 393736124 392582089 391345412 390050292 388873190 387792557 386682034 385560155 384540617 383581340
3263.4 383581340 382563710 381600529 380849928 380120993 379154831 377995074 376860738 375900120 375058055
3281.7 375058055 374217778 373353064 372511894 371777028 371090144 370295346 369381070 368361413 367285132
3300.1 367285132 366382748 365758240 365100235 364072710 362750620 361423194 360277355 359267890 358254373
3318.4 358254373 357217342 356218845 355243057 354160458 352957934 351773679 350646049 349598557 348695695
3336.8 348695695 347759455 346596420 345307320 344011962 342839748 341885656 340849161 339466363 338013023
3355.2 338013023 336817950 335797936 334689140 333516419 332568198 331806839 330838144 329500079 328099251
3373.5 328099251 326963723 326009482 325050682 324083477 323215216 322524309 322057486 321786910 321384341
3391.9 321384341 320615590 319806427 319395423 319234908 318732411 317826957 317092538 316741437 316511124 316215545
3412.3 316215545 315788239 315309227 314986825 314783663 314574093 314499408 314677030 314976901 315193981 315438062
3432.7 315438062 315846473 316115856 316062957 315983146 316160291 316596121 317110181 317552328 318036318 318670183
3453.1 318670183 319374979 320157290 321054131 321858048 322616398 323705465 325016409 325999171 326500624
3471.4 326500624 327006698 327839583 328941464 330089509 331013829 331896126 333003014 334089011 335039437
3489.8 335039437 336110175 337353975 338667929 339910209 341104090 342327148 343375385 344307244
3506.1 344307244 345426649 346760869 348225713 349595070 350741416 351917207 353329927 354959339
3522.4 354959339 356446862 357584715 358726233 360118091 361666322 363313347 364906639 366372436
3538.7 366372436 368066937 370034605 371850967 373305082 374755144 376510918 378470719 380514950
3555 380514950 382653058 384947807 387375981 389794111 392149985 394730926 397664964 400617272 403508306
3573.4 403508306 406510681 409628093 412893683 416395307 420058250 423593670 426836342 430281937
3589.7 430281937 434022188 437762052 441607475 445704222 449811965 453801274 457795739 461748272
3606 461748272 465691060 469761014 473949492 478258282 482566863 486724406 490941286 495168835 499241650
3624.4 499241650 503119648 506911039 511078656 515383959 519548774 523619950 527642071 531655908
3640.7 531655908 535692751 539670765 543437898 547106743 550982416 554870069 558480442 562125206
3657 562125206 565971971 569582224 572916210 576336086 579662323 582551301 585553586 588673592 591254473
3675.4 591254473 593860328 596805096 599731743 602735102 605857372 608688712 610689402 612448037
3691.7 612448037 614670992 617110610 619405866 621379375 623104990 625003040 627181828 629243672
3708 629243672 630775034 631922901 633527040 635522246 637395620 638991416 640394449 641637802 642823160
3726.4 642823160 644394100 646278024 647916853 648926437 649753153 651154399 652884007 653998315
3742.7 653998315 654469550 655690670 657021165 657463074 658182502 659699142 661101103 661989450 662901521
3761 662901521 664149225 665359497 666356504 667111516 667898893 669008851 670183897 671180248 671879947
3779.4 671879947 672534466 673317730 674114823 674997807 675973237 676981807 677891672 678610802 679491937
3797.7 679491937 680304885 680612981 681238532 681959748 682417154 683327377 684566557 685424328 685807288
3816.1 685807288 686474442 686994910 687190354 687926710 688787460 689521372 690244853 690981865 691902637 692499399
3836.5 692499399 692433834 692590654 693235695 694037139 694919229 695831895 696426392 695935726 695416331 696343303
3856.9 696343303 697569191 698372543 698741138 699112296 699760020 700093150 700185061 700572729 701211929 702022076
3877.3 702022076 702483296 702700615 703206599 703575134 703960061 704479337 704664171 704939187 705649614 706275940
3897.7 706275940 706519544 706550777 706462204 706559896 707116783 707787871 708281338 708631992 708806753 708881319
3918.1 708881319 709165931 709543288 709658861 709739387 710083306 710420489 710610330 710858703 711145699 711379468
3938.5 711379468 711558700 711696029 711987555 712367058 712541103 712640882 712905228 713249385 713502765 713656425
3958.9 713656425 713783383 713948369 714173138 714433730 714682102 714850068 714978695 715171099 715397358 715564966
3979.3 715564966 715739131 715961516 716168404 716355979 716560900 716776729 716927707 717043877 717241824
3997.6 717241824
##END=$$ End of the data block
