##TITLE=$$ Begin of the data block
##JCAMP-DX=5.00 $$ ACD/SpecManager v 10.08
##SPECTROMETER/DATA SYSTEM=Alpha
##DATE=29 Dec 2014 11:22:02
##DATA TYPE=INFRARED SPECTRUM
##DATA CLASS=XYDATA
##ORIGIN=
##OWNER=
##NPOINTS=1765
##FIRSTX=399.76428223
##LASTX=3997.64306641
##MAXX=3997.64306641
##MINX=399.76428223
##MAXY=0.84151691
##MINY=0.26443383
##XFACTOR=1.0000000000
##YFACTOR=1.000000000000000e-9
##FIRSTY=0.58931446
##DELTAX=2.03961372
##XUNITS=1/CM
##YUNITS=ARBITRARY UNITS
##XYDATA=(X++(Y..Y))
399.8E89314461q056939n324781j778960M31955L54230k58624Q33809L033400L340959
418.1E81889510o69241m405141m485249k549947j099467k174616m444062m774928k240181
436.5E55046678J163303L158033L169299K719342L755570N004704M194081J265048
452.8E79476058j349806j285017J70946K146j995861m024625m327536k808392j698136
471.2E62159777k593577l874064l701329k002358L5524O44207l69012j336813r54509
489.5E48007846J39117K62499j272321l049612l209114j963973j183450k055586l859281
507.9E31816125m773557m086197l106892l388166m812002n588711m467308k121121
524.2D99472171k67148j11967q82894o43224J556129M484445N939126N248427L851056
$$ plain form
399.8 589314461 581257522 575932741 574153781 574585736 574939966 574681342 575515151 578548551 581889510
418.1 581889510 581220269 576815128 572329879 569779932 568680465 566505849 562061787 557286859 555046678
436.5 555046678 556209981 559368014 562537313 565256655 569012225 574016929 578211010 579476058
452.8 579476058 578126252 576841235 577012181 577014327 575018466 570993841 566666305 563857913 562159777
471.2 562159777 559566200 555692136 551990807 549988449 550023973 550668180 550299168 548962355 548007846
489.5 548007846 548146963 548409462 547137141 544087529 540878415 538914442 537730992 535675406 531816125
507.9 531816125 527042568 522956371 519849479 516461313 511649311 506060600 501593292 499472171
524.2 499472171 499205023 499093056 498210162 497566938 499123067 503607512 509546638 514795065 518646121
542.5E18646121L259301L178477K140761k89083k699911l444433k734125k477110l852307
560.9E11727691n945802p128388p071525o392151n570024m477888k460867Q02308M507094
579.3D77990448P036984P517249O721467O007552N659461M785478K604186O3301j049102
597.6E17337024l09586P98940P26104l25680r64462j36733J574277K699852K556861
616E23956597K033233K473712L827930N002558M810810L225327J881122K019287K857506
634.3E52088082K927959J806676M97878L48806J346588K183676J785696N44607J6749
652.7E63546717Q80182K065599K239168J102447r6798P0095J613200L213286K037645
671E76671541M82917K45213J406550K692521K629638J310646P4089J38163J116872
$$ plain form
542.5 518646121 521905422 525083899 527224660 526935577 524235666 520791233 518057108 515579998 511727691
560.9 511727691 505781889 498653501 491581976 485189825 479619801 475141913 472681046 473483354 477990448
579.3 477990448 485027432 492544681 499266148 505273700 510933161 515718639 518322825 518386126 517337024
597.6 517337024 517027438 517826378 518552482 518226802 517262340 517125607 518699884 521399736 523956597
616 523956597 525989830 528463542 532291472 537294030 542104840 545330167 547211289 549230576 552088082
634.3 552088082 555016041 556822717 557320595 557669401 559015989 561199665 562985361 563529968 563546717
652.7 563546717 564426899 566492498 568731666 569834113 569737315 569807410 571420610 574633896 576671541
671 576671541 577154458 577399671 578806221 581498742 584128380 585439026 585513115 585651278 586768150
689.4E86768150J297891k28762k308548l206312k611697j839399k070308k883256k699673
707.7E70218086o46353K183378L852368L813684L364443M111410O020426P284999O677211
726.1F06879652M845440L623128M018366M883170M381657K316535L19838j74522L77893
744.5F31471157L4571k049148m484654n474746m738212l663063l666460m406929m198134
762.8E98824382k104521J067281L693521M926979N488277O762445Q874774J0168433
779.1F37701571R194612O639541M676282M571557N405128N291939L773093K390504
795.4F79644227K736628M438102N486012M450261K173067Q81433J491725K567649K189398
813.8G06058502M25518r58145p22229M55498O28352j221716l741205m796087m172385
$$ plain form
689.4 586768150 588066041 587837279 585528731 582322419 579710722 577871323 575801015 572917759 570218086
707.7 570218086 569571733 571755111 575607479 579421163 582785606 586897016 592917442 600202441 606879652
726.1 606879652 611725092 615348220 619366586 624249756 628631413 630947948 631267786 631093264 631471157
744.5 631471157 631505728 629456580 624971926 619497180 614758968 611095905 607429445 603022516 598824382
762.8 598824382 596719861 597787142 601480663 606407642 611895919 618658364 627533138 637701571
779.1 637701571 646896183 653535724 658212006 662783563 668188691 673480630 677253723 679644227
795.4 679644227 682380855 686818957 692304969 696755230 698928297 699809730 701301455 703869104 706058502
813.8 706058502 706484020 705525875 704803646 705259144 705887496 704665780 700924575 696128488 691956103
832.2F91956103l443480l959775n407095o087303n015373l319144k788544l849029
848.5F58086360n246640n476951m680932m285812m535616l524661L86000N998313J0531605
866.8F47251666J2482941J2073517J0412037Q779526P406890N201638J435876k671778
883.2G02372313n024612n152345m577577m860521n904913o335496n446196m108489
899.5F60962164l814101n122781o958544p935047q049846q419156r693920j1108935
915.8E99859834j1200309r332419o339967l749668k353073j554310k82884J638175
932.1E66685379L316938M005373M107535M608214N552292N399286K608419k266944
948.4E94016492p059991j0244250j2014687j3435305j5122413j6764224j7767906j8198907
$$ plain form
832.2 691956103 688512623 684552848 679145753 673058450 668043077 664723933 661935389 658086360
848.5 658086360 652839720 647362769 642681837 638396025 633860409 630335748 630721748 636720061 647251666
866.8 647251666 659734607 671808124 682220161 690999687 698406577 703608215 705044091 702372313
883.2 702372313 697347701 692195356 687617779 682757258 676852345 670516849 665070653 660962164
899.5 660962164 657148063 652025282 645066738 637131691 629081845 620662689 610968769 599859834
915.8 599859834 588659525 579327106 572987139 569237471 566884398 565330088 565047204 566685379
932.1 566685379 570002317 574007690 578115225 582723439 588275731 593675017 596283436 594016492
948.4 594016492 586956501 576712251 564697564 551262259 536139846 519375622 501607716 483408809
964.7D83408809j8710256j9721180k0938099k1725505k1726668k1006972j9817948
979C39762181j8191457j6010821j3284921j0222942p303715m914462l105879j723051
995.3B65004933n71102M02480R85206R64045M08113l05027p46518q23528o08563j23292
1015.7B64586747O33359J605749K678424L644347M294694M572063M597992M511118
1032B91124493M143149L227263J869858O72102K01374M42505R86784J679480K766192
1050.4C07113200M451305O510347Q371055R686768J0611684J1406391J1496187R223252
1066.7C78870189L164888n420477j2104421j3205201r496540m510522o00606J971662
1083C38668972L762752N217344O522983P530570P825643P144421N649865L860891K234757
$$ plain form
964.7 483408809 464698553 444977373 424039274 402313769 380587101 359580129 339762181
979 339762181 321570724 305559903 292274982 282052040 274748325 269833863 266727984 265004933
995.3 265004933 264433831 264836311 265821517 266785562 267193675 266888648 266142130 265318602 264710039 264586747
1015.7 264586747 265220106 266825855 269504279 273148626 277443320 282015383 286613375 291124493
1032 291124493 295267642 298494905 300364763 301036865 301238239 301680744 302667528 304347008 307113200
1050.4 307113200 311564505 318074852 326445907 336132675 346744359 358150750 369646937 378870189
1066.7 378870189 382035077 376614600 364510179 351304978 341808438 337297916 336697310 338668972
1083 338668972 342431724 347649068 354172051 361702621 369528264 376672685 382322550 386183441 388418198
1101.4C88418198J096695Q52257J723528L249854M595518N167008M794955L719061
1117.7D13617074K554834J906008J879662K395332L347546M395425M917354M233479
1134D39246714J996100j486748n174518p898539r101123r049088q301407p142693n612582
1152.4C87476116l735154j656354L54588K136886L894210O053388Q694649J1306256
1168.7D14524585J3342321J4495701J4838635J4838517J4869541J4794082J4092147
1183E15795529J2608230J0814667R188771P669449N876243L835320K173186J443863
1199.3E69405258J609504K075732K283156K357959K873600M045784N257130N591154
1215.6E95499277M796088L444910K249718J394868N36322o41107j863301k470851k258301
$$ plain form
1101.4 388418198 389514893 390367150 392090678 395340532 399936050 405103058 409898013 413617074
1117.7 413617074 416171908 418077916 419957578 422352910 425700456 430095881 435013235 439246714
1134 439246714 441242814 439756066 434581548 426683009 417581886 408532798 400231391 393088698 387476116
1152.4 387476116 383740962 382084608 382439196 384576082 388470292 394523680 403218329 414524585
1168.7 414524585 427866906 442362607 457201242 472039759 486909300 501703382 515795529
1183 515795529 528403759 539218426 548407197 556076646 561952889 565788209 567961395 569405258
1199.3 569405258 571014762 573090494 575373650 577731609 580605209 584650993 589908123 595499277
1215.6 595499277 600295365 603740275 605989993 607384861 607921183 607280076 605416775 602945924 600687623
1234F00687623j729250j505077j632452j472831n54561P79211J785755K049149J782596
1252.3F00190163J533806J559734J553834J177609O29306N16414J174987K174496K645552
1270.7F13155901K117992R84549N3108k87533l30984n33581r35257j239657j205802
1289F11778736r72569j042127j660407k420545k723872k448917k029657j993597k323150
1307.4E94163895k397538j878976j154423q05736j061260j654387k239227k870858
1323.7E80101490l787339m974007n952120o075561n203784l794729k430320j407206
1340E46476424o46591K2113O38187R27746N82874j41502o86943p71225n53369m44889
1360.4E45402825p23601r54449p06434j69575N26488J049816J115382R14693R46164
$$ plain form
1234 600687623 598958373 597453296 595820844 594348013 593793452 594572663 596358418 598407567 600190163
1252.3 600190163 601723969 603283703 604837537 606015146 606644452 607160866 608335853 610510349 613155901
1270.7 613155901 615273893 616258442 616311550 616024017 615693033 615159452 614224195 612984538 611778736
1289 611778736 610806167 609764040 608103633 605683088 602959216 600510299 598480642 596487045 594163895
1307.4 594163895 591766357 589887381 588732958 587927222 586865962 585211575 582972348 580101490
1323.7 580101490 576314151 571340144 565388024 559312463 554108679 550313950 547883630 546476424
1340 546476424 545829833 545851946 546490133 547417879 548000753 547859251 547172308 546401083 545847714 545402825
1360.4 545402825 544679224 543724775 543018341 542848766 543375254 544425070 545540452 546455145 547401309
1378.8E47401309J257300J826108K828658M088461M503548L772676K799034J474798
1395.1E69951892j50442j310945j505613j300335j569748k056479k384842k436161
1411.4E57237327j968980j271307j043439j207113p06435J82748Q88705J349688J456380
1429.8E54917574J379192J529038K032399K327263J970232J632392J279891Q51393
1446.1E67919374K48432m68552j035810j410305k148927k260446l38614J205981K433002
1464.5E64144135L658831M803419O829202R956002J0417760Q579492P577598P365644
1480.8F23332083P316828O718814O155253N842864N361915M603446M471838M551828
1497.1F68354869L711104K984584K955258L590464M005850K471446J640559J886725
$$ plain form
1378.8 547401309 548658609 550484717 553313375 557401836 561905384 565678060 568477094 569951892
1395.1 569951892 569801450 568490505 566984892 565684557 564114809 562058330 559673488 557237327
1411.4 557237327 555268347 553997040 552953601 551746488 551040053 551222801 552111506 553461194 554917574
1429.8 554917574 556296766 557825804 559858203 562185466 564155698 565788090 567067981 567919374
1446.1 567919374 568167806 567699254 566663444 565253139 563104212 560843766 560505152 561711133 564144135
1464.5 564144135 567802966 572606385 579435587 589391589 599809349 608388841 615966439 623332083
1480.8 623332083 630648911 637367725 643522978 649365842 654727757 659331203 663803041 668354869
1497.1 668354869 672065973 675050557 678005815 681596279 685602129 688073575 689714134 691600859
1513.4F91600859K372146K686560K327144J724899J356006J544416J883685J732052
1529.7G07227767J336872Q95023R13799J439631J721144O49869k35915j78754K62201
1548.1G14031637N62489L75390m2379k50697q48115j666784r49025r59635j442790
1566.4G08810091j811028j973450j322329j288235k609014k877832k114415j819789
1582.8F92993999j852453k300322k838850k935350k523899k237976k470732k928972
1599.1F72905445l187597k998531k605915k608597l224790l659248l372550l342092
1615.4F47906125l809154l085077k765298l507793l332496k735853k505481j877964
1631.7F24287009j352012j432717p97570K34187O82950Q82983J253844J855492K231002
$$ plain form
1513.4 691600859 693973005 696659565 698986709 700711608 702067614 703612030 705495715 707227767
1529.7 707227767 708564639 709459662 710373461 711813092 713534236 714184105 713948190 713769436 714031637
1548.1 714031637 714594126 714969516 714927137 714676440 713828325 712161541 711212516 710252881 708810091
1566.4 708810091 706999063 705025613 703703284 702415049 699806035 696928203 694813788 692993999
1582.8 692993999 691141546 688841224 686002374 683067024 680543125 678305149 675834417 672905445
1599.1 672905445 669717848 666719317 664113402 661504805 658280015 654620767 651248217 647906125
1615.4 647906125 644096971 641011894 638246596 634738803 631406307 628670454 626164973 624287009
1631.7 624287009 622934997 621502280 620704710 620938897 621621847 622504830 623758674 625614166 627845168
1650.1F27845168L002524L548205K512277K582967L521263M402221M350900L661991
1666.4F55427516L888845M671633M682183M965246N029321M255354M118383N040884
1682.7F92079365O310821M977882L595948L546059L596366M136920M207015L099560
1699G25549936K341986K060711K244711K318919J766503J344025J405954J843274K269983
1717.4G43146002J916707J299262J137555J467347J968980K238810J969397J374542
1733.7G56518602J111627J561821K118587K119958J755655J661599K036452K684772
1750G71569073K890051K358138J908302J878977K139867K410054K087772J485467J166045
1768.4G89893746J281917J586378J528144J100004P03156O14941R23455J247823J167357
$$ plain form
1650.1 627845168 630847692 634395897 636908174 639491141 643012404 647414625 651765525 655427516
1666.4 655427516 659316361 663987994 668670177 673635423 678664744 682920098 687038481 692079365
1682.7 692079365 698390186 703368068 706964016 710510075 714106441 718243361 722450376 725549936
1699 725549936 727891922 729952633 732197344 734516263 736282766 737626791 739032745 740876019 743146002
1717.4 743146002 745062709 746361971 747499526 748966873 750935853 753174663 755144060 756518602
1733.7 756518602 757630229 759192050 761310637 763430595 765186250 766847849 768884301 771569073
1750 771569073 774459124 776817262 778725564 780604541 782744408 785154462 787242234 788727701 789893746
1768.4 789893746 791175663 792762041 794290185 795390189 796093345 796708286 797631741 798879564 800046921
1786.7H00046921Q09312N33640O22451J004875J159251Q36730L53873L46183P90954
1805.1H06504190J144111R98140M51147J36554M29035R19818J028419O41167J97232
1823.4H12449813J79708O30736R12786O06715J25111p4566K04504O98268Q16167L04102
1843.8H16853344k86579j54495L41773O32405M10676p8857k63273R8526N74649O25133
1864.2H18753302K30074k52902k25902L32534O41883L75926p4983j60157K44081O98209
1884.6H20562065P01546K09511k14279k9206M32133O07014K92957j58727k50697J02162
1905H22254479M44770L51906n9069k80559m7028L41058M53770J73331k20657k61366
1925.4H23150635J39296M72426L44396o7175k83360o2347L47317M51505J05560k34425
$$ plain form
1786.7 800046921 800856233 801389873 802012324 803017199 804176450 805013180 805367053 805713236 806504190
1805.1 806504190 807648301 808646441 809097588 809234142 809663177 810582995 811611414 812252581 812449813
1823.4 812449813 812629521 813260257 814173043 814779758 814904869 814830303 815034807 815733075 816549242 816853344
1843.8 816853344 816566765 816412270 816754043 817386448 817797124 817718267 817454994 817553520 818128169 818753302
1864.2 818753302 818983376 818730474 818504572 818837106 819478989 819854915 819779932 819619775 819863856 820562065
1884.6 820562065 821263611 821473122 821258843 821229637 821661770 822268784 822561741 822403014 822152317 822254479
1905 822254479 822699249 823051155 822992086 822711527 822664499 823005557 823459327 823632658 823412001 823150635
1925.4 823150635 823289931 823762357 824106753 824039578 823756218 823693871 824041188 824492693 824598253 824363828
1945.8H24363828j95027J71900M92931L97324J6987j90854L755L50297M51863K01106
1966.2H26064110j26064j48356J46627L94524L13937Q94k13265q7381K20776L26038
1986.6H26891840J01327k00033k48611K8670K76089J66774j62661l42668k01761O3955
2007H26372921J20163j48832m43221m47809k47359j36197l09944o91176q03172l39091
2027.4H22926283J33157R2148k61128n50925n47767k85804m2439q1241l34501m74513
2047.8H20573270l06308K0206J93477N2273k01166k14576N2213K76625J91212m7743
2068.2H20589483j45912j7882J99437K64645Q1718j48356j36852J03175K99394K58923
2088.6H21347773M0174j18852m709K79129L99232K38061M708m1008J50383L59297L11613
$$ plain form
1945.8 824363828 824168801 824340701 824833632 825230956 825247943 825057089 825060844 825411141 825863004 826064110
1966.2 826064110 825938046 825789690 825936317 826330841 826644778 826645672 826432407 826345026 826565802 826891840
1986.6 826891840 826993167 826793134 826544523 826573193 826849282 827016056 826853395 826510727 826308966 826372921
2007 826372921 826493084 826344252 825901031 825453222 825205863 825069666 824759722 824068546 823265374 822926283
2027.4 822926283 823059440 823151588 822890460 822339535 821791768 821505964 821463525 821382284 821047783 820573270
2047.8 820573270 820266962 820287168 820480645 820532918 820331752 820117176 820169389 820446014 820637226 820589483
2068.2 820589483 820443571 820425689 820625126 820889771 820971489 820823133 820686281 820789456 821088850 821347773
2088.6 821347773 821387947 821269095 821264386 821543515 821942747 822180808 822185516 822144508 822294891 822654188 822965801
2111H22965801M1246j52528o8486J80423K93017J15573j51694j83224N9485L00706
2131.4H23400319K55286m3034k30372o5983K31326L13521J02996j78575k18213N6386
2151.8H23623657L59655L53396R2804m9949J35482M42445N17487L08812J06037J70588
2172.2H26060414M70758P05838N93841K68340J26422L34799O36220O46174L30925N0068
2192.6H30223799J11520M12881O13213M78745J49250L9041K92420N97537N93364K91049
2213H33802819M0353J26361M37439O05345M29749Q1778n9545J78933M83274M55737
2233.4H36582243J58608n6326L9637L34263M54426K47419l3498r1553J30296L89397
2253.8H38154912L68476R6083q4877L0756L06427M24445K49088o795l7969J83166L83019
$$ plain form
2111 822965801 823007047 822854519 822786033 822966456 823259473 823375046 823223352 823040128 823099613 823400319
2131.4 823400319 823655605 823612571 823382199 823316216 823547542 823861063 823964059 823785484 823567271 823623657
2151.8 823623657 823983312 824336708 824429512 824379563 824515045 824957490 825474977 825783789 825889826 826060414
2172.2 826060414 826531172 827237010 827830851 828099191 828225613 828560412 829196632 829842806 830173731 830223799
2192.6 830223799 830335319 830748200 831361413 831840158 831989408 832028449 832320869 832918406 833511770 833802819
2213 833802819 833843172 833969533 834406972 835012317 835442066 835523844 835464299 835643232 836126506 836582243
2233.4 836582243 836740851 836684525 836724162 837058425 837512851 837760270 837726772 837635219 837765515 838154912
2253.8 838154912 838523388 838619471 838534594 838565350 838871777 839296222 839545310 839538515 839500546 839683712 840066731
2276.2H40066731L38614R7990p3731L1471K77698L49343J30832j19388j16110R6679
2296.6H41080129K65241J71542q9526k29120j27256Q1837J48177p689j64807j67668
2317H40960860r5308q106k4080k02715l68178l09229l7015Q4281j70529m82559m42386
2339.5H38905036j40905P5519R4354J7762r9241j85967j40607j51038l54111m68553
2359.9H37552249l56316q0645R7573J9192j01685j21951k4200J89603L14593J66476
2380.2H37654889q2493j29938R715Q0943l3080k37823l67939l02792j17361n3227k04087
2402.7H36216807m05132m43638k78950j23441k04146m40716n71013m94182l24011k59459
2423.1H32672119m04537o01708o13809m55499l24189l78430n68331o79254n92828m02749
$$ plain form
2276.2 840066731 840405345 840503335 840429604 840461075 840738773 841088116 841218948 841099560 840983450 841080129
2296.6 841080129 841345370 841516912 841427386 841198266 841071010 841152847 841301024 841293335 841128528 840960860
2317 840960860 840865552 840857446 840833366 840630651 840262473 839953244 839916229 840000510 839829981 839347422 838905036
2339.5 838905036 838764131 838839650 838934004 838951766 838852525 838666558 838525951 838374913 838020802 837552249
2359.9 837552249 837195933 837115288 837212861 837232053 837130368 837008417 836984217 837173820 837488413 837654889
2380.2 837654889 837572396 837442458 837452173 837533116 837500036 837262213 836894274 836591482 836474121 836420894 836216807
2402.7 836216807 835811675 835368037 835089087 834965646 834761500 834320784 833749771 833255589 832931578 832672119
2423.1 832672119 832267582 831665874 831052065 830596566 830272377 829893947 829325616 828646362 828053534 827650785
2443.5H27650785l58462n31971o90580o66737n07474l40164l56495n84722p15375n59687
2463.9H22339118l42548l08633m58420o23643n97060m11808k91824l47257n20229o03617
2484.3H17834079m63128k41220j88589l50594n06819m63843k60532j09732j93417m02093
2504.7H14654112m64261l24070j59443j46091k98440m74930m65691k79725k05934l69906
2525.1H11465621o00517o76334n34475l64780l83973n74410p32839o96063n16534m00722
2545.5H05984974m88699o92546p56502n92530m06444m04656n77986p50005p01487m55141
2565.8H00158978l29733m80950o91414p22528n80430m25160m13358n58257o69002n85616
2586.2G94702530l85761k69950l52740n26309n38111l57628k25961k91288m66049n97476
$$ plain form
2443.5 827650785 827292323 826760352 826069772 825403035 824895561 824555397 824198902 823614180 822898805 822339118
2463.9 822339118 821996570 821687937 821229517 820605874 820008814 819597006 819305182 818957925 818437696 817834079
2484.3 817834079 817370951 817129731 816941142 816590548 816083729 815619886 815359354 815249622 815056205 814654112
2504.7 814654112 814189851 813865781 813706338 813560247 813261807 812786877 812321186 812041461 811835527 811465621
2525.1 811465621 810865104 810188770 809654295 809289515 808905542 808331132 807598293 806902230 806385696 805984974
2545.5 805984974 805496275 804803729 804047227 803454697 803048253 802643597 802065611 801315606 800614119 800158978
2565.8 800158978 799829245 799348295 798656881 797934353 797353923 796928763 796515405 795957148 795288146 794702530
2586.2 794702530 794316769 794046819 793694079 793167770 792629659 792272031 792046070 791754782 791288733 790691257
2606.6G90691257o02544n00500m53055o18219q74520r49442q05020o81103p67767r80556
2627G83458531j103461j044094r01044q63969j013339j204133j238346j082718r18865
2645.4G74088562r44853j096070j170874j081943r09746q40604r61840j145184j153291
2663.7G64784157r48965p74145p95126r56118j062394r26077o71744o21260q07464
2682.1G57220864r87291r80914q16166o74665p23064r35614j087785j011848q53837
2700.5G49149680q67903j048982j193702j157701r96829q93831r46879j075506j093030
2718.8G39875317r20356p19905p10725q79169r87351q79168o68705n40554n80848p53522
2739.2G32235014q48949p22527n59032n67973p01189p99179p23004n29051m39405n27740
$$ plain form
2606.6 790691257 790088713 789588213 789135158 788516939 787642419 786692977 785887957 785206854 784439087 783458531
2627 783458531 782355070 781310976 780409932 779545963 778532624 777328491 776090145 775007427 774088562
2645.4 774088562 773143709 772047639 770876765 769794822 768885076 768044472 767082632 765937448 764784157
2663.7 764784157 763835192 763061047 762265921 761309803 760247409 759321332 758649588 758028328 757220864
2682.1 757220864 756233573 755252659 754436493 753761828 753038764 752103150 751015365 750003517 749149680
2700.5 749149680 748281777 747232795 746039093 744881392 743884563 742990732 742043853 740968347 739875317
2718.8 739875317 738954961 738235056 737524331 736645162 735657811 734778643 734109938 733569384 732988536 732235014
2739.2 732235014 731386065 730663538 730104506 729536533 728835344 728036165 727313161 726784110 726344705 725816965
2759.6G25816965o46353o61552n70833m50194m85957o97970q22306p76887p04467p25985
2780G19274461q70883j048923j129269j038730r39668j073301j352667j494706j432955
2798.4G08893359j378715j467407j619101j761675j815021j752078j738966j854419
2814.7F95505977k041281k204656k206624k112865k140165k333045k524435k585709
2831F77357197k574206k589166k686739k933502l245115l417671l519654l717482l887773
2849.3F48785889l786921l371537k822995k427221k398669k715767l206968l717959
2865.7F24337852m178107m589796m954934n252242n408824n255460m794240m219115
2882E85685134l603339k917111k153754j443685r40978o70850o37949p47800q15093
$$ plain form
2759.6 725816965 725170612 724509060 723938227 723488033 723002076 722304106 721481800 720704913 720000446 719274461
2780 719274461 718403578 717354655 716225386 715186656 714246988 713173687 711821020 710326314 708893359
2798.4 708893359 707514644 706047237 704428136 702666461 700851440 699099362 697360396 695505977
2814.7 695505977 693464696 691260040 689053416 686940551 684800386 682467341 679942906 677357197
2831 677357197 674782991 672193825 669507086 666573584 663328469 659910798 656391144 652673662 648785889
2849.3 648785889 644998968 641627431 638804436 636377215 633978546 631262779 628055811 624337852
2865.7 624337852 620159745 615569949 610615015 605362773 599953949 594698489 589904249 585685134
2882 585685134 582081795 579164684 577010930 575567245 574626267 573955417 573317468 572569668 571754575
2900.3E71754575q75175j116812j529336j926959k272367k686024l245115l849447
2916.6E54253340m214823m185677l820777l252506k528131j629830o12378N83589J992941
2935E36585748L334999M305005M966677N500137N872906O005287N967200N893051N791366
2953.4E84222376N725146N747795N654275N325556M878461M461587M179835L955305
2969.7F24150336L688156L455758L330172L325283L309012L084302K701282K340138
2986F49384439K095163J964927J763939J387775J032293P37608M70459K98321R1553
3004.4F59226477k40743n07176o17921p98106j122237j437843j723289j917124j905501
3022.7F48956537j895129k049387k192974k259791k249360k262414k412140k496600
$$ plain form
2900.3 571754575 570879400 569762588 568233252 566306293 564033926 561347902 558102787 554253340
2916.6 554253340 550038517 545852840 542032063 538779557 536251426 534621596 534009218 534592807 536585748
2935 536585748 539920747 544225752 549192429 554692566 560565472 566570759 572537959 578431010 584222376
2953.4 584222376 589947522 595695317 601349592 606675148 611553609 616015196 620195031 624150336
2969.7 624150336 627838492 631294250 634624422 637949705 641258717 644343019 647044301 649384439
2986 649384439 651479602 653444529 655208468 656596243 657628536 658366144 658836603 659134924 659226477
3004.4 659226477 658985734 658478558 657860637 657062531 655940294 654502451 652779162 650862038 648956537
3022.7 648956537 647061408 645012021 642819047 640559256 638309896 636047482 633635342 631138742
3039F31138742k505064k585888k669156k689480k649606k681195k822578k834916k744437
3057.4F06956422k745449k786875k805352k776623k742946k803922k878308k852738
3073.7E84564209k726972k622962k697826k846241k912938k971053k983630k879798
3090E61922789k836943k889216k882779k816021k783835k795756k761125k681375k692997
3108.4E36782742k814949k755165k493739k457440k679050k928913l053367k907336
3124.7E14692783k675295k629101k724051k782643k652109k387106k339572k630919
3141D93871987k810002k654701k459973k316207k262234k456993k675981k621770k439409
3159.4D71174717k349198k355963k346665k282381k233088k198904k194226k241492
$$ plain form
3039 631138742 628633678 626047790 623378634 620689154 618039548 615358353 612535775 609700859 606956422
3057.4 606956422 604210973 601424098 598618746 595842123 593099177 590295255 587416947 584564209
3073.7 584564209 581837237 579214275 576516449 573670208 570757270 567786217 564802587 561922789
3090 561922789 559085846 556196630 553313851 550497830 547713995 544918239 542157114 539475739 536782742
3108.4 536782742 533967793 531212628 528718889 526261449 523582399 520653486 517600119 514692783
3124.7 514692783 512017488 509388387 506664336 503881693 501229584 498842478 496502906 493871987
3141 493871987 491061985 488407284 485947311 483631104 481368870 478911877 476235896 473614126 471174717
3159.4 471174717 468825519 466469556 464122891 461840510 459607422 457408518 455214292 452972800
3175.7D52972800k236844k152919k110929k111822k097964k056629j967013j901388
3192D36337292j914829j964748k009123j991630j871467j731872j697511j780420j840502
3210.3D19535190j774788j634628j537680j612753j730770j658261j524925j498103
3226.7D06563282j457483j331329j272738j422405j564533j476317j387149j377523
3243C95273805j255572j167745j262009j270592j142234j116424j149565j104921j053155
3261.3C84751588j049191j011580q57741o86645p68423j035214j165419j116872r81957
3279.7C76078546q59231q47518r06944q88706p47442o64473p63148r46790j092374
3298C68361920j058429q16822o13094o97404j036823j343608j343667j107037r75579
$$ plain form
3175.7 452972800 450735956 448583037 446472108 444360286 442262322 440205693 438238680 436337292
3192 436337292 434422463 432457715 430448592 428456962 426585495 424853623 423156112 421375692 419535190
3210.3 419535190 417760402 416125774 414588094 412975341 411244571 409586310 408061385 406563282
3226.7 406563282 405105799 403774470 402501732 401079327 399514794 398038477 396651328 395273805
3243 395273805 394018233 392850488 391588479 390317887 389175653 388059229 386909664 385804743 384751588
3261.3 384751588 383702397 382690817 381833076 381146431 380378008 379342794 378177375 377060503 376078546
3279.7 376078546 375219315 374371797 373464853 372576147 371828705 371164232 370401084 369454294 368361920
3298 368361920 367303491 366486669 365873575 365176171 364139348 362795740 361452073 360345036 359369457
3316.4C59369457j045108j111448j030207r30517j044304j237839j233369j120270
3332.7C50616395j021325r21100r83149j188070j282632j291782j183420r63122j041681
3351.1C40740114j366883j440108j252264j080036j059145j070797r26077q29578j031786
3369.4C30683440j336128j367092j144677r93997r65536r71824r12934p43300n02586
3387.8C21745366k75850l52592o89774p53880m15385k11835n54353r15199o95467l30150
3408.2C16550881k37823k84016l99888m63336l38257k17735j96427p5996J40160K65807
3428.6C14743370K02060K21550L95477K74420o7443q8155K14189M81606N20259M29034
3449C17326367M81933O19442O94185Q11726R57250Q43674P41005J065255J284003R07063
$$ plain form
3316.4 359369457 358324349 357212901 356182694 355252177 354207873 352970034 351736665 350616395
3332.7 350616395 349595070 348673970 347690821 346502751 345220119 343928337 342744917 341781795 340740114
3351.1 340740114 339373231 337933123 336680859 335600823 334541678 333470881 332544804 331715226 330683440
3369.4 330683440 329347312 327980220 326835543 325841546 324876010 323904186 322991252 322247952 321745366
3387.8 321745366 321469516 321116924 320427150 319673270 319257885 319046050 318491697 317576498 316881031 316550881
3408.2 316550881 316313058 316029042 315629154 315165818 314827561 314609826 314413399 314337403 314477563 314743370
3428.6 314743370 314945430 315166980 315562457 315836877 315769434 315681279 315895468 316377074 316897333 317326367
3449 317326367 317808300 318427742 319121927 319933653 320890903 321734577 322475582 323540837 324824840 325731903
3469.4C25731903M10229M59165Q71896J212627J233280R37611Q58664J072377J086295
3487.7C33874047R79423J076043J248240J334876J278311J222700J216173J051575
3504C43281388R67473J138270J284361J395941J377582J175970J166284J401812J628458
3522.4C54817539J504750J182764J178950J403004J568109J666576J582920J485378
3538.7C66389990J749337K004414J824707J440376J497567J860171J967162J966954
3555C80700678K139538K359212K451419K407074K314508K517581K911985K988726K971649
3573.4D03762370L083021L155827L277809L519028L665745L540427L310501L497035
3589.7D30811763L730416L753275L900319M123181M102946M038453M050880L944248
$$ plain form
3469.4 325731903 326142132 326601297 327473193 328685820 329919100 330856711 331715375 332787752 333874047
3487.7 333874047 334853470 335929513 337177753 338512629 339790940 341013640 342229813 343281388
3504 343281388 344248861 345387131 346671492 348067433 349445015 350620985 351787269 353189081 354817539
3522.4 354817539 356322289 357505053 358684003 360087007 361655116 363321692 364904612 366389990
3538.7 366389990 368139327 370143741 371968448 373408824 374906391 376766562 378733724 380700678
3555 380700678 382840216 385199428 387650847 390057921 392372429 394890010 397801995 400790721 403762370
3573.4 403762370 406845391 410001218 413279027 416798055 420463800 424004227 427314728 430811763
3589.7 430811763 434542179 438295454 442195773 446318954 450421900 454460353 458511233 462455481
3606D62455481L978730M172354M219682M221022M183381M161030M332424M267901M058957
3624.4E00050962L848970L767550M233539M375041M199385M105151M046380M038930
3640.7E32665908M059852L981411L720880L583788L899932M000068L708541L669262
3657E63289642L788054L589571L371298L425360L275812K822578L012418L222168K687871
3675.4E92484772K626896K913892K942145L016532L051996K825975K132297J777410
3691.7F13771915K140582K406478K322972K016246J722038J804054K082467K073288
3708F30340040J613855J210928J623392J964808J852929J648128J437784J210272J193285
3726.4F44095421J614928J854062J580477J065314Q96215J362622J668990J060664
$$ plain form
3606 462455481 466434211 470606565 474826247 479047269 483230650 487391680 491724104 495992005 500050962
3624.4 500050962 503899932 507667482 511901021 516276062 520475447 524580598 528626978 532665908
3640.7 532665908 536725760 540707171 544428051 548011839 551911771 555911839 559620380 563289642
3657 563289642 567077696 570667267 574038565 577463925 580739737 583562315 586574733 589796901 592484772
3675.4 592484772 595111668 598025560 600967705 603984237 607036233 609862208 611994505 613771915
3691.7 613771915 615912497 618318975 620641947 622658193 624380231 626184285 628266752 630340040
3708 630340040 631953895 633164823 634788215 636753023 638605952 640254080 641691864 642902136 644095421
3726.4 644095421 645710349 647564411 649144888 650210202 651106417 652469039 654138029 655198693
3742.7F55198693L66271J106024J354992O55890R00149J519799J342416Q56995R13680
3761F64214909J245439J209796J022875P68363P14183J033068J225769J110673P37429
3779.4F73282504O22690P65025P80762Q73327R89497R97483R06587P55012Q74341P62641
3799.8F81609869K91407O22094P09533M74096R39667J268923R05753M13358O26445
3818.1F87861145M63306J92285P47204Q23021O78122P19726P58946Q98778N96822M8875
3838.5F93788230K49029N97834P06434Q40307R28044N93245n32865m54426J039445
3856.9F97755277J264751Q04365L73244L40998N36442K42472J16944M27306O27994
3875.2G02489793Q12412N40971L11077N16832L36647L67522N10931J29342J74284O39141
$$ plain form
3742.7 655198693 655564964 656670988 658025980 658681870 659582019 661101818 662444234 663301229 664214909
3761 664214909 665460348 666670144 667693019 668461382 669175565 670208633 671434402 672545075 673282504
3779.4 673282504 673905194 674670219 675450981 676324308 677313805 678311288 679217875 679972887 680847228 681609869
3799.8 681609869 681901276 682523370 683232903 683706999 684646666 685915589 686821342 687234700 687861145
3818.1 687861145 688324451 688516736 689263940 690086961 690765083 691484809 692243755 693142533 693739355 693788230
3838.5 693788230 694037259 694635093 695341527 696181834 697109878 697703123 697170258 696715832 697755277
3856.9 697755277 699020028 699824393 700197637 700538635 701075077 701317549 701434493 701861799 702489793
3875.2 702489793 703302205 703843176 704154253 704671085 705007732 705375254 705886185 706015527 706189811 706828952
3895.6G06828952O27279L04580N9962p2539J61529N63145O21676M77076L31223J19626
3916G10022509L0816K34902L58700K21789K21133L91424L04997J29998K21729K90692
3936.4G12428689K16603J85550J95145L10123L43680J62960J35183K77221L09289K56896
3956.8G14821339K28524J83582J48475J94550K56479K46048J43826Q8751J84715K62379
3977.2G16758668K02477J67251K06292K22325K06828K08140K07901J42753P5161J17481
3997.6G18515277
$$ plain form
3895.6 706828952 707456231 707760811 707820773 707748234 707909763 708472908 709094584 709571660 709902883 710022509
3916 710022509 710053325 710288227 710646927 710868716 711089849 711481273 711786270 711916268 712137997 712428689
3936.4 712428689 712645292 712830842 713025987 713336110 713679790 713842750 713977933 714255154 714564443 714821339
3956.8 714821339 715049863 715233445 715381920 715576470 715832949 716078997 716222823 716311574 716496289 716758668
3977.2 716758668 716961145 717128396 717334688 717557013 717763841 717971981 718179882 718322635 718397796 718515277
3997.6 718515277
##END=$$ End of the data block
