##TITLE=$$ Begin of the data block
##JCAMP-DX=5.00 $$ ACD/SpecManager v 10.08
##SPECTROMETER/DATA SYSTEM=Alpha
##DATE=29 Dec 2014 11:22:02
##DATA TYPE=INFRARED SPECTRUM
##DATA CLASS=XYDATA
##ORIGIN=
##OWNER=
##NPOINTS=1765
##FIRSTX=399.76428223
##LASTX=3997.64306641
##MAXX=3997.64306641
##MINX=399.76428223
##MAXY=0.84255797
##MINY=0.26453573
##XFACTOR=1.0000000000
##YFACTOR=1.000000000000000e-9
##FIRSTY=0.59094101
##DELTAX=2.03961372
##XUNITS=1/CM
##YUNITS=ARBITRARY UNITS
##XYDATA=(X++(Y..Y))
399.8E90941012q114934n819500j939594O55114M54724l07381N30839K538502L108740
$$ 590941012 582826078 577006578 575066984 575722098 576176822 575869441 576400280 578938782 582047522
418.1E82047522n94437l997743l919125k348244j214862k405345m698813m944325k204597
$$ 582047522 581453085 577455342 573536217 571187973 569973111 567567766 562868953 557924628 555720031
436.5E55720031J273275K946019K922475K854169L847658M846514L959178J171053
$$ 555720031 556993306 559939325 562861800 565715969 569563627 574410141 578369319 579540372
452.8E79540372r95159q91388l3617l64899j999736l810048m191459k902209j922846
$$ 579540372 578545213 577653825 577620208 577255309 575255573 571445525 567254066 564351857 562429011
471.2E62429011k699137l885746l663361j859903R7692N86152m81963j596034j148224
$$ 562429011 559729874 555844128 552180767 550320864 550418556 551004708 550522745 548926711 547778487
489.5E47778487K37406M45306j149297k947390l210425k077640j170277j898527l840447
$$ 547778487 548015893 548461199 547311902 544364512 541154087 539076447 537906170 536007643 532167196
507.9E32167196m877448m103184k941370l110528m724681n759656m622221k207429
$$ 532167196 527289748 523186564 520245194 517134666 512409985 506650329 502028108 499820679
524.2D99820679m05103k52872q94696m94480J721501M506708N954563N394101L984273
$$ 499820679 499415576 499162704 498268008 497773528 499495029 504001737 509956300 515350401 519334674
542.5E19334674L233135K968251J798869n71490k732873l269672k464354k175391l645599
$$ 519334674 522567809 525536060 527334929 526763439 524030566 520760894 518296540 516121149 512475550
560.9E12475550n971312p327378p213354o417960n609751m512191k379745Q89808M498005
$$ 512475550 506504238 499176860 491963506 485545546 479935795 475423604 473043859 473933667 478431672
579.3D78431672P093638P624358O608278N697429N487203M940331K861739J46687j063109
$$ 478431672 485525310 493149668 499757946 505455375 510942578 515882909 518744648 518891335 517828226
597.6E17828226l58105O70791O24955k69890q17776n1617J664578K808571K522648
$$ 517828226 517470121 518140912 518765867 518495977 517678201 517626584 519291162 522099733 524622381
616E24622381J904666K414048L852725N009711M749000L112793J724004J959146L035008
$$ 524622381 526527047 528941095 532793820 537803531 542552531 545665324 547389328 549348474 552383482
634.3E52383482L130913J819849M21465L03149J349568K178908J812279P04706J18851
$$ 552383482 555514395 557334244 557755709 558058858 559408426 561587334 563399613 564104319 564223170
652.7E64223170Q16703K014578K214550J146734M1664J02699J548767L180682J996637
$$ 564223170 565039873 567054451 569269001 570415735 570457399 570560098 572108865 575289547 577286184
671E77286184N02348K94804J380921K744555K719879J163066j31846J85252J219511
$$ 577286184 577788532 578083336 579464257 582208812 584928691 586091757 585959911 586145163 587364674
689.4E87364674J221120l10004k251982l122032k600372j866043k108335k947331k725958
$$ 587364674 588585794 588275790 586023808 582901776 580301404 578435361 576327026 573379695 570653737
707.7E70653737o00338K203941L837645L840208L398955M136920O048381P296860O669224
$$ 570653737 570053399 572257340 576094985 579935193 583334148 587471068 593519449 600816309 607485533
726.1F07485533M820764L606975M034996M893243M323185K243757L34561q1897M17650
$$ 607485533 612306297 615913272 619948268 624841511 629164696 631408453 631743014 631661117 632078767
744.5F32078767K9981k023220m540801n594671m751444l599703l678084m464983m213393
$$ 632078767 632108748 630085528 625544727 619950056 615198612 611598909 607920825 603455842 599242449
762.8E99242449k089977J096010L719866M938781N498708O820917Q952617J0151446
$$ 599242449 597152472 598248482 601968348 606907129 612405837 619226754 628179371 638330817
779.1F38330817R085357O549657M714072M678368N398095N229711L802181K459764
$$ 638330817 647416174 653965831 658679903 663358271 668756366 673986077 677788258 680248022
795.4F80248022K818286M504324N450069M355252K117872Q63791J512945K656042K241194
$$ 680248022 683066308 687570632 693020701 697375953 699493825 700357616 701870561 704526603 706767797
813.8G06767797L56019j058459p74563M20988O06179j204550l727555m837215m204691
$$ 706767797 707123816 706065357 705290794 705711782 706317961 705113411 701385856 696548641 692343950
832.2F92343950l403187l932833n456686o155849n057633l357350k859474l863394
$$ 692343950 688940763 685007930 679551244 673395395 668337762 664980412 662120938 658257544
848.5F58257544n130827n385161m709244m319250m544199l576576L58164O091952J0647059
$$ 658257544 653126717 647741556 643032312 638713062 634168863 630592287 630950451 637042403 647689462
866.8F47689462J2473941J1992096J0373235Q766353P369995N110205J326680k674043
$$ 647689462 660163403 672155499 682528734 691295087 698665082 703775287 705101967 702427924
883.2G02427924m963398n179048m680812m897595n831301o291687n473316m137874
$$ 702427924 697464526 692285478 687604666 682707071 676875770 670584083 665110767 660972893
899.5F60972893l874123n183458o955326p932126q082211q446813r703815j1084199
$$ 660972893 657098770 651915312 644959986 637027860 628945649 620498836 610795021 599710822
915.8E99710822j1140704r282053o348133l792584k352178j510739k63810J608550
$$ 599710822 588570118 579288065 572939932 569147348 566795170 565284431 565020621 566629171
932.1E66629171L286362M006386M109144M597843N560696N430460K612591k319038
$$ 566629171 569915533 573921919 578031063 582628906 588189602 593620062 596232653 593913615
948.4E93913615p128358j0289252j2029588j3429284j5126765j6802847j7804027j8195152
$$ 593913615 586785257 576496005 564466417 551037133 535910368 519107521 501303494 483108342
964.7D83108342j8713594j9744068k0922452k1654725k1636129k0952344j9808322
$$ 483108342 464394748 444650680 423728228 402073503 380437374 359485030 339676708
979C39676708j8199921j6004532j3242066j0165721p248462m882395l126055j739740
$$ 339676708 321476787 305472255 292230189 282064468 274816006 269933611 266807556 265067816
995.3B65067816n32091M42565J005798R74208M13955k64705p17342q46326o35832j34707
$$ 265067816 264535725 264978290 265984088 266958296 267372251 267107546 266390204 265543878 264908046 264773339
1015.7B64773339O32227J635462K722352L629446M241199M551321M597634M506230
$$ 264773339 265405566 267041028 269763380 273392826 277634025 282185346 286782980 291289210
1032B91289210M144758L224790J850188O71476K15918M57853J046092J755744K782166
$$ 291289210 295433968 298658758 300508946 301180422 301396340 301854193 302900285 304656029 307438195
1050.4C07438195M392326O424963Q331210R704142J0620416J1381924J1475324R204030
$$ 307438195 311830521 318255484 326586694 336290836 346911252 358293176 369768500 378972530
1066.7C78972530L119707n451351j2043685j3103217r454876m511624n86868K004117
$$ 378972530 382092237 376640886 364597201 351493984 342039108 337527484 336940616 338944733
1083C38944733L773004N199522O514936P550270P838487P103980N609393L891111K278000
$$ 338944733 342717737 347917259 354432195 361982465 369820952 376924932 382534325 386425436 388703436
1101.4C88703436J095086Q46803J736283L253341M589886N161971M762560L693014
$$ 388703436 389798522 390645325 392381608 395634949 400224835 405386806 410149366 413842380
1117.7D13842380K571076J884192J814545K361804L352612M429400M952937M236043
$$ 413842380 416413456 418297648 420112193 422473997 425826609 430256009 435208946 439444989
1134D39444989J988441j496822n197525p906824r088278r007901q225441p097960n637258
$$ 439444989 441433430 439936608 434739083 426832259 417743981 408736080 400510639 393412679 387775421
1152.4C87775421l753871j613587M04090K125233L852815O027728Q666009J1300444
$$ 387775421 384021550 382407963 382812053 384937286 388790101 394817829 403483838 414784282
1168.7D14784282J3356060J4473051J4808446J4866948J4943570J4824242J4052033
$$ 414784282 428140342 442613393 457421839 472288787 487232357 502056599 516108632
1183E16108632J2561560J0815263R222269P682800N869746L835321K182722J448214
$$ 516108632 528670192 539485455 548707724 556390524 562260270 566095591 568278313 569726527
1199.3E69726527J585185K036095K253294K344012K882540M055202N246640N567968
$$ 569726527 571311712 573347807 575601101 577945113 580827653 584882855 590129495 595697463
1215.6E95697463M774034L453850K299130J437009N25653o75678j879215k456367k220750
$$ 595697463 600471497 603925347 606224477 607661486 608187139 607511461 605632246 603175879 600955129
1234F00955129j721025j547217j657069j442373n17130P84159J779497K065658J830161
$$ 600955129 599234104 597686887 596029818 594587445 594070315 594854474 596633971 598699629 600529790
1252.3F00529790J574695J538456J501023J160085O27757N10275J196027K208829K646923
$$ 600529790 602104485 603642941 605143964 606304049 606931806 607442081 608638108 610846937 613493860
1270.7F13493860K087533R67086P3075k75135l46363n35607r21965j227855j186252
$$ 613493860 615581393 616548479 616621554 616346419 616000056 615464449 614542484 613314629 612128377
1289F12128377r59992j052559j680255k439678k735495k449989k005458j954496k333582
$$ 612128377 611168385 610115826 608435571 605995893 603260398 600810409 598804951 596850455 594516873
1307.4E94516873k446532j889408j136124q09014j079678j662970k232492k869486
$$ 594516873 592070341 590180933 589044809 588235795 587156117 585493147 583260655 580391169
1323.7E80391169l792406m943668n912841o103396n252481l758251k335430j371800
$$ 580391169 576598763 571655095 565742254 559638858 554386377 550628126 548292696 546920896
1340E46920896o75083N722O41108R17912N38051j71066o59883p41064n53072m71294
$$ 546920896 546245813 546251535 546892643 547810555 548348606 548177540 547517657 546776593 546223521 545752227
1360.4E45752227p57932r73523o84142j05798N65767J048684J097381Q89838R25600
$$ 545752227 544994295 544020772 543336630 543230832 543796599 544845283 545942664 546832502 547758102
1378.8E47758102J242519J814723K798915M044354M483342L781140K820194J481652
$$ 547758102 549000621 550815344 553614259 557658613 562141955 565923095 568743289 570224941
1395.1E70224941j46985j277864j484692j305342j591027k097905k399265k412916
$$ 570224941 570077956 568800092 567315400 566010058 564419031 562321126 559921861 557508945
1411.4E57508945j937270j230716j005352j206517p24375J91867R07361J331807J405775
$$ 557508945 555571675 554340959 553335607 552129090 551404715 551596582 552503943 553835750 555241525
1429.8E55241525J352549J549661K050102K318203J979590J643538J260877Q34882
$$ 555241525 556594074 558143735 560193837 562512040 564491630 566135168 567396045 568230927
1446.1E68230927K58684m50790r95099j324833k063393k268792l91483J175761K410710
$$ 568230927 568489611 568038821 567043722 565718889 563655496 561386704 560995221 562170982 564581692
1464.5E64581692L653765M838943O888390R984911J0386526Q533776P550061P379591
$$ 564581692 568235457 573074400 579962790 589947701 600334227 608868003 616418064 623797655
1480.8F23797655P346332O709874O120801N835414N391836M620314M466712M569173
$$ 623797655 631143987 637853861 643974662 649810076 655201912 659822226 664288938 668858111
1497.1F68858111L745556K994597K972841L641784M024685K425432J608670J882910
$$ 668858111 672603667 675598264 678571105 682212889 686237574 688663006 690271676 692154586
1513.4F92154586K371192K664388K307295J731754J383960J584113J904070J712263
$$ 692154586 694525778 697190166 699497461 701229215 702613175 704197288 706101358 707813621
1529.7G07813621J288712Q69810R75430J536608J765788O24418k97129k50101K43902
$$ 707813621 709102333 709972143 710947573 712484181 714249969 714874387 714577258 714327157 714571059
1548.1G14571059N82635L89099j0729j90436q35777j733601r66430r67085j480877
$$ 714571059 715153694 715542793 715532064 715341628 714505851 712772250 711805820 710838735 709357858
1566.4G09357858j829863j935661j276433j285911k678573k943456k097905j776874
$$ 709357858 707527995 705592334 704315901 703029990 700351417 697407961 695310056 693533182
1582.8F93533182j857042k341151k874554k953767k531350k242327k473712k916932
$$ 693533182 691676140 689334989 686460435 683506668 680975318 678732991 676259279 673342347
1599.1F73342347l170967l010094k626181k623439l250420l677427l358722l303409
$$ 673342347 670171380 667161286 664535105 661911666 658661246 654983819 651625097 648321688
1615.4F48321688l800988l109217k766788l500521l346085k760351k509952j857996
$$ 648321688 644520700 641411483 638644695 635144174 631798089 629037738 626527786 624669790
1631.7F24669790j317918j377940p50542K61486P09176R25958J305401J901686K287031
$$ 624669790 623351872 621973932 621223390 621484876 622194052 623120010 624425411 626327097 628614128
1650.1F28614128L044068L525973K485514K597987L563941M444837M376352L678143
$$ 628614128 631658196 635184169 637669683 640267670 643831611 648276448 652652800 656330943
1666.4F56330943L925085M749417M755438M965305M962325M225970M166901N116760
$$ 656330943 660256028 665005445 669760883 674726188 679688513 683914483 688081384 693198144
1682.7F93198144O297470M904985L564417L521681L570676M120231M186511L086567
$$ 693198144 699495614 704400599 707965016 711486697 715057373 719177604 723364115 726450682
1699G26450682K333164K049029K243757K315640J753092J349747J448632J896381K266586
$$ 726450682 728783846 730832875 733076632 735392272 737145364 738495111 739943743 741840124 744106710
1717.4G44106710J847446J255691J131475J462877J959920K231061J972318J382768
$$ 744106710 745954156 747209847 748341322 749804199 751764119 753995180 755967498 757350266
1733.7G57350266J110494J561105K120614K124608J755297J682401K079248K677501
$$ 757350266 758460760 760021865 762142479 764267087 766022384 767704785 769784033 772461534
1750G72461534K847850K350569J914739J873553K131879K380789K042055J473188J196921
$$ 772461534 775309384 777659953 779574692 781448245 783580124 785960913 788002968 789476156 790673077
1768.4G90673077J344800J641691J491964J009643O59108O44803R92298J287937J146496
$$ 790673077 792017877 793659568 795151532 796161175 796820283 797465086 798457384 799745321 800891817
1786.7H00891817P89642N41389O28710J016974J165629Q22603L43323L41237P72655
$$ 800891817 801681459 802222848 802851558 803868532 805034161 805856764 806200087 806541324 807313979
1805.1H07313979J111030R83835M65989J45137M38392R41813J042843O41167J92464
$$ 807313979 808425009 809408844 809874833 810019970 810458362 811400175 812443018 813084185 813276649
1823.4H13276649J62065O03020R14633O34074J47879p0035J78993O80327Q19445K98500
$$ 813276649 813438714 814041734 814956367 815590441 815738320 815668285 815847278 816527605 817347050 817645550
1843.8H17645550k69354j20639L44812O20008L83437j17541k53141J45376N84483O20604
$$ 817645550 817376196 817255557 817600369 818220377 818603814 818486273 818233132 818378508 818962991 819583595
1864.2H19583595K47121k61844k58624L24905O28471L47197p4208j31070K83301P18057
$$ 819583595 819830716 819568872 819310248 819635153 820263624 820610821 820536613 820405543 820688844 821406901
1884.6H21406901O72042J65761k40386j8537M79043O23166K58088j89423k45214J44959
$$ 821406901 822078943 822244704 822004318 821985781 822464824 823087990 823346078 823156655 822911441 823056400
1905H23056400N03182L60251j10746l10123l3557L62277M69327J51992k64824k63750
$$ 823056400 823559582 823919833 823809087 823498964 823465407 823827684 824297011 824449003 824184179 823920429
1925.4H23920429J62422M74036L41892n6624k78473n2988L68535M43578N1677k64108
$$ 823920429 824082851 824556887 824898779 824842155 824563682 824510694 824879229 825322807 825374484 825110376
1945.8H25110376j58727K03550M75943L79026M0054j52707R477L43263M57764J96039
$$ 825110376 824951649 825155199 825631142 826010168 826050222 825897515 825906992 826250255 826708019 826904058
1966.2H26904058j41203j56343J38879L79860K90513j5258k01345n7757K39432L27945
$$ 826904058 826762855 826606512 826745391 827125251 827415764 827400506 827199161 827141404 827380836 827708781
1986.6H27708781Q5711k32875k60294N4360L02315J76012j39475l06427j91570N7698
$$ 827708781 827794492 827561617 827301323 827355683 827657998 827834010 827694535 827388108 827196538 827254236
2007H27254236J03414j82271m57466m18961k13385j31368l25084p14362q20338l37184
$$ 827254236 827357650 827175379 826717913 826298952 826085567 825954199 825629115 824914753 824094415 823757231
2027.4H23757231J57416J07288k89440n94198n48125k30014l219r9778l47555m52637
$$ 823757231 823914647 824021935 823732495 823138297 822590172 822360158 822356939 822257161 821909606 821456969
2047.8H21456969k84851K5988J82509K7597k17497k18749M6730K77459K10345l8385
$$ 821456969 821172118 821198106 821380615 821408212 821190715 820971966 821018696 821296155 821506500 821468115
2068.2H21468115j63913j0967K37226K63930M7564j61946j25110J27495L27050K56539
$$ 821468115 821304202 821293235 821530461 821794391 821841955 821680009 821554899 821682394 822009444 822265983
2088.6H22265983J3351r9122N4359L04222L82483K10524j9849n1677J46330L47256
$$ 822265983 822279334 822180212 822234571 822538793 822921276 823131800 823111951 823060274 823206604 823553860
2109H23553860L07322M4465j52707n6446K05040L07024J10447j68085j96815O9738
$$ 823553860 823861182 823905647 823752940 823696494 823901534 824208558 824319005 824150920 823954105 824023843
2129.4H24023843L18587K42054p3016k33829n4180K29895L10421R9063j77622j77503
$$ 824023843 824342430 824584484 824511468 824277639 824223459 824453354 824763775 824862838 824685216 824507713
2149.8H24507713J18614L80456L28720N0127j06871J04427M75705N62608L13819J08480
$$ 824507713 824626327 825006783 825335503 825385630 825278759 825383186 825858891 826421499 826735318 826843798
2170.2H26843798J98066M85540O87599N69642K63750J39117L50595O50465O56963L22521
$$ 826843798 827041864 827527404 828215003 828784645 829048395 829187512 829538107 830188572 830845535 831168056
2190.6H31168056K2828R8705M26650O13869M46737J28090M5776L13223O19769N97119
$$ 831168056 831190884 831289589 831716239 832330108 832776845 832904935 832950711 833263934 833883703 834480822
2211H34480822K78175L4034J52290M94301O25372L63767L0160n245K52784M96864M27186
$$ 834480822 834758997 834793031 834945321 835439622 836064994 836428761 836458921 836453676 836706460 837203324 837630510
2233.4H37630510J18852o8128N8532L54409M74691K52128o5684j13666J72019M39047
$$ 837630510 837749362 837681234 837739766 838094175 838568866 838820994 838755310 838641644 838813663 839252710
2253.8H39252710L57032N6386j13129J5556L06666M44055K63154j2517l6656J98483
$$ 839252710 839609742 839666128 839552999 839568555 839875221 840319276 840582430 840569913 840533257 840731740
2274.2H40731740L99232L39150Q4877p3313M3511K76506L26753J10983j09851r6917
$$ 840731740 841130972 841470122 841554999 841481686 841525197 841801703 842128456 842239439 842129588 842032671
2294.6H42032671J03891K62260J59145r4712k08616r5070R4176J59859J5438k00093
$$ 842032671 842136562 842398822 842557967 842463255 842254639 842159569 842253745 842413604 842429042 842228949
2315H42228949k27392p1227M6670j0788j71066k77876k53499j32322o9440k14278m14789
$$ 842228949 842001557 841930330 841977000 841966212 841795146 841517270 841263771 841131449 841062009 840847731 840432942
2337.4H40432942l92616j46627J03235J43945M5657q7619k09331k29955k54273l37541
$$ 840432942 840040326 839893699 839996934 840140879 840186536 840098917 839889586 839659631 839405358 839067817
2357.8H39067817l73423l18647r2864Q8513K0504j25170j56223j6809K06709K93851
$$ 839067817 838694394 838375747 838282883 838371396 838391900 838266730 838110507 838093698 838300407 838594258
2378.2H38594258J50919n3346j02461n662M9472o0320k68996l84212k94983j05619
$$ 838594258 838745177 838691831 838589370 838583708 838633180 838572860 838303864 837919652 837624669 837519050
2398.6H37519050k8253j66953l97145m65572k95460j29700k15352m45783n58615m75943
$$ 837519050 837490797 837323844 836926699 836461127 836165667 836035967 835820615 835374832 834816217 834340274
2419H34340274l09944k63035m33803o31451o06656m06862k86996m07755o40393p34150
$$ 834340274 834030330 833767295 833333492 832702041 832095385 831688523 831401527 830993772 830353379 829619229
2439.4H29619229n91636l58581l29614n47826p35343o82592m57883k82645l50714n96404
$$ 829619229 829027593 828669012 828339398 827791572 827056229 826373637 825915754 825633109 825282395 824685991
2459.8H24685991p07030n58794l48866l03030m59313o36340n97953l94941k86817l72112
$$ 824685991 823978961 823420167 823071301 822768271 822308958 821672618 821074665 820679724 820392907 820020795
2480.2H20020795n48124o08087m39465k08914j78874l56495n11885m49836k35975j20997
$$ 820020795 819472671 818864584 818425119 818216205 818037331 817680836 817168951 816719115 816483140 816362143
2500.6H16362143k29657m41253n01812l16679j09017j28031l27766m97579m67718k64764
$$ 816362143 816132486 815691233 815189421 814872742 814763725 814635694 814307928 813810349 813342631 813077867
2521H13077867j62780l32594o06954o81699n07056l53277m11630n95450p28011o85513
$$ 813077867 812915087 812582493 811975539 811293840 810786784 810433507 810021877 809426427 808698416 808012903
2541.4H08012903n01871m00901m96745o77705p57277o18637m06623m05669o14047p50363
$$ 808012903 807511032 807110131 806613386 805935681 805178404 804559767 804153144 803747475 803133428 802383065
2561.8H02383065o54757m35233l55184n22315p22349p16746n30839l90351m30703n71191
$$ 802383065 801728308 801293075 800937891 800415576 799693227 798976481 798445642 798055291 797624588 797053397
2582.2G97053397o51598n62430l56316k48611l47197n21839n58138l86417k40266l11434
$$ 797053397 796401799 795839369 795483053 795234442 794887245 794365406 793807268 793420851 793180585 792869151
2602.6G92869151m81487n98132n85437m77970m58479o39915q64864q94188p65801p02858
$$ 792869151 792387664 791789532 791204095 790726125 790267646 789627731 788762867 787868679 787102878 786400020
2623G86400020q22008j024842j109183j026153q93593q64923j020849j197815j182019
$$ 786400020 785578012 784553170 783443987 782417834 781524241 780659318 779638469 778440654 777258635
2641.3G77258635j027346r14693r52780j095712j170993j071811q96096q48711r97364
$$ 777258635 776231289 775316596 774363816 773268104 772097111 771025300 770129204 769280493 768283129
2659.7G68283129j172602j120031q99613p86662q44360r87172j054287r01580o69479
$$ 768283129 767110527 765990496 765090883 764304221 763459861 762472689 761418402 760516822 759847343
2678G59847343o30558q24093j022160r90510p70688o31691p29143r58920j105666j030564
$$ 759847343 759216785 758392692 757370532 756380022 755609334 754977643 754248500 753289580 752183914 751153350
2698.4G51153350q62062q60274j041710j200855j152516r65476q69572r55045j093209
$$ 751153350 750291288 749431014 748389304 747188449 746035933 745070457 744200885 743245840 742152631
2716.8G42152631j087606r10699p31885p38144r02653r88722q42035o03020n06997
$$ 742152631 741065025 740154326 739422441 738684297 737781644 736792922 735950887 735347867 734840870
2735.1G34840870o11544q10086q79109p22826n49316n62787p08282p99299p07268n13673
$$ 734840870 734229326 733419240 732540131 731817305 731267989 730705202 729996920 729197621 728490353 727976680
2755.5G27976680m36545n31673o50883o55651n36799m17471m82798o96003q16465p80165
$$ 727976680 727540135 727008462 726357579 725701928 725165129 724747658 724264860 723568857 722752392 721972227
2775.9G21972227p19070p53522r17137j094878j102149r67205r20534j088202j352489
$$ 721972227 721253157 720499635 719582498 718487620 717385471 716418266 715497732 714409530 713057041
2794.3G13057041j503110j476764j396478j411438j585185j792491j823961j744926
$$ 713057041 711553931 710077167 708680689 707269251 705684066 703891575 702067614 700322688
2810.6G00322688j750410j849532k009571k175033k203345k111375k122581k326072
$$ 700322688 698572278 696722746 694713175 692538142 690334797 688223422 686100841 683774769
2826.9F83774769k541482k600908k567470k575875k712667k989173l265798l412902
$$ 683774769 681233287 678632379 676064909 673489034 670776367 667787194 664521396 661108494
2843.2F61108494l526211l710330l868877l815592l431618k863765k448141k400637
$$ 661108494 657582283 653871953 650003076 646187484 642755866 639892101 637443960 635043323
2859.5F35043323k712429l208339l727078m195750m607260m982829n285681n426406
$$ 635043323 632330894 629122555 625395477 621199727 616592467 611609638 606323957 600897551
2875.9F00897551n288482m835189m223883l599882k926647k166391j436472r19521
$$ 600897551 595609069 590773880 586549997 582950115 580023468 577857077 576420605 575501084
2892.2E75501084p06315p11739p47084p37966q14795j116276j553237j924753k257824
$$ 575501084 574794769 574083030 573335946 572597980 571783185 570666909 569113672 567188919 564931095
2910.5E64931095k713621l308356l878891m187346m146695l796041l232241k536833
$$ 564931095 562217474 558909118 555030227 550842881 546696186 542900145 539667904 537131071
2926.8E37131071j681030o51955N96046K018273L325224M295170M967451N477012N857408
$$ 537131071 535450041 534798086 535394132 537412405 540737629 545032799 550000250 555477262 561334670
2945.2E61334670O026327O008923N946696N855024N771041N757093N647779N320430
$$ 561334670 567360997 573369920 579316616 585171640 590942681 596699774 602347553 607667983
2961.5F07667983M878103M481018M203379L979504L750622L516078L344775L346562
$$ 607667983 612546086 617027104 621230483 625209987 628960609 632476687 635821462 639168024
2977.8F39168024L349066L104091K709448K354503K108454J986921J816094J438975
$$ 639168024 642517090 645621181 648330629 650685132 652793586 654780507 656596601 658035576
2994.2F58035576J040519P37846M82797L05712J06097k21849n03719o17921p66516
$$ 658035576 659076095 659813941 660296738 660602450 660708547 660486698 659982979 659365058 658598542
3012.5F58598542j082182j460075j775265j910806j864790j862407k028585k194047
$$ 658598542 657516360 656056285 654281020 652370214 650505424 648643017 646614432 644420385
3028.8F44420385k258479k248228k289951k445519k496361k478898k561450k646565
$$ 644420385 642161906 639913678 637623727 635178208 632681847 630202949 627641499 624994934
3045.1F24994934k680839k670705k693772k782583k798736k784074k810418k805531
$$ 624994934 622314095 619643390 616949618 614167035 611368299 608584225 605773807 602968276
3061.5F02968276k795399k773463k747834k802909k875268k892971k781689k625883
$$ 602968276 600172877 597399414 594651580 591848671 588973403 586080432 583298743 580672860
3077.8E80672860k682209k831399k903581k978861k956570k847194k877653k960861
$$ 580672860 577990651 575159252 572255671 569276810 566320240 563473046 560595393 557634532
3094.1E57634532k919256k796591k745986k823829k829373k711296k699673k826989
$$ 557634532 554715276 551918685 549172699 546348870 543519497 540808201 538108528 535281539
3110.4E35281539k758920k494335k484739k723992k941489l029406k900005k683639
$$ 535281539 532522619 530028284 527543545 524819553 521878064 518848658 515948653 513265014
3126.7E13265014k621234k738535k826095k680898k419948k387583k658725k821446
$$ 513265014 510643780 507905245 505079150 502398252 499978304 497590721 494931996 492110550
3143D92110550k652317k442866k332002k287984k455771k693027k635628k430380k350449
$$ 492110550 489458233 487015367 484683365 482395381 479939610 477246583 474610955 472180575 469830126
3161.4D69830126k357185k369732k337486k268195k209633k207220k259463k265483
$$ 469830126 467472941 465103209 462765723 460497528 458287895 456080675 453821212 451555729
3177.7D51555729k171904k077848k064138k100349k103328k028019j931250j907885
$$ 451555729 449383825 447305977 445241839 443141490 441038162 439010143 437078893 435171008
3194D35171008j980662k038896j987815j863212j771986j789361j853228j807809j666367
$$ 435171008 433190346 431151450 429163635 427300423 425528437 423739076 421885848 420078039 418411672
3212.4D18411672j597762j626551j691640j731336j652658j520276j476079j450598
$$ 418411672 416813910 415187359 413495719 411764383 410111725 408591449 407115370 405664772
3228.7D05664772j343280j294196j450777j584649j501858j396597j361072j273453
$$ 405664772 404321492 403027296 401576519 399991870 398490012 397093415 395732343 394458890
3245C94458890j188576j241088j273602j169861j086086j114517j143873j096427j073271
$$ 394458890 393270314 392029226 390755624 389585763 388499677 387385160 386241287 385144860 384071589
3263.4C84071589j060606r09596p14749p65503r97394j129329j106799r83387q83788
$$ 384071589 383010983 382101387 381386638 380621135 379623741 378494412 377387613 376404226 375520438
3281.7C75520438q85278r20117q96096p51048o45519p62939r70781j079947j024455
$$ 375520438 374635160 373715043 372818947 372067899 371422380 370659441 369688660 368608713 367584258
3300.1C67584258q42213o87868p52270j034468j318634j375496j175672j010478j030415
$$ 367584258 366742045 366054177 365301907 364267439 362948805 361573309 360397637 359387159 358356744
3318.4C58356744j069009j014710r37760j025647j238226j298726j182109j015008
$$ 358356744 357287735 356273025 355335265 354309618 353071392 351772666 350590557 349575549
3334.8C49575549q76248r74327j249581j357615j304388j142055r26256j053900j431048
$$ 349575549 348699301 347724974 346475393 345117778 343813390 342671335 341745079 340691179 339260131
3353.1C39260131j491368j203745r79275j063913j202285j027405q06332r67920j345426
$$ 339260131 337768763 336565018 335585743 334521830 333319545 332292140 331485808 330517888 329172462
3371.5C29172462j443803j163960r32693r40412r84013r15200p60764n14388k20001
$$ 329172462 327728659 326564699 325632006 324691594 323707581 322792381 322031617 321517229 321297228
3389.8C21297228k86966p46519q89390m65185j64509n01245r03100p28726l70383k60264
$$ 321297228 321010262 320263743 319374353 318909168 318744659 318243414 317340314 316611588 316241205 315980941
3410.2C15980941k97755m21464m87388l21358j75297j99646j40041R6410L08663K85119
$$ 315980941 315683186 315261722 314774334 314452976 314277679 314078033 313937992 314034402 314343065 314628184
3430.6C14628184K71678L92705K55615p4417r0897K24799M84824M97312M13089M80027
$$ 314628184 314899862 315292567 315548182 315473765 315382868 315607667 316092491 316589803 317002892 317482919
3451C17482919O27696P12752Q09789R20266Q28654P73578J074493J258910R14693M69148
$$ 317482919 318110615 318823367 319633156 320553422 321382076 322155654 323230147 324489057 325403750 325872898
3471.4C25872898N19514Q87394J176089J174778R08375Q94129J173079J141191R23335
$$ 325872898 326392412 327279806 328455895 329630673 330539048 331433177 332606256 333747447 334670782
3489.8C34670782J032919J254082J329183J273930J232177J249582J115709R73046
$$ 334670782 335703701 336957783 338286966 339560896 340793073 342042655 343158364 344131410
3506.1C44131410J070291J287311J464933J392037J167804J200318J471758J688749
$$ 344131410 345201701 346489012 347953945 349345982 350513786 351714104 353185862 354874611
3522.4C54874611J507193J128852J127124J440316J666695J713038J569420J439959
$$ 354874611 356381804 357510656 358637780 360078096 361744791 363457829 365027249 366467208
3538.7C66467208J701414J999527J846374J486212J545548J879096K034545K055496
$$ 366467208 368168622 370168149 372014523 373500735 375046283 376925379 378959924 381015420
3555C81015420K129197K327949K493590K456039K362669K598405K969056K985924K932907
$$ 381015420 383144617 385472566 387966156 390422195 392784864 395383269 398352325 401338249 404271156
3573.4D04271156L093779L242790L337026L516555L696412L635138L346860L454268
$$ 404271156 407364935 410607725 413944751 417461306 421157718 424792856 428139716 431593984
3589.7D31593984L749252L829002L938288M118144M096061M032344M083603M050434
$$ 431593984 435343236 439172238 443110526 447228670 451324731 455357075 459440678 463491112
3606D63491112M051089M111499M155427M303128M358202M285306M359901M256248M047215
$$ 463491112 467542201 471653700 475809127 480112255 484470457 488755763 493115664 497371912 501419127
3624.4E01419127L888607L852844M255593M386842M240930M133940M036665L986836
$$ 501419127 505307734 509160578 513416171 517803013 522043943 526177883 530214548 534201384
3640.7E34201384M018843L999173L842116L772497L941536L910422L635168L665328
$$ 534201384 538220227 542219400 546061516 549834013 553775549 557685971 561321139 564986467
3657E64986467L844083L625393L345370L387272L274977K845645L049911L272473K667964
$$ 564986467 568830550 572455943 575801313 579188585 582463562 585309207 588359118 591631591 594299555
3675.4E94299555K587616K942622K925992K974093L101170K877176K058804J753032
$$ 594299555 596887171 599829793 602755785 605729878 608831048 611708224 613767028 615520060
3691.7F15520060K195001K399802K286494K005100J711726J847863K177596K119184
$$ 615520060 617715061 620114863 622401357 624406457 626118183 627966046 630143642 632262826
3708F32262826J589239J145780J569032J959384J854420J636207J465618J268328J232326
$$ 632262826 633852065 634997845 636566877 638526261 640380681 642016888 643482506 644750834 645983160
3726.4F45983160J611411J808643J575172J125396R17852J339554J668632J110256
$$ 645983160 647594571 649403214 650978386 652103782 653021634 654361188 656029820 657140076
3742.7F57140076M54724J124620J245082N10156Q71599J599550J387537Q22424Q99733
$$ 657140076 657594800 658719420 659964502 660474658 661346257 662945807 664333344 665155768 666055501
3761F66055501J272797J209557R93312P62820P26044J024663J208246J106858P33197
$$ 666055501 667328298 668537855 669531167 670293987 671020031 672044694 673252940 674359798 675092995
3779.4F75092995N98967P64072Q39353R19580R50635R49323R23455Q08596R07898P27296
$$ 675092995 675691962 676456034 677295387 678214967 679165602 680114925 681038380 681846976 682754874 683482170
3799.8F83482170K32875O21200P13825M62592R51767J272261Q83162M21345O74367
$$ 683482170 683715045 684336245 685050070 685512662 686464429 687736690 688619852 689041197 689715564
3818.1F89715564N06521K14755P39336Q01683O86943P81834Q02934Q91090N68509l8087
$$ 689715564 690222085 690436840 691176176 691977859 692664802 693446636 694249570 695140660 695709169 695671082
3838.5F95671082J81853O35624P84278R04501R92298O53565n82755o14822R52304J242578
$$ 695671082 695852935 696488559 697272837 698177338 699169636 699823201 699240446 698625624 699577928 700820506
3858.9G00820506P84576L42428L60012O48678L31461M1306L27110O48976Q90314O11365
$$ 700820506 701605082 701947510 702307522 702956200 703287661 703328967 703656077 704305053 705195367 705806732
3879.3G05806732L30210M54545K70903L44932M60029O7591J69397O98149P06613L16918
$$ 705806732 706136942 706591487 706862390 707207322 707667351 707734942 707904339 708602488 709309101 709626019
3899.7G09626019M9353n8890J50800N54204N82397M16815L35276J59741R2327L43562
$$ 709626019 709675372 709616482 709767282 710321486 710903883 711320698 711655974 711815715 711908042 712251604
3920.1G12251604M40955J96099R7930L13998L34620J66953K14577K83241K76744K80440
$$ 712251604 712692559 712888658 712986588 713300586 713635206 713802159 714016736 714299977 714576721 714857161
3940.5G14857161K26259K66195K46703O2227J21952L34739L43561K27869J55568J29223
$$ 714857161 715083420 715349615 715596318 715658545 715780497 716115236 716458797 716686666 716842234 716971457
3960.9G16971457J53601K30313K80976K51591J46866Q3744J65224K63632K16663J74582
$$ 716971457 717125058 717355371 717636347 717887938 718034804 718118548 718283772 718547404 718764067 718938649
3981.3G18938649K43127K56121J76668J61231K02894J68681J30117J86861
$$ 718938649 719181776 719437897 719614565 719775796 719978690 720147371 720277488 720464349
3997.6G20464349
$$ 720464349
##END=$$ End of the data block
