##TITLE=$$ Begin of the data block
##JCAMP-DX=5.00 $$ ACD/SpecManager v 10.08
##SPECTROMETER/DATA SYSTEM=Alpha
##DATE=29 Dec 2014 11:22:02
##DATA TYPE=INFRARED SPECTRUM
##DATA CLASS=XYDATA
##ORIGIN=
##OWNER=
##NPOINTS=1765
##FIRSTX=399.76428223
##LASTX=3997.64306641
##MAXX=3997.64306641
##MINX=399.76428223
##MAXY=0.82751471
##MINY=0.20695594
##XFACTOR=1.0000000000
##YFACTOR=1.000000000000000e-9
##FIRSTY=0.51672065
##DELTAX=2.03961372
##XUNITS=1/CM
##YUNITS=ARBITRARY UNITS
##XYDATA=(X++(Y..Y))
$$ plain form
399.8 516720653 511190057 507040560 504176557 503174722 504210532 506482601 508614659 509736598
416.1 509736598 509961903 509317517 507850826 505596936 502720416 499669194 496570915 493274778 489832789
434.4 489832789 487320036 487177998 489623427 493983060 499154568 504098713 508111179 510789275 512262702
452.8 512262702 512711644 512278914 511148512 509617388 507614791 504828274 501342118 497692049 494118571
471.2 494118571 490373552 486825049 484176546 482657522 481943130 481547445 481385738 481322050 480938077
489.5 480938077 480114311 478919804 477378607 475472212 473176211 470629632 468188345 465770334 462667406
507.9 462667406 458717257 454450816 450192124 445890158 441403449 436848551 432913929 430283844
524.2 430283844 429035425 428776443 428936422 429514647 431221128 434934378 440739632 447273314 452752829
$$ packed form
399.8E16720653n530596m149497k864003j001835J035810K272069K132058J121939
416.1E09736598K25305o44386j466691k253890k876520l051222l098279l296137l441989
434.4D89832789k512753j42038K445429M359633N171508M944145M012466K678096J473427
452.8E12262702M48942m32730j130402j531124k002597k786517l486156l650069l573478
471.2D94118571l745019l548503k648503j519024p14392l95685j61707o3688l83973
489.5D80938077q23766j194507j541197j906395k296001k546579k441287k418011l102928
507.9D62667406l950149m266441m258692m301966m486709m554898l934622k630085
524.2D30283844j248419k58982J59979N78225J706481L713250N805254O533682N479515
$$ plain form
542.5 452752829 456322461 458279759 459123343 458791196 457083076 454269648 450841099 446949035 442495227
560.9 442495227 437119305 430575877 423141807 415680707 409669518 406139493 405108333 406472057
577.2 406472057 410360068 416611075 424491286 432776123 440067381 445501328 449143708 451309323
593.5 451309323 452350467 452577800 452174932 451526165 451153427 451370031 451976269 452644616 453545541 455169499
613.9 455169499 457716644 461049616 464872509 468806446 472669572 476574123 480583251 484279633
630.2 484279633 487108648 488986909 490426213 492065698 493994296 495724142 496865809 497532189 498326749
648.6 498326749 499786764 501585841 503025174 503933430 504675388 505752623 507167161 508352458 509431183
667 509431183 510887980 512227058 513775766 515828907 517764986 519252002 520592630 522054732 523620665
$$ packed form
542.5D52752829L569632J957298Q43584l32147j708120k813428l428549l892064m453808
560.9D42495227n375922o543428p434070p461100o011189l530025j031160J363724
577.2D06472057L888011O251007P880211Q284837P291258N433947L642380K165615
593.5D51309323J041144K27333m02868o48767l72738K16604O06238O68347R00925J623958
613.9D55169499K547145L332972L822893L933937L863126L904551M009128L696382
630.2D84279633K829015J878261J439304J639485J928598J729846J141667O66380P94560
648.6D98326749J460015J799077J439333R08256P41958J077235J414538J185297J078725
667E09431183J456797J339078J548708K053141J936079J487016J340628J462102J565933
$$ plain form
685.3 523620665 524962008 525546968 525203407 524200797 522768736 520766854 517944932 514447451 510856211
703.7 510856211 507991731 506623566 506928384 508542776 511172295 514882147 519834399 525904059 532473385
722 532473385 538881838 545002162 550929368 556603432 561710835 565866888 569015384 571381867 573156774
740.4 573156774 574210405 574068189 572218359 568746567 564348400 559635043 554732144 549510658 544187725
758.7 544187725 539587319 536524177 535318553 536150873 539165556 544341385 551561892 560530782 570582449
777.1 570582449 580639660 589641750 597213924 603708148 609539270 614740491 619162560 622988939
793.4 622988939 626798570 631195545 636217535 641162515 645277381 648408353 650986552 653384328
809.7 653384328 655443728 656742394 657292485 657512486 657638073 657392800 656197846 653688252 649946153
$$ packed form
685.3E23620665J341343N84960l43561j002610j432061k001882k821922l497481l591240
703.7E10856211k864480j368165L04818J614392K629519L709852M952252O069660O569326
722E32473385O408453O120324N927206N674064N107403M156053L148496K366483J774907
740.4E73156774J053631j42216j849830l471792m398167m713357m902899n221486n322933
758.7E44187725m600406l063142j205624Q32320L014683N175829P220507Q968890J0051667
777.1E70582449J0057211R002090P572174O494224N831122N201221M422069L826379
793.4F22988939L809631M396975N021990M944980M114866L130972K578199K397776
809.7F53384328K059400J298666N50091K20001J25587k45273j194954k509594l742099
$$ plain form
828.1 649946153 645390213 640337467 634839058 628940046 622842073 616965234 611757636 607231259
844.4 607231259 602996528 598686695 594159961 589395702 584266424 578684390 573360503 570386410
860.7 570386410 572185576 579386473 590469062 603554785 617231131 629971802 640356243 647655666
877 647655666 651598036 652055204 649285674 644119620 637626469 630642712 623666763 616916656 610410631
895.4 610410631 604234159 598477185 592833221 586692631 579550862 571169913 561630309 551144719
911.7 551144719 539894164 528294384 517143071 507490158 500307739 495877892 493643552 492863297
928 492863297 493219525 494772255 497541130 501345456 506044686 511576951 517386913 521825314 522715390
946.4 522715390 518828034 510421395 498528242 484170437 468106478 450878382 432828546 414126068
$$ packed form
828.1F49946153m555940n052746n498409n899012o097973n876839n207598m526377
844.4F07231259m234731m309833m526734m764259n129278n582034n323887k974093
860.7E70386410J799166P200897J1082589J3085723J3676346J2740671J0384441P299423
877F47655666L942370M57168k769530n166054o493151o983757o975949o750107o506025
895.4F10410631o176472n756974n643964o140590p141769q380949r539604j0485590
911.7E51144719j1250555j1599780j1151313r652913p182419m429847k234340p80255
928D92863297L56228J552730K768875L804326M699230N532265N809962M438401Q90076
946.4E22715390l887356q406639j1893153j4357805j6063959j7228096j8049836j8702478
$$ plain form
962.7 414126068 394870549 375143439 354987979 334570676 314279556 294553608 275880158
977 275880158 258836776 243993565 231781185 222358137 215589091 211113691 208469912 207205027
993.3 207205027 206955940 207438305 208413765 209605902 210682034 211340532 211433858 211046740 210436106 209983051
1013.7 209983051 210036173 210801959 212331250 214576691 217476442 220930815 224750474 228666067 232401341
1032 232401341 235687584 238252133 239897639 240736917 241185620 241690665 242534935 243953779 246391267
1050.4 246391267 250325531 255869806 262819737 271012723 280370086 290761888 301406533 309951335
1066.7 309951335 312908500 308218092 297736883 286311507 277966201 273764819 272987932 274725944
1083 274725944 278233141 282877535 288333416 294516116 301157743 307598442 312956482 316610783 318575323
$$ packed form
962.7D14126068j9255519j9727110k0155460k0417303k0291120j9725948j8673450
977B75880158j7043382j4843211j2212380r423048o769046m475400k643779j264885
993.3B07205027k49087M82365R75460J192137J076132O58498R3326l87118o10634m53055
1013.7B09983051N3122P65786J529291K245441K899751L454373L819659L915593L735274
1032B32401341L286243K564549J645506Q39278M48703N05045Q44270J418844K437488
1050.4B46391267L934264N544275O949931Q192986R357363J0391802J0644645Q544802
1066.7C09951335K957165m690408j0481209j1425376q345306m201382p76887J738012
1083B74725944L507197M644394N455881O182700O641627O440699N358040L654301J964540
$$ plain form
1101.4 318575323 319496274 320413709 322313040 325540543 329733074 334320933 338813484 342724890 345718116
1119.8 345718116 347883373 349683046 351836115 355064988 359573901 364617795 368705481 370378494
1136.1 370378494 368810445 364035428 356830478 348314196 339579701 331522733 324741840 319562346
1152.4 319562346 316103369 314297050 314035207 315364659 318527430 323762506 331134349 340572178
1168.7 340572178 351916254 364860117 378939569 393615097 408423305 423035204 437219083
1183 437219083 450684965 462943733 473465770 481893271 488191456 492703855 495946676 498355955
1199.3 498355955 500301361 502145350 504290283 507186055 511099458 515948117 521382034 526981235
1215.6 526981235 532331944 536952496 540345848 542201221 542513013 541617572 540063202 538258135 536327243
$$ packed form
1101.4C18575323R20951R17435J899331L227503M192531M587859M492551L911406K993226
1119.8C45718116K165257J799673K153069L228873M508913N043894M087686J673013
1136.1C70378494j568049m775017p204950q516282q734495q056968o780893n179494
1152.4C19562346l458977j806319k61843J329452L162771N235076P371843R437829
1168.7C40572178J1344076J2943863J4079452J4675528J4808208J4611899J4183879
1183D37219083J3465882J2258768J0522037Q427501O298185M512399L242821K409279
1199.3D98355955J945406J843989K144933K895772L913403M848659N433917N599201
1215.6E26981235N350709M620552L393352J855373L11792q95441j554370j805067j930892
$$ plain form
1234 536327243 534313440 532335997 530624688 529566884 529494405 530392051 531991422 534024954 536312163
1252.3 536312163 538657010 540794790 542487025 543675780 544602036 545746982 547554910 550044298
1268.6 550044298 552711308 554911315 556278348 556804836 556672752 556086659 555217862 554229140 553242981
1287 553242981 552224934 551019967 549472034 547504306 545192301 542702496 540191472 537772596 535418630
1305.4 535418630 533072829 530933738 529234529 527857065 526560366 525237143 523719430 521668732
1321.7 521668732 518621802 514205217 508540511 502283871 496236324 490979046 486847371 484004915
1338 484004915 482383341 481775790 481974930 482650012 483275384 483455628 483182490 482637882 481940746 481136501
1358.4 481136501 480256528 479245603 478225589 477538943 477334797 477619320 478430182 479599655 480712563
$$ packed form
1234E36327243k013803j977443j711309j057804p2479Q97646J599371K033532K287209
1252.3E36312163K344847K137780J692235J188755R26256J144946J807928K489388
1268.6E50044298K667010K200007J367033N26488j32084n86093q68797r88722r86159
1287E53242981j018047j204967j547933j967728k312005k489805k511024k418876k353966
1305.4E35418630k345801k139091j699209j377464j296699j323223j517713k050698
1321.7E21668732l046930m416585n664706o256640o047547n257278m131675k842456
1338D84004915j621574o07551J99140O75082O25372J80244k73138n44608o97136q04245
1358.4D81136501q79973j010925j020014o86646k04146K84523Q10862J169473J112908
$$ plain form
1376.7 480712563 481789500 483070791 484843791 487676829 491979152 496666759 500324607 502989769
1393.1 502989769 504583001 504757345 503768563 502237320 500644982 498869896 496776432 494501173 492152512
1411.4 492152512 490009248 488409579 487388253 486679852 486236632 486333370 486914217 487920314 489410728
1429.8 489410728 491059363 492763847 495033473 497464478 499291033 501015306 502619207 503772020
1446.1 503772020 504177392 503605247 502345681 500920415 499355614 497512758 496501595 497008353 499389648
1464.5 499389648 503228605 507973015 514904201 525550842 536893547 546283424 554657280 562814415
1480.8 562814415 570787191 578055859 585048318 592201114 598627567 603491366 608168602 613552094
1497.1 613552094 618261278 621760488 624846756 628817439 633822858 636928439 638852179 640983820
$$ packed form
1376.7D80712563J076937J281291J773000K833038M302323M687607L657848K665162
1393.1E02989769J593232J74344r88782j531243j592338j775086k093464k275259k348661
1411.4D92152512k143264j599669j021326p08401m43220R6738N80847J006097J490414
1429.8D89410728J648635J704484K269626K431005J826555J724273J603901J152813
1446.1E03772020M05372n72145j259566j425266j564801j842856j011163N06758K381295
1464.5D99389648L838957M744410O931186J0646641J1342705R389877Q373856Q157135
1480.8E62814415P972776P268668O992459P152796O426453M863799M677236N383492
1497.1F13552094M709184L499210L086268L970683N005419L105581J923740K131641
$$ plain form
1513.4 640983820 643495023 646219194 648879051 651626348 653791845 655372083 656909287 658375144
1529.7 658375144 660116971 661916375 663136542 664410651 666254520 667262435 667358398 667304993 667280316
1548.1 667280316 667297542 667286158 667320192 667515993 667482674 665823936 664020240 662685037 661515236 660338342
1568.5 660338342 658752620 657199502 655915320 654113591 651968539 650122166 648312211 646430612
1584.8 646430612 644458055 642352402 640103698 637789667 635346949 632729769 630026162 627198756
1601.1 627198756 624166727 620969892 617672324 614089310 610259175 606560409 602743924 598242819
1617.4 598242819 594311833 591102362 587540805 583810389 580237806 576834083 574199915 572548687
1633.7 572548687 571188390 569680870 568599164 568254173 568791389 570426226 572347343 573808610 576557338
$$ packed form
1513.4F40983820K511203K724171K659857K747297K165497J580238J537204J465857
1529.7F58375144J741827J799404J220167J274109J843869J007915R5963n3405k4677
1548.1F67280316J7226j1384L4034J95801l3319j658738j803696j335203j169801j176894
1568.5F60338342j585722j553118j284182j801729k145052j846373j809955j881599
1584.8F46430612j972557k105653k248704k314031k442718k617180k703607k827406
1601.1F27198756l032029l196835l297568l583014l830135l698766l816485m501105
1617.4E98242819l930986l209471l561557l730416l572583l403723k634168j651228
1633.7E72548687j360297j507520j081706l44991N37216J634837J921117J461267K748728
$$ plain form
1652.1 576557338 580882251 583653688 586190283 589741826 594276309 598841727 602916598 607836902
1668.4 607836902 613598764 618507624 623595834 629181564 634118855 638916373 644791782 652052522
1684.7 652052522 657589853 661921561 666524053 670898676 675711870 680704951 685050189 689155102
1701.1 689155102 692122936 694642067 697171748 699303627 701372445 703631938 706169784 708794415
1717.4 708794415 710705459 712164164 713808298 715643167 717531919 719507635 721505523 723711550
1733.7 723711550 725618124 727154553 729017079 731070340 733190000 735600352 738354325 741344154
1750 741344154 744144857 746555209 749026239 751608014 754070103 756397009 758310378 760015011 761787057
1768.4 761787057 763628304 765383780 766641676 767587721 768646479 769810200 770926833 772008300
$$ packed form
1652.1E76557338M324913K771437K536595L551543M534483M565418M074871M920304
1668.4F07836902N761862M908860N088210N585730M937291M797518N875409P260740
1684.7F52052522N537331M331708M602492M374623M813194M993081M345238M104913
1701.1F89155102K967834K519131K529681K131879K068818K259493K537846K624631
1717.4G08794415J911044J458705J644134J834869J888752J975716J997888K206027
1733.7G23711550J906574J536429J862526K053261K119660K410352K753973K989829
1750G41344154K800703K410352K471030K581775K462089K326906J913369J704633J772046
1768.4G61787057J841247J755476J257896R46045J058758J163721J116633J081467
$$ plain form
1784.7 772008300 773043275 774108887 775296330 776382864 777202964 778058887 779044986 779964685 780712545
1803 780712545 781437755 782282710 783215106 784059346 784703314 785341322 786068857 786805332 787539423 788315952
1823.4 788315952 789084494 789808512 790429354 790782034 791073620 791503787 791974425 792407274 792903543 793392301
1843.8 793392301 793645978 793785453 793974519 794228911 794497669 794720411 794899344 795127094 795432866 795788288
1864.2 795788288 796173334 796436131 796486080 796593368 796912313 797288656 797597349 797866464 798206568 798655510
1884.6 798655510 799163401 799617410 799886227 800069094 800304353 800582707 800868690 801094353 801193237 801257670
1905 801257670 801418722 801664889 801869333 801973164 802065253 802184701 802321732 802516103 802705944 802783728
1925.4 802783728 802813411 802905858 803085685 803290129 803437054 803529501 803640366 803791046 803938270 804098964
$$ packed form
1784.7G72008300J034975J065612J187443J086534Q20100Q55923R86099R19699P47860
1803G80712545P25210Q44955R32396Q44240O43968O38008P27535P36475P34091P76529
1823.4G88315952P68542P24018O20842L52680K91586M30167M70638M32849M96269M88758
1843.8G93392301K53677J39475J89066K54392K68758K22742J78933K27750L05772L55422
1864.2G95788288L85046K62797M9949J07288L18945L76343L08693K69115L40104M48942
1884.6G98655510N07891M54009K68817J82867K35259K78354K85983K25663R8884O4433
1905H01257670J61052K46167K04444J03831R2089J19448J37031J94371J89841P7784
1925.4H02783728K9683R2447J79827K04444J46925R2447J10865J50680J47224J60694
$$ plain form
1945.8 804098964 804246426 804368377 804545462 804782510 805009723 805200875 805372298 805528522 805734158 805992246
1966.2 805992246 806176066 806266725 806369960 806514025 806671619 806839406 806977689 807052672 807085693 807138860
1986.6 807138860 807263017 807415664 807458401 807373881 807329655 807422459 807541072 807522357 807353437 807103753
2007 807103753 806857824 806668997 806511462 806284189 805868328 805287063 804705799 804182827 803692758 803340018
2027.4 803340018 803080678 802760065 802436948 802181482 801925957 801555216 801045835 800568938 800305128 800213993
2047.8 800213993 800121546 799911618 799658835 799552381 799648345 799820304 799930155 799927473 799848616 799834073 799974740
2070.2 799974740 800185263 800296605 800246418 800152183 800180376 800370634 800600648 800731301 800757587 800813854
2090.6 800813854 800984025 801231265 801466107 801604211 801673412 801824212 802107751 802392423 802578151 802673876
$$ packed form
1945.8H04098964J47462J21951J77085K37048K27213J91152J71423J56224K05636K58088
1966.2H05992246J83820R0659J03235J44065J57594J67787J38283P4983L3021N3167
1986.6H07138860J24157J52647M2737q4520m4226R2804J18613j8715j68920k49684
2007H07103753k45929j88827j57535k27273m15861n81265n81264n22972m90069l52740
2027.4H03340018k59340l20613l23117k55466k55525l70741n09381m76897k63810r1135
2047.8H00213993r2447k09928k52783j06454R5964J71959J09851k682p8857j4543J40667
2070.2G99974740K10523J11342n0187r4235K8193J90258K30014J30653K6286N6267
2090.6H00813854J70171K47240K34842J38104O9201J50800K83539K84672J85728R5725
$$ plain form
2111 802673876 802755296 802885234 803043723 803158164 803179622 803139389 803137720 803236723 803358316 803399801 803383589
2133.5 803383589 803391278 803453505 803571522 803687513 803700686 803647220 803677142 803856015 804094315 804256141 804311454
2155.9 804311454 804369509 804602087 805051446 805524111 805835128 806029022 806325734 806879938 807590783 808246791
2176.3 808246791 808721006 809057891 809444249 810017049 810704112 811279416 811613619 811844826 812204540 812762499
2196.7 812762499 813386202 813856006 814116180 814355791 814779222 815384328 815980434 816389918 816630721 816905499
2217.1 816905499 817358971 817918181 818378389 818652570 818843722 819097638 819492280 819952965 820312083 820489287
2237.5 820489287 820569396 820739388 821090043 821489692 821750045 821839452 821910381 822106779 822396696 822677612
2257.9 822677612 822881639 823017836 823187470 823457360 823777735 824058831 824244082 824380636 824584067 824878275
$$ packed form
2111H02673876Q1420J29938J58489J14441K1458m0233j669R9003J21593M1485j6212
2133.5H03383589P689O2227J18017J15991J3173n3466K9922J78873K38300J61826N5313
2155.9H04311454N8055K32578M49359M72665L11017J93894K96712N54204P10845O56008
2176.3H08246791M74215L36885L86358N72800O87063N75304L34203K31207L59714N57959
2196.7H12762499O23703M69804K60174K39611M23431O05106N96106M09484K40803K74778
2217.1H16905499M53472N59210M60208K74181J91152K53916L94642M60685L59118J77204
2237.5H20489287Q0109J69992L50655L99649K60353Q9407P0929J96398K89917K80916
2257.9H22677612K04027J36197J69634K69890L20375K81096J85251J36554K03431K94208
$$ plain form
2278.3 824878275 825186610 825403631 825516880 825639188 825841963 826062799 826217592 826313078 826376081 826452255
2298.7 826452255 826585531 826718152 826776922 826782048 826819301 826959252 827159643 827301979 827349246 827334762 827320993
2321.1 827320993 827377975 827473998 827514708 827454865 827337325 827278316 827270627 827182293 826968014 826696992 826467514
2343.5 826467514 826235235 826023877 825937867 825884044 825715065 825555146 825583518 825655162 825578332 825266242
2363.9 825266242 824778080 824373603 824128389 823884726 823581934 823242724 822940290 822761357 822662950 822534263
2384.3 822534263 822309256 822023571 821772635 821614921 821512938 821357489 821089983 820736587 820399404 820128441
2404.7 820128441 819823384 819424033 818995237 818598449 818221211 817805648 817317963 816769063 816184998 815629900
2425.1 815629900 815144658 814649105 814050972 813384593 812746227 812176943 811612010 810948372 810218275 809544086
$$ packed form
2278.3H24878275L08335K17021J13249J22308K02775K20836J54793R5486O3003P6174
2298.7H26452255J33276J32621N8770N126L7253J39951K00391J42336M7267j4484j3769
2321.1H27320993N6982R6023M0710n9843j17540n9009p689q8334k14279k71022k29478
2343.5H26467514k32279k11358q6010n3823j68979j59919K8372P1644p6830l12090
2363.9H25266242m88162m04477k45214k43663l02792l39210l02434j78933r8407j28687
2384.3H22534263k25007k85685k50936j57714j01983j55449k67506l53396l37183k70963
2404.7H20128441l05057l99351m28796l96788l77238m15563m87685n48900n84065n55098
2425.1H15629900m85242m95553n98133o66379o38366n69284n64933o63638p30097o74189
$$ plain form
2445.5 809544086 808952749 808376551 807778597 807144642 806451499 805762649 805183768 804685950 804131567 803477168
2465.9 803477168 802825212 802262723 801776230 801286519 800699711 800042450 799436569 798934877 798508763 798080564
2486.3 798080564 797605932 797117591 796667397 796299040 796001613 795704603 795365751 794991136 794615090 794285297
2506.7 794285297 793991148 793689132 793352306 792978346 792584300 792170405 791733205 791262686 790742755 790184915
2527.1 790184915 789614558 789024651 788397789 787755966 787111521 786452234 785754859 785003603 784247935 783568025
2547.5 783568025 782959819 782319307 781569481 780783236 780072689 779431105 778822422 778194010 777465403 776699007
2567.9 776699007 776021540 775432885 774864793 774245739 773526609 772755146 772066772 771551251 771107316 770557582
2588.3 770557582 769910276 769314945 768859148 768530905 768221796 767753184 767122507 766521871 766021132 765516996
$$ packed form
2445.5H09544086n91337n76198n97954o33955o93143o88850n78881m97818n54383o54399
2465.9H03477168o51956n62489m86493m89711n86808o57261o05881n01692m26114m28199
2486.3G98080564m74632m88341m50194l68357k97427k97010l38852l74615l76046l29793
2506.7G94285297k94149l02016l36826l73960l94046m13895m37200m70519n19931n57840
2527.1G90184915n70357n89907o26862o41823o44445o59287o97375p51256p55668o79910
2547.5G83568025o08206o40512p49826p86245p10547o41584o08683o28412p28607p66396
2567.9G76699007o77467n88655n68092o19054p19130p71463o88374n15521m43935n49734
2588.3G70557582o47306n95331m55797l28243l09109m68612o30677o00636n00739n04136
$$ plain form
2608.7 765516996 764890909 764087141 763138831 762169003 761306405 760528564 759646416 758513212 757196903
2627 757196903 755915403 754791200 753711879 752502024 751142025 749747276 748424172 747246444 746143579
2645.4 746143579 744905233 743498266 742091656 740829229 739717126 738608956 737362802 736038744
2661.7 736038744 734814346 733728170 732679009 731601536 730482757 729341984 728279889 727369010
2678 727369010 726511240 725535989 724431574 723344624 722373664 721487880 720546782 719444156 718255579
2696.4 718255579 717122197 716046691 714920223 713675082 712338507 711016774 709798217 708683074
2712.7 708683074 707577169 706386626 705147922 703979075 702943385 702012837 701112807 700154305 699143052
2731.1 699143052 698195636 697380960 696641803 695859790 694991112 694116354 693319976 692579389 691834748 691045940
$$ packed form
2608.7G65516996o26087q03768r48310r69828q62598p77841q82148j133204j316309
2627G57196903j281500j124203j079321j209855j359999j394749j323104j177728j102865
2645.4G46143579j238346j406967j406610j262427j112103j108170j246154j324058
2661.7G36038744j224398j086176j049161j077473j118779j140773j062095r10879
2678G27369010q57770r75251j104415j086950r70960q85784r41098j102626j188577
2696.4G18255579j133382j075506j126468j245141j336575j321733j218557j115143
2712.7G08683074j105905j190543j238704j168847j035690r30548r00030r58502j011253
2731.1F99143052r47416q14676p39157p82013q68678q74758p96378p40587p44641p88808
$$ plain form
2751.4 691045940 690205395 689402282 688728213 688142359 687550426 686901450 686203897 685530603 684902489 684224665
2771.8 684224665 683421493 682503581 681506455 680482090 679475546 678425848 677227914 675922930 674625099
2790.2 674625099 673316121 671905160 670369208 668726802 666997731 665231049 663436830 661538720
2806.5 661538720 659483075 657307506 655108571 652936399 650718451 648350358 645810843 643174887
2822.8 643174887 640546918 637957215 635298789 632421792 629352927 626226962 623055398 619765282
2839.1 619765282 616268814 612441659 608244240 603862047 599563181 595522463 591827631 588495016
2855.5 588495016 585483313 582612514 579543054 575988710 571802676 566980600 561693132 556135893
2871.8 556135893 550391257 544539511 538804352 533480883 528836548 525050581 522102118 519827127
$$ packed form
2751.4F91045940q40545q03113o74069n85854n91933o48976o97553o73294o28114o77824
2771.8F84224665q03172r17912r97126j024365j006544j049698j197934j304984j297831
2790.2F74625099j308978j410961j535952j642406j729071j766682j794219j898110
2806.5F61538720k055645k175569k198935k172172k217948k368093k539515k635956
2822.8F43174887k627969k589703k658426k876997l068865l125965l171564l290116
2839.1F19765282l496468l827155m197419m382193m298866m040718l694832l332615
2855.5E88495016l011703k870799l069460l554344m186034m822076n287468n557239
2871.8E56135893n744636n851746n735159n323469m644335l785967k948463k274991
$$ plain form
2888.1 519827127 518133938 516989946 516227186 515593767 514895260 514030814 512989759 511756480 510251224
2906.5 510251224 508370161 505997181 503026605 499443769 495394647 491162837 486982584 483027965
2922.8 483027965 479597747 477051765 475592762 475277901 476161689 478282452 481631398 486103237 491462439
2941.1 491462439 497382581 503528595 509719372 515979230 522372782 528800189 535112500 541284144
2957.4 541284144 547304571 553100646 558594584 563747585 568506122 572842479 576892734 580838203
2973.8 580838203 584751785 588694870 592591703 596121728 599146247 601830900 604321837 606667519
2990.1 606667519 608726561 610292673 611441731 612306118 612896800 613218725 613220870 612858534 612219214
3008.4 612219214 611424804 610424459 609108925 607476652 605541408 603378654 601161778 598939717
$$ packed form
2888.1E19827127j693189j143992p62760o33419o98507q64446j041055j233279j505256
2906.5E10251224j881063k372980k970576l582836m049122m231810m180253l954619
2922.8D83027965l430218k545982j459003l14861Q83788K120763L348946M471839N359202
2941.1D91462439N920142O146014O190777O259858O393552O427407O312311O171644
2957.4E41284144O020427N796075N493938N153001M758537M336357M050255L945469
2973.8E80838203L913582L943085L896833L530025L024519K684653K490937K345682
2990.1F06667519K059042J566112J149058Q64387N90682L21925K145l62336o39320
3008.4F12219214p94410j000345j315534j632273j935244k162754k216876k222061
$$ plain form
3024.7 598939717 596616566 594196320 591717243 589146793 586435556 583608210 580829561 578129709
3041.1 578129709 575320542 572291076 569136500 566027105 562977135 559939027 556920826 553810716
3057.4 553810716 550582886 547431767 544439018 541517496 538495302 535275638 532004774 528874457
3073.7 528874457 525987744 523241878 520318985 517156661 513958216 510788083 507700861 504724801
3090 504724801 501655281 498438984 495294422 492338359 489467949 486517757 483542502 480684191 477825582
3108.4 477825582 474823177 471928090 469358534 466825217 464054614 461029530 457855433 454814315
3124.7 454814315 452080190 449489534 446778655 443939626 441221505 438760787 436377257 433791995
3141 433791995 431017250 428277969 425686330 423319578 421126425 418785095 416175961 413569927 411126882
$$ packed form
3024.7E98939717k323151k420246k479077k570450k711237k827346k778649k699852
3041.1E78129709k809167l029466l154576l109395l049970l038108l018201l110110
3057.4E53810716l227830l151119k992749k921522l022194l219664l270864l130317
3073.7E28874457k886713k745866k922893l162324l198445l170133l087222k976060
3090E04724801l069520l216297l144562k956063k870410k950192k975255k858311k858609
3108.4D77825582l002405k895087k569556k533317k770603l025084l174097l041118
3124.7D54814315k734125k590656k710879k839029k718121k460718k383530k585262
3141D33791995k774745k739281k591639k366752k193153k341330k609134k606034k443045
$$ plain form
3159.4 411126882 408777326 406475663 404210836 401978880 399787128 397628844 395494580 393392622
3175.7 393392622 391330272 389296442 387264758 385239333 383256912 381335825 379459560 377577752
3192 377577752 375672638 373785377 371947378 370167553 368440479 366739482 365071088 363434047 361792386
3210.3 361792386 360185713 358673692 357237458 355796576 354301453 352803171 351347029 349932879
3226.7 349932879 348607689 347442687 346339554 345026225 343520105 342111230 340867102 339727342
3243 339727342 338684380 337591112 336315811 335064799 334064245 333186001 332182080 331055731 329993665
3261.3 329993665 329070956 328234494 327500403 326869905 326123714 325156868 324125826 323140591 322223753
3279.7 322223753 321369886 320549786 319743186 319001943 318415731 317886323 317192286 316285968 315287501 314397693
$$ packed form
3159.4D11126882k349556k301663k264827k231956k191752k158284k134264k101958
3175.7C93392622k062350k033830k031684k025425j982421j921087j876265j881808
3192C77577752j905114j887261j837999j779825j727074j700997j668394j637041j641661
3210.3C61792386j606673j512021j436234j440882j495123j498282j456142j414150
3226.7C49932879j325190j165002j103133j313329j506120j408875j244128j139760
3243C39727342j042962j093268j275301j251012j000554q78244j003921j126349j062066
3261.3C29993665r22709q36462p34091o30498p46191r66846j031042r85235r16838
3279.7C22223753q53867q20100q06600p41243n86212n29408o94037r06318r98467q89808
$$ plain form
3300.1 314397693 313747108 313235313 312601507 311672509 310536593 309382379 308339894 307421058 306525588
3318.4 306525588 305605739 304736257 303912044 302940458 301789492 300702065 299799502 299022585 298288077
3336.8 298288077 297431886 296383291 295272171 294151247 293109000 292280227 291419894 290278703 289074302
3355.2 289074302 288060099 287204415 286316693 285377324 284616441 283991367 283140987 281931400 280679017
3373.5 280679017 279709697 278931916 278170913 277354896 276518703 275851786 275499940 275396764 275143951 274467736
3393.9 274467736 273758352 273486584 273460269 273082078 272270709 271591723 271284789 271108776 270882756 270522743
3414.3 270522743 270105362 269843876 269700646 269544482 269489467 269659907 269993812 270287901 270567894 270950735
3434.7 270950735 271160573 271038651 270943016 271139860 271565884 272060275 272456080 272847176 273399562 274078578
$$ packed form
3300.1C14397693o50585n11795o33806r28998j135916j154214j042485r18836q95470
3318.4C06525588r19849q69482q24213r71586j150966j087427r02563p76917p34508
3336.8B98288077q56191j048595j111120j120924j042247q28773q60333j141191j204401
3355.2B89074302j014203q55684q87722r39369p60883o25074q50380j209587j252383
3373.5B80679017r69320p77781p61003q16017q36193o66917l51846j03176k52813o76215
3393.9B74467736p09384k71768k6315l78191q11369o78986l06934j76013k26020l60013
3414.3B70522743m17381k61486j43230j56164n5015J70440L33905K94089K79993L82841
3434.7B70950735K09838j21922r5635J96844M26024M94391L95805L91096N52386O79016
$$ plain form
3455.1 274078578 274862349 275715053 276418209 277063996 278075367 279329479 280225068 280640155 281059861
3473.4 281059861 281749874 282723814 283847272 284735471 285453320 286396265 287434042 288365334 289355367
3491.8 289355367 290469408 291612297 292660058 293760359 295023769 296028763 296724111 297608346 298806280
3510.2 298806280 300140530 301364005 302342772 303354740 304711699 306335688 307732910 308747709
3526.5 308747709 309767723 310972720 312351555 313931555 315455049 316728711 318160981 320013702
3542.8 320013702 321946025 323460102 324759841 326367199 328172266 329930454 331791997 333883971
3559.1 333883971 336017311 338102430 340524584 343459487 346238941 348675370 351201594 353997499
3575.4 353997499 356966525 360059619 363259971 366593868 370188922 373812139 377156943 380470663
$$ packed form
3455.1B74078578P83771Q52704P03156O45787J011371J254112Q95589M15087M19706
3473.4B81059861O90013R73940J123458Q88199P17849R42945J037777R31292R90033
3491.8B89355367J114041J142889J047761J100301J263410J004994O95348Q84235J197934
3510.2B98806280J334250J223475R78767J011968J356959J623989J397222J014799
3526.5C08747709J020014J204997J378835J580000J523494J273662J432270J852721
3542.8C20013702J932323J514077J299739J607358J805067J758188J861543K091974
3559.1C33883971K133340K085119K422154K934903K779454K436429K526224K795905
3575.4C53997499K969026L093094L200352L333897L595054L623217L344804L313720
$$ plain form
3591.7 380470663 384037286 387828887 391796231 395816356 399661124 403363854 407158554 411235511
3608.1 411235511 415493399 419760913 423959285 428109825 432511747 437081456 441128761 444792390
3624.4 444792390 448774844 453459680 458217680 462468207 466635287 470793843 474893034 478968710
3640.7 478968710 482931674 486876249 491226405 496172130 500710785 504450440 508240402 512460113
3657 512460113 516624391 520398200 523885965 527352333 530942857 534524143 538040340 541597664 545132697
3675.4 545132697 548379540 551341355 554227948 557162821 560317874 563725233 566707432 569011271
3691.7 569011271 571283937 573650241 575954556 578206837 580402851 582555115 584750831 586978078
3708 586978078 589065075 590813160 592563152 594483197 596459985 598361075 600046813 601548731 602981865
$$ packed form
3591.7C80470663L566623L791601L967344M020125L844768L702730L794700M076957
3608.1D11235511M257888M267514M198372M150540M401922M569709M047305L663629
3624.4D44792390L982454M684836M758000M250527M167080M158556M099191M075676
3640.7D78968710L962964L944575M350156M945725M538655L739655L789962M219711
3657E12460113M164278L773809L487765L466368L590524L581286L516197L557324L535033
3675.4E45132697L246843K961815K886593K934873L155053L407359K982199K303839
3691.7E69011271K272666K366304K304315K252281K196014K152264K195716K227247
3708E86978078K086997J748085J749992J920045J976788J901090J685738J501918J433134
$$ plain form
3726.4 602981865 604591846 606395781 608280718 610094726 611574411 612809360 614071608 615159214
3742.7 615159214 616016626 617356718 618846655 619873106 620951712 622434914 623896122 625023961
3759 625023961 626053870 627249658 628493965 629724681 630778849 631663322 632696271 633944333 635284901
3777.3 635284901 636391819 637221396 638021350 638840020 639732301 640724719 641772509 642814159 643764794
3795.7 643764794 644782543 645773113 646452665 647310019 648186207 648783684 649577856 650674045 651668668
3814.1 651668668 652382493 653325677 654147208 654583871 655340016 656224072 656970263 657617509 658302963 659322798
3834.4 659322798 660292327 660715520 661090076 661658108 662267864 662976503 663854003 664706767 664858043 664777994
3854.8 664777994 665533900 666498423 667277277 667780340 668203533 668872893 669440806 669851482 670338631 670899570
$$ packed form
3726.4F02981865J609981J803935J884937J814008J479685J234949J262248J087606
3742.7F15159214Q57412J340092J489937J026451J078606J483202J461208J127839
3759F25023961J029909J195788J244307J230716J054168Q84473J032949J248062J340568
3777.3F35284901J106918Q29577P99954Q18670Q92281R92418J047790J041650R50635
3795.7F43764794J017749R90570O79552Q57354Q76188N97477P94172J096189R94623
3814.1F51668668P13825R43184Q21531M36663P56145Q84056P46191O47246O85454J019835
3834.4F59322798R69529M23193L74556N68032O09756P08639Q77500Q52764J51276q0049
3854.8F64777994P55906R64523P78854N03063M23193O69360N67913M10676M87149N60939
$$ plain form
3875.2 670899570 671629071 672170699 672617972 673358798 673872650 674202979 674644351 674934089 675284624 675939202
3895.6 675939202 676591992 677003860 677243769 677393794 677622616 678014338 678401709 678758323 679187357 679608524
3916 679608524 679932952 680272281 680610657 680864394 681151867 681524694 681822956 682030261 682284534 682559669
3936.4 682559669 682845175 683152258 683386862 683640003 683972239 684231102 684471905 684793174 685081542 685285747
3956.8 685285747 685518146 685813069 686114013 686393499 686629057 686870933 687175155 687495530 687785149 688008726
3977.2 688008726 688162506 688370824 688676655 688936293 689103186 689288199 689498246 689659953 689833701 690076411
3997.6 690076411
$$ packed form
3875.2F70899570P29501N41628M47273P40826N13852L30329M41372K89738L50535O54578
3895.6F75939202O52790M11868K39909J50025K28822L91722L87371L56614M29034M21167
3916F79608524L24428L39329L38376K53737K87473L72827K98262K07305K54273K75135
3936.4F82559669K85506L07083K34604K53141L32236K58863K40803L21269K88368K04205
3956.8F85285747K32399K94923L00944K79486K35558K41876L04222L20375K89619K23577
3977.2F88008726J53780K08318L05831K59638J66893J85013K10047J61707J73748K42710
3997.6F90076411
##END=$$ End of the data block
