##TITLE=$$ Begin of the data block
##JCAMP-DX=5.00 $$ ACD/SpecManager v 10.08
##SPECTROMETER/DATA SYSTEM=Alpha
##DATE=29 Dec 2014 11:22:02
##DATA TYPE=INFRARED SPECTRUM
##DATA CLASS=XYDATA
##ORIGIN=
##OWNER=
##NPOINTS=1765
##FIRSTX=399.76428223
##LASTX=3997.64306641
##MAXX=3997.64306641
##MINX=399.76428223
##MAXY=0.82829261
##MINY=0.20720814
##XFACTOR=1.0000000000
##YFACTOR=1.000000000000000e-9
##FIRSTY=0.51988429
##DELTAX=2.03961372
##XUNITS=1/CM
##YUNITS=ARBITRARY UNITS
##XYDATA=(X++(Y..Y))
399.8E19884288o022453m500926k901673q34405J249075K424955J987994J049280N36203
418.1E12872338p45237k328693l143728l248573k964675l004909l125339l053338k383738
436.5D88874108l99053K366513M531443N228877M836499L865540K704263J567185N01752
454.8E14077127k09868r95398j948118k678215l006339l251970l412187l372938l583848
473.2D91618246l460407k620638j686364j023442n83619k92152j26958k03937m98354
491.5D81122375r09150j539946k174407k502710k551049k383947k453148l233016m020393
509.9D59354609m117876m034519m244387m585743m660398m043698k805204j343071
526.2D29519713r5576L82751N88030J677662L791004N812556O498039N538404L647923
$$ plain form
399.8 519884288 513861835 509360909 506459236 505624831 506873906 509298861 511286855 512336135 512872338
418.1 512872338 512127101 509798408 506654680 503406107 500441432 497436523 494311184 491257846 488874108
436.5 488874108 488475055 490841568 495373011 500601888 505438387 509303927 512008190 513575375 514077127
454.8 514077127 513867259 512871861 510923743 508245528 505239189 501987219 498575032 495202094 491618246
473.2 491618246 488157839 485537201 483850837 482827395 482243776 481951624 481824666 481620729 481122375
491.5 481122375 480213225 478673279 476498872 473996162 471445113 469061166 466608018 463375002 459354609
509.9 459354609 455236733 451202214 446957827 442372084 437711686 433667988 430862784 429519713
526.2 429519713 429424137 429806888 430394918 432072580 435863584 441676140 448174179 453712583 457360506
544.6D57360506J880437N96523n02973j605690k589196l283441l815770m442334n428463
562.9D38169599o604970p465273p437974o010831l605485j127898J333654L973215
579.3D11224037O314248P864982Q264005P162899N180746L485412K227127J191974
595.6D52915430L20554l58373o49095m20451K20269O58691O84947Q07881J427055K508700
616D58115608L582179M039615L902615L749668L853142L983170L672272K857477K004921
634.3D89760667J572490J615524J810730J673758J130372P13646Q82238J415879J640022
652.7E02215326J346588Q71837O95169J087427J505614J319706J216292J513482J345515
671E13116956J569450K112984K023042J451850J178920J368642J562774J374900O75023
$$ plain form
544.6 457360506 459240943 459837466 459334493 457728803 455139607 451856166 448040396 443598062 438169599
562.9 438169599 431564629 424099356 416661382 410650551 407045066 405917168 407250822 411224037
579.3 411224037 417538285 425403267 433667272 440830171 446010917 449496329 451723456 452915430
595.6 452915430 453235984 452877611 452228516 451808065 452028334 452687025 453371972 454179853 455606908 458115608
616 458115608 461697787 465737402 469640017 473389685 477242827 481225997 484898269 487755746 489760667
634.3 489760667 491333157 492948681 494759411 496433169 497563541 498277187 499159425 500575304 502215326
652.7 502215326 503561914 504433751 505128920 506216347 507721961 509041667 510257959 511771441 513116956
671 513116956 514686406 516799390 518822432 520274282 521453202 522821844 524384618 525759518 526434541
689.4E26434541k68340j011014j463950k021968k888680l601074l647566k847671j354397
707.7E07329881K43128J532435K617598L758370M994870O125629O693959O545722O164372
726.1E46005964N896867N691170N159319M146576L098726K295911J671911J018106
742.4E74984550r4234j852990l531217m435957m745781m963696n285323n342841m585028
760.8E40147483l053069j196444Q56996L077984N227506P154524Q900821J0118127
777.1E71233928J0135770R001136P584751O546556N831242N137622M343272L802657
793.4F23616934L883302M480600N048693M945814M129589L176033K618969K336919
809.7F54236853J883567J174032N72980K88486J30475k75612j197815k495945l708660
$$ plain form
689.4 526434541 526166201 525155187 523691237 521669269 518780589 515179515 511531949 508684278 507329881
707.7 507329881 507573009 509105444 511723042 515481412 520476282 526601911 533295870 539841592 546005964
726.1 546005964 551902831 557594001 562753320 566899896 569998622 572294533 573966444 574984550
742.4 574984550 574890316 573037326 569506109 565070152 560324371 555360675 550075352 544732511 540147483
760.8 540147483 537094414 535897970 536754966 539832950 545060456 552214980 561115801 571233928
777.1 571233928 581369698 590370834 597955585 604502141 610333383 615471005 619814277 623616934
793.4 623616934 627500236 631980836 637029529 641975343 646104932 649280965 651899934 654236853
809.7 654236853 656120420 657294452 657867432 658155918 658286393 658010781 656812966 654317021 650608361
828.1F50608361m515469n037725n551458o053388o223738n883813n164564m499793
844.4F07678413m260659m333138m516423m778683n109489n475760n251765k989411
860.7E70963085J763105P160366J1045158J3067066J3643563J2681723J0336935P277191
877F47938192L924549M25517k842665n245864o504655o955087o960332o746054o500602
895.4F10532999o193638n838096n724847o145418p090449q321226r542346j0523975
911.7E51153004j1235714j1581600j1148929r617865p153511m430562k216727p46369
928D93021727L70591J562804K770901L792107M669965N462646N747736M421532Q69095
946.4E22689104l932774q439541j1893064j4322072j6014099j7211080j8078088j8734575
$$ plain form
828.1 650608361 646092892 641055167 635503709 629450321 623226583 617342770 612178206 607678413
844.4 607678413 603417754 599084616 594568193 589789510 584680021 579204261 573952496 570963085
860.7 570963085 572726190 579886556 590931714 603998780 617642343 630324066 640661001 647938192
877 647938192 651862741 652288258 649445593 644199729 637695074 630739987 623779655 617033601 610532999
895.4 610532999 604339361 598501265 592776418 586631000 579540551 571219325 561676979 551153004
911.7 551153004 539917290 528335690 517186761 507568896 500415385 495984823 493768096 493021727
928 493021727 493392318 494955122 497726023 501518130 506188095 511650741 517398477 521820009 522689104
946.4 522689104 518756330 510316789 498423725 484101653 468087554 450876474 432798386 414063811
962.7D14063811j9280851j9777000k0179510k0401030k0300270j9731283j8627792
977B75766075j6947568j4728442j2132272r387254o763116m487515k650752j249463
993.3B07419693k11551N31241R89065J160413J052230O38068O9901l95983o07550m20213
1013.7B10225314R9853P74234J489133K206132K913191L499777L830269L866762L696754
1032B32601419L315970K588034J612648Q24273M81114N17934Q28401J444503K480671
1050.4B46694967L934696N554975O981968Q159161R283215J0355294J0614007Q513034
1066.7C10091317K948701m667252j0424674j1388004q341014m187495p36743J749605
1083B75044441L436625M566610N465716O247759O675869O423980N349934L686041J969278
$$ plain form
962.7 414063811 394782960 375005960 354826450 334425420 314125150 294393867 275766075
977 275766075 258818507 244090065 231957793 222570539 215807423 211319908 208669156 207419693
993.3 207419693 207208142 207739383 208728448 209888861 210941091 211579159 211649060 211253077 210645527 210225314
1013.7 210225314 210325167 211099401 212588534 214794666 217707857 221207634 225037903 228904665 232601419
1032 232601419 235917389 238505423 240118071 240942344 241423458 241941392 242769793 244214296 246694967
1050.4 246694967 250629663 256184638 263166606 271325767 280608982 290964276 301578283 310091317
1066.7 310091317 313040018 308372766 297948092 286560088 278219074 274031579 273294836 275044441
1083 275044441 278481066 283047676 288513392 294761151 301437020 307861000 313210934 316896975 318866253
1101.4C18866253Q95142R38923J941859L233940M185974M563958M419207L867656L027201
1119.8C45940113K186805J786321K156973L269762M545838N024820M041374J635164
1136.1C70587170j581550m749268p161766q470208q694171q049220o792486n172044
1152.4C19916457l444403j808465k67416J326948L140539N194306P366568R495795
1168.7C40920329J1410326J2963056J4060587J4620364J4739632J4601499J4208645
1183D37524438J3478279J2273729J0515839Q404702O300866M511208L224283K418071
1199.3D98651415J963049J830876K136171K900779L893316M819930N426466N597830
1215.6E27219832N352497M626274L382325J827062K92837q78990j537203j819551j936615
$$ plain form
1101.4 318866253 319761395 320700318 322642177 325876117 330062091 334626049 339045256 342912912 345940113
1119.8 345940113 348126918 349913239 352070212 355339974 359885812 364910632 368952006 370587170
1136.1 370587170 369005620 364256352 357094586 348624378 339930207 331880987 325088501 319916457
1152.4 319916457 316472054 314663589 314396173 315723121 318863660 324057966 331424534 340920329
1168.7 340920329 352330655 365293711 379354298 393974662 408714294 423315793 437524438
1183 437524438 451002717 463276446 473792285 482196987 488497853 493009061 496233344 498651415
1199.3 498651415 500614464 502445340 504581511 507482290 511375606 516195536 521622002 527219832
1215.6 527219832 532572329 537198603 540580928 542407990 542700827 541821837 540284634 538465083 536528468
1234E36528468k008676j982212j690746j011252m9055R05335J616061K033889K255976
1252.3E36597788K323151K152324J698434J163960R16004J164794J819610K485633
1268.6E50321698K655685K180219J366317N67973o5208n45680q65937r77993r77873
1287E53659201j044453j243829j582206j990675k316714k491832k502083k387226k315640
1305.4E35784543k325058k147913j725138j399874j305223j320541j528918k095402
1321.7E21936476l061950m370511n622565o244064o042719n241483m111528k835006
1338D84406650j625329o16193J82867O58095O31303K05487k51413n49793p36117q60632
1358.4D81444925r29892j003414r73881o58095j85817K87712Q27521J218289J124143
$$ plain form
1234 536528468 534519792 532537580 530846834 529835582 529786527 530691862 532307923 534341812 536597788
1252.3 536597788 538920939 541073263 542771697 543935657 544851661 546016455 547836065 550321698
1268.6 550321698 552977383 555157602 556523919 557091892 557026684 556481004 555615067 554637074 553659201
1287 553659201 552614748 551370919 549788713 547798038 545481324 542989492 540487409 538100183 535784543
1305.4 535784543 533459485 531311572 529586434 528186560 526881337 525560796 524031878 521936476
1321.7 521936476 518874526 514504015 508881450 502637386 496594667 491353184 487241656 484406650
1338 484406650 482781321 482165128 482347995 483006090 483637393 483842880 483591467 483041674 482305557 481444925
1358.4 481444925 480515033 479511619 478537738 477879643 477693826 477981538 478809059 480027348 481151491
1376.7D81151491J042515J242519J742124K828271M306733M662454L635615K676130
1393.1E03287852J619339J87456r83536j525581j607060j802087k100348k255202k308279
1411.4D92512554k121985j632094j070410p14213m34697P5698N65887J039594J538038
1429.8D89758372J649440J683622K281964K473652J825721J672148J585067J192152
1446.1E04122138M34935n70476j261353j430095j576304j848996r99540N06789K360254
1464.5D99737352L832191M761100O974638J0689556J1316896R355247Q365333Q145630
1480.8E63177943P963717P277191P019937P196665O459236M863918M659652N343736
1497.1F13961995M675865L519535L141701M043639N048156L062009J862884K099097
$$ plain form
1376.7 481151491 482194006 483436525 485178649 488006920 492313653 496976107 500611722 503287852
1393.1 503287852 504907191 505094647 504111111 502585530 500978470 499176383 497076035 494820833 492512554
1411.4 492512554 490390569 488758475 487688065 486973852 486539155 486614853 487180740 488220334 489758372
1429.8 489758372 491407812 493091434 495373398 497847050 499672771 501344919 502929986 504122138
1446.1 504122138 504557073 503986597 502725244 501295149 499718845 497869849 496870309 497377098 499737352
1464.5 499737352 503569543 508330643 515305281 525994837 537311733 546666980 555032313 563177943
1480.8 563177943 571141660 578418851 585438788 592635453 599094689 603958607 608618259 613961995
1497.1 613961995 618637860 622157395 625299096 629342735 634390891 637452900 639315784 641414881
1513.4F41414881K518475K757370K690137K736926K115011J561582J561880J492501
1529.7F58848763J774787J821280J213372J293480J889646J015902R3519l9517j6630
1548.1F67894602J967m1723K682K00689M8637j642942j876832j364171j144052j161575
1568.5F60917282j638472j613617j284718j758099k125800j854062j827478j925290
1584.8F46889746k025902k103508k196550k296627k465188k633750k730787k879143
1601.1F27558291l072679l203511l287793l545999l766835l650665l798902m524112
1617.4E98707795l963232l225624l574729l735245l574371l396928k595365j614154
1633.7E73028147j388550j554250j076103l08275N87523J701355J976013J499951K812386
$$ plain form
1513.4 641414881 643933356 646690726 649380863 652117789 654232800 655794382 657356262 658848763
1529.7 658848763 660623550 662444830 663658202 664951682 666841328 667857230 667950749 667911232 667894602
1548.1 667894602 667896569 667854846 667857528 668058217 668106854 666463912 664587080 663222909 662078857 660917282
1568.5 660917282 659278810 657665193 656380475 654622376 652496576 650642514 648815036 646889746
1584.8 646889746 644863844 642760336 640563786 638267159 635801971 633168221 630437434 627558291
1601.1 627558291 624485612 621282101 617994308 614448309 610681474 607030809 603231907 598707795
1617.4 598707795 594744563 591518939 587944210 584208965 580634594 577237666 574642301 573028147
1633.7 573028147 571639597 570085347 569009244 568700969 569288492 570989847 572965860 574465811 577278197
1652.1E77278197M366636K754748K513051L545463M562259M594147M084647M920184
1668.4F08619332N763948M952371N149484N592108M922032M806757N873084P214129
1684.7F52893245N495846M334331M612625M378736M854560N040943M327893M054189
1701.1F89992368K920449K471149K501845K137959K090872K275705K544880K626479
1717.4G09561706J892328J445770J652837J852989J899541J971304K007425K227008
1733.7G24510908J884282J500845J838326K049387K142727K437115K768397K973318
1750G42105305K753079K379596K473653K578139K437174K320111J927376J723051J800597
1768.4G62498081J871407J742244J207649R28760J073062J163543J090943J073540
$$ plain form
1652.1 577278197 581644833 584399581 586912632 590458095 595020354 599614501 603699148 608619332
1668.4 608619332 614383280 619335651 624485135 630077243 634999275 639806032 645679116 652893245
1684.7 652893245 658389091 662723422 667336047 671714783 676569343 681610286 685938179 689992368
1701.1 689992368 692912817 695383966 697885811 700023770 702114642 704390347 706935227 709561706
1717.4 709561706 711454034 712899804 714552641 716405630 718305171 720276475 722283900 724510908
1733.7 724510908 726395190 727896035 729734361 731783748 733926475 736363590 739131987 742105305
1750 742105305 744858384 747237980 749711633 752289772 754726946 757047057 758974433 760697484 762498081
1768.4 762498081 764369488 766111732 767319381 768248141 769321203 770484746 771575689 772649229
1784.7G72649229J048922J066744J186789J089870Q08657Q63552J019716R29773P24316
1803G81387568P06553Q66175R72449Q51810O26862O18101O97910P26343P70449Q02100
1823.4G89026320P40767O88374O14464L65138L11077M34339M25577L71694M83156N32090
1843.8G93992996K98918J52349J93179K51650K46883K04623J97172K69830L23117L37004
1864.2G96467721L64364K54511N3049J20043L26753L60489K72512K55049L74853M95672
1884.6G99345016N30780M52459K57671J82926K36750K66552K70367K23517J08659P5162
1905H01949859J76191K35260J64985Q5473Q8275J17779J61290K18093J63317M4107
1925.4H03404629L5703Q7142J65344K27987J75417R4950J01209J54912J68026J62661
$$ plain form
1784.7 772649229 773698151 774764895 775951684 777041554 777850211 778713763 779733479 780663252 781387568
1803 781387568 782094121 782960296 783932745 784784555 785411417 786029518 786727428 787453771 788224220 789026320
1823.4 789026320 789767087 790455461 791069925 791435063 791746140 792180479 792606056 792977750 793460906 793992996
1843.8 793992996 794291914 794444263 794637442 794889092 795135975 795340598 795537770 795807600 796130717 796467721
1864.2 796467721 796832085 797086596 797139645 797259688 797586441 797946930 798219442 798474491 798849344 799345016
1884.6 799345016 799875796 800328255 800585926 800768852 801005602 801272154 801542521 801766038 801874697 801949859
1905 801949859 802126050 802361310 802526295 802611768 802700043 802817822 802979112 803197205 803360522 803404629
1925.4 803404629 803440332 803527474 803692818 803920805 804096222 804191172 804292381 804447293 804615319 804777980
1945.8H04777980J47998J27018J42753J96874K23696J97113J75535J68980K28166K77400
1966.2H06663513K00689J20044J07169R7811J01626J46926J69038J20879O4313P7009
1986.6H07869017J24812J32203L0041p7128m0293M2260M5359k8134j26958k10046k29836
2009H07531297j95205j59800k29180m23908n65112n59389n35190m98474l35395k78771
2029.4H03750873l75629l42488k41041k42174l54469m87923m49002k32458r3043j22547
2049.8H00810099k15590k41459j14858Q5414J79827J12474k5749r8229K146J72615
2070.2H00666690K16246Q6069o3241o1512Q6844K11597J89662J04308N2273O7592J46865
2092.7H01703393K38359K49863J71125J07825J42693K39492K57313J64747P3672O8426
$$ plain form
1945.8 804777980 804925978 805052996 805195749 805392623 805616319 805813432 805988967 806157947 806386113 806663513
1966.2 806663513 806864202 806984246 807091415 807189226 807290852 807437778 807606816 807727695 807792008 807869017
1986.6 807869017 807993829 808126032 808156073 808078945 808038652 808080912 808126271 808098137 807971179 807761133 807531297
2009 807531297 807336092 807176292 806947112 806523204 805958092 805398703 804863513 804365039 804029644 803750873
2029.4 803750873 803375244 803032756 802791715 802549541 802195072 801707149 801258147 801025689 800932646 800810099
2049.8 800810099 800594509 800353050 800238192 800323606 800503433 800615907 800590158 800491929 800494075 800666690
2070.2 800666690 800882936 800969005 800905764 800844252 800931096 801142693 801332355 801436663 801488936 801556528 801703393
2092.7 801703393 801941752 802191615 802362740 802470565 802613258 802852750 803110063 803274810 803348482 803416908
2113.1H03416908J37567K04027J54138J5914n4717k384J04189J37865N8711k4498r358
2135.5H04138362O0499J18315J13964K1995m4942R775J52051K58208J97351N4538O4432
2157.9H05144548K45512M30763M65154L31283J99497K85268N55694P17401O35386M41551
2178.3H09452057L44455M35472N90622O37829N28694L38733K54988L93272N85377N95451
2198.7H14156950M24921K67983K78711M50611O04153N60701L72707K41399L01957M83513
2219.1H18143606N76198M42207K28524J74821K76685L94701M47214L77953J97649Q8990
2239.5H21348548J88768L53634L54111K06650Q1956J11282K54452L22044K84135J85669
2259.9H23691249P9393J13845K73287L52681K76089J63019J45018K19822K91228K94685
$$ plain form
2113.1 803416908 803554475 803758502 803912640 803928554 803873837 803871453 803975642 804113507 804172218 804147720 804138362
2135.5 804138362 804198861 804317176 804431140 804453135 804408193 804417968 804570019 804828227 805025578 805080116 805144548
2157.9 805144548 805390060 805820823 806285977 806617260 806816757 807102025 807657719 808375120 809010506 809452057
2178.3 809452057 809796512 810231984 810822606 811460435 811989129 812327862 812582850 812976122 813561499 814156950
2198.7 814156950 814581871 814849854 815128565 815579176 816183329 816744030 817116737 817358136 817660093 818143606
2219.1 818143606 818719804 819162011 819390535 819565356 819842041 820236742 820683956 821061909 821259558 821348548
2239.5 821348548 821537316 821890950 822245061 822451711 822533667 822644949 822899401 823221445 823505580 823691249
2259.9 823691249 823770642 823884487 824157774 824510455 824786544 824949563 825094581 825314403 825605631 825900316
2280.3H25900316K24054J57595J65760J98126J81258J29282R3460J01865J24275J17720
2300.7H27393711J04427Q3089M7386N1438J34468J85728Q6904j0431p152J8119Q3149
2323.1H28170836J19746K026j30415j47223o8546j192o6876k32339l13699k27571j83344
2345.6H26921403j48415o7651o9619j16348q5115k5213p0810j95504l50773m55856
2366H25336099l38257j75118k08140l01718l53277l14713j59025m5657p9870k09153
2386.4H23151171k92718k53558j60516j23977j88947k95281l59714l33071k66373k63155
2406.8H20613861l46899m39167m38035l89039m26173n23806n61416n45263n21243m97937
2427.2H15924883n26548o04033o43492o34074n98788n75483o27041o95407o81460o06776
$$ plain form
2280.3 825900316 826124370 826281965 826447725 826645851 826827109 826956391 827049851 827151716 827275991 827393711
2300.7 827393711 827498138 827581227 827628613 827680051 827814519 828000247 828087151 828076720 828069568 828087687 828170836
2323.1 828170836 828290582 828292608 828162193 828014970 827946424 827945232 827878356 827646017 827332318 827104747 826921403
2345.6 826921403 826772988 826705337 826635718 826519370 826434255 826409042 826338232 826142728 825791955 825336099
2366 825336099 824997842 824822724 824614584 824312866 823959589 823644876 823485851 823440194 823360324 823151171
2386.4 823151171 822858453 822604895 822444379 822320402 822131455 821836174 821476460 821143389 820877016 820613861
2406.8 820613861 820266962 819827795 819389760 819000721 818574548 818050742 817489326 816944063 816422820 815924883
2427.2 815924883 815398335 814794302 814150810 813516736 812917948 812342465 811715424 811020017 810338557 809731781
2447.6H09731781n74469o18398o69003o70850o40392n85199n17726n34117o37352o57320
2467.9H03626955n50151m54724m58121n52416o54757o44744n21123m29332m31955m74632
2488.3G98455000n01394m52936l45886k64227k78950l50177l94881l91483l44038l05415
2508.7G94825613l13520l43025l80695m20928m18186m08172m68612n33819n50807n63442
2529.1G90424407n79477o07669o55890o71267o63698o98984p57992p49171o57200o02425
2549.5G83780634o47366p30991p79450p51734o64592n94735o09874o93083p63536p25627
2569.9G76819646n89132n19693o12616p48217p77245o71566n11884m48764n35011o29306
2590.3G70776212n93543m56214l28898l15011m65274o34670o10411m78864m83632o32524
$$ plain form
2447.6 809731781 809157312 808538914 807869911 807199061 806558669 805973470 805455744 804921627 804284275 803626955
2467.9 803626955 803076804 802622080 802163959 801611543 800956786 800312042 799790919 799361587 798929632 798455000
2488.3 798455000 797953606 797500670 797154784 796890557 796611607 796261430 795866549 795475066 795131028 794825613
2508.7 794825613 794512093 794169068 793788373 793367445 792949259 792541087 792072475 791538656 790987849 790424407
2529.1 790424407 789844930 789237261 788581371 787910104 787246406 786547422 785789430 785040259 784383059 783780634
2549.5 783780634 783133268 782402277 781622827 780871093 780206501 779611766 779001892 778308809 777545273 776819646
2569.9 776819646 776230514 775710821 775098205 774349988 773572743 772901177 772389293 771940529 771405518 770776212
2590.3 770776212 770182669 769726455 769397557 769082546 768617272 767982602 767372191 766893327 766409695 765777171
2610.7G65777171q15511r53972r60768q51571p72953q94249j177847j347423j270711
2629.1G56732166j099169j052857j189053j351476j401901j324832j174510j135528
2645.4G47002840j276076j410126j377762j213074j112222j152456j237273j285374
2661.7G36938477j207352j070678j064539j139939j154959j120448j045943r34422
2678G28200197q86678r70066j067221j051963r64164r06945r64999j100302j166999
2696.4G19120860j127660j077414j106024j228272j348317j330137j207054j114547
2712.7G09581435j114369j170635j202345j156747j036167r22680r14574r93848j020074
2731.1G00049996r13977p69079p31707q15153q95560q81612q00848p47502p59184q05020
$$ plain form
2610.7 765777171 764961660 764007688 763046920 762195349 761422396 760528147 759350300 758002877 756732166
2629.1 756732166 755632997 754580140 753391087 752039611 750637710 749312878 748138368 747002840
2645.4 747002840 745726764 744316638 742938876 741725802 740613580 739461124 738223851 736938477
2661.7 736938477 735731125 734660447 733595908 732455969 731301010 730180562 729134619 728200197
2678 728200197 727313519 726343453 725276232 724224269 723260105 722353160 721388161 720287859 719120860
2696.4 719120860 717993200 716915786 715809762 714581490 713233173 711903036 710695982 709581435
2712.7 709581435 708467066 707296431 706094086 704937339 703901172 702978492 702063918 701070070 700049996
2731.1 700049996 699136019 698366940 697635233 696820080 695924520 695042908 694242060 693494558 692735374 691930354
2751.4F91930354q35598p85470o68406o03736o19352o51061o78361o69658o33061o51657
2771.8F85133994p77483r27151r89854r97424j017809j086891j189053j248419j271784
2790.2F75628126j316250j410603j555741j694739j774490j795351j796246j861989
2806.5F62422717k036989k191723k191782k158403k234399k371848k515137k616584
2822.8F44105852k631188k604723k658784k880216l108799l157139l131032l234446
2839.1F20699525l526032l894866m199147m351020m298627m052043l692150l310025
2855.5E89375615l012180k934516l132462l585041m234731m869938n267143n485594
2871.8E56854010n702198n863666n771935n356789m671633l826976k979636k251923
$$ plain form
2751.4 691930354 691094756 690309286 689640880 689037144 688417792 687766731 687088370 686418712 685785651 685133994
2771.8 685133994 684356511 683429360 682439506 681442082 680424273 679337382 678148329 676899910 675628126
2790.2 675628126 674311876 672901273 671345532 669650793 667876303 666080952 664284706 662422717
2806.5 662422717 660385728 658194005 656002223 653843820 651609421 649237573 646722436 644105852
2822.8 644105852 641474664 638869941 636211157 633330941 630222142 627065003 623933971 620699525
2839.1 620699525 617173493 613278627 609079480 604728460 600429833 596377790 592685640 589375615
2855.5 589375615 586363435 583428919 580296457 576711416 572476685 567606747 562339604 556854010
2871.8 556854010 551151812 545288146 539516211 534159422 529487789 525660813 522681177 520429254
2888.1E20429254j659334j157224p84576o25670o70195q40247j071512j298011j526296
2906.5E10796189j880645k399922k987444l544420l982574m241973m275620l987014
2922.8D83496577l365487k490163j455635l48955Q53508K135039L379523M487336N383104
2941.1D92074847N966783O185949O185829O221772O356656O428003O369174O229043
2957.4E42018056O015658N758703N487859N175829M802644M402042M095018L961563
2973.8E81717372L939271L973305L894746L506065L009319K705634K565443K410949
2990.1F07722104K062678J539171J127183Q74996O37472L89338N7280l40224o28590
3008.4F13441408q03113j028300j327693j632035j909196k094150k179146k247810
$$ plain form
2888.1 520429254 518769920 517612696 516828120 516202450 515532255 514692008 513620496 512322485 510796189
2906.5 510796189 508915544 506515622 503528178 499983758 496001184 491759211 487483591 483496577
2922.8 483496577 480131090 477640927 476185292 475836337 476689845 478824884 482204407 486691743 492074847
2941.1 492074847 498041630 504227579 510413408 516635180 522991836 529419839 535789013 542018056
2957.4 542018056 548033714 553792417 559280276 564456105 569258749 573660791 577755809 581717372
2973.8 581717372 585656643 589629948 593524694 597030759 600040078 602745712 605311155 607722104
2990.1 607722104 609784782 611323953 612451136 613326132 613963604 614352942 614410222 614069998 613441408
3008.4 613441408 612638295 611609995 610282302 608650267 606741071 604646921 602467775 600219965
3024.7F00219965k346993k441048k507270k559065k669931k801180k775490k725601
3041.1E79393387k858401l059864l150641l107965l049553l026247l031850l138363
3057.4E54970503l232598l125966k947331k900898l044128l247023l287256l138482
3073.7E30046821k890170k762318k939164l166676l225028l214956l129720l025234
3090E05693555l091872l184706l086835k906561k857387k948135k987713k916753k898127
3108.4D78815466l003687k916514k601326k533138k743333k996236l158421l047973
3124.7D55814838k762883k632499k740115k835781k714514k488703k426445k623350
3141D34590548k819240k769083k575129k351940k201378k335757k606928k646327k484829
$$ plain form
3024.7 600219965 597872972 595431924 592924654 590365589 587695658 584894478 582118988 579393387
3041.1 579393387 576534986 573475122 570324481 567216516 564166963 561140716 558108866 554970503
3057.4 554970503 551737905 548611939 545664608 542763710 539719582 536472559 533185303 530046821
3073.7 530046821 527156651 524394333 521455169 518288493 515063465 511848509 508718789 505693555
3090 505693555 502601683 499416977 496330142 493423581 490566194 487618059 484630346 481713593 478815466
3108.4 478815466 475811779 472895265 470293939 467760801 465017468 462021232 458862811 455814838
3124.7 455814838 453051955 450419456 447679341 444843560 442129046 439640343 437213898 434590548
3141 434590548 431771308 429002225 426427096 424075156 421873778 419538021 416931093 414284766 411799937
3159.4D11799937k333551k296239k306730k251446k204269k198249k171725k122432
3175.7C93915296k055824k012789k031297k041101j993567j927972j911193j940251
3192C78001302j924574j868456j824201j749545j662642j666009j696795j679600j642704
3210.3C62286776j585871j535713j516909j514703j507878j494497j462370j399458
3226.7C50269377j306027j161367j105547j328379j545935j461029j271368j114010
3243C39975715j000941j059473j240998j243800j022905q92282j002997j142025j115203
3261.3C30255091r97990q91835p37428n95183p18474r54956j028210j003772r19461
3279.7C22407782q14170p58916p65651p55936o33299n66841p13944r10997r94534r25451
$$ plain form
3159.4 411799937 409466386 407170147 404863417 402611971 400407702 398209453 396037728 393915296
3175.7 393915296 391859472 389846683 387815386 385774285 383780718 381852746 379941553 378001302
3192 378001302 376076728 374208272 372384071 370634526 368971884 367305875 365609080 363929480 362286776
3210.3 362286776 360700905 359165192 357648283 356133580 354625702 353131205 351668835 350269377
3226.7 350269377 348963350 347801983 346696436 345368057 343822122 342361093 341089725 339975715
3243 339975715 338974774 337915301 336674303 335430503 334407598 333515316 332512319 331370294 330255091
3261.3 330255091 329257101 328365266 327627838 327032655 326314181 325359225 324331015 323327243 322407782
3279.7 322407782 321593612 320834696 320069045 319313109 318679810 318112969 317399025 316488028 315493494 314568043
3300.1C14568043p10964n21064o10739r32157j164317j155675j030832r64910r52274
3318.4C06525111r23335q42095p80374r25123j107008j044869r28193q80540p85142
3336.8B98308432q32945j034439j094728j105368j047731q23676q58754j179666j242101
3355.2B89089024j003265q45522r14276r31292o98567o21527r40025j279533j251906
3373.5B80603111r46760p51704p30813p74592p88331o76513m27067j75625k87473o94216
3393.9B74350017p26372k55197r626m19170q50588o67602k95460j94698k30164l41832
3414.3B70359308m12316k47031j03742j27226o4045J48326L36200L01957K62141L68119
3434.7B70821691K30640j07855j21444J96486N02199N81861M10557L36319M92871O51329
$$ plain form
3300.1 314568043 313857079 313336015 312725276 311793119 310628802 309473127 308442295 307477385 306525111
3318.4 306525111 305601776 304759681 303979307 303054184 301947176 300902307 299974114 299093574 298308432
3336.8 298308432 297475487 296441048 295346320 294240952 293193221 292369545 291510791 290331125 289089024
3355.2 289089024 288085759 287240237 286325961 285394669 284696102 284074575 283134550 281855017 280603111
3373.5 280603111 279656351 278904647 278173834 277399242 276610911 275934398 275507331 275331706 275044233 274350017
3393.9 274350017 273623645 273368448 273358822 272939652 272089064 271421462 271126002 270931304 270701140 270359308
3414.3 270359308 269946992 269699961 269596219 269468993 269404948 269553274 269889474 270191431 270453572 270821691
3434.7 270821691 271052331 270944476 270823032 271019518 271521717 272103578 272514135 272850454 273343325 273994654
3455.1B73994654P62940Q45313P48455P14750J031220J219809Q56250L87281L77626
3473.4B80938298O65426J014620J145512Q59290P18743R67532J031876R00298J014888
3491.8B89256483J192600J173496J029611J042574J193345J030683P90805R59367J244127
3510.2B98913091J350910J217663R87560J003176J289397J573861J391649J012653
3526.5C08739960J033843J252234J440882J619935J538754J275927J416743J829922
3542.8C20148200J914263J506954J329780J650780J793653J737743J909882K155423
3559.1C34146678K157182K083510K394468K946704K854705K440840K474159K797157
3575.4C54295403L017336L150284L249794L357739L602713L644943L370941L326952
$$ plain form
3455.1 273994654 274757594 275602907 276351362 277066112 278097332 279317141 280173391 280560672 280938298
3473.4 280938298 281603724 282618344 283763856 284623146 285341889 286309421 287341297 288241595 289256483
3491.8 289256483 290449083 291622579 292652190 293694764 294888109 295918792 296709597 297668964 298913091
3510.2 298913091 300264001 301481664 302469224 303472400 304761797 306335658 307727307 308739960
3526.5 308739960 309773803 311026037 312466919 314086854 315625608 316901535 318318278 320148200
3542.8 320148200 322062463 323569417 324899197 326549977 328343630 330081373 331991255 334146678
3559.1 334146678 336303860 338387370 340781838 343728542 346583247 349024087 351498246 354295403
3575.4 354295403 357312739 360463023 363712817 367070556 370673269 374318212 377689153 381016105
3591.7C81016105L616482L849358L968656M013479L881275L795088L907591M133910
3608.1D12181944M248500M253268M197478M157096M438579M643619M094869L645152
3624.4D45860505L952563M691005M773855M247069M168958M201323M115283M029036
3640.7D80039597L976464M054904M471063N018354M530132L686547L764212M263699
3657E13804972M201889L683210L338217L390432L584921L673852L709674L635644L406585
3675.4E46429396L145516K990126K919376K983809L221154L430128K960086K285480
3691.7E70365071K277017K363086K317071K312064K221346K108812K142668K165615
3708E88272750K065480J828969J819014J886785J873672J827896J716256J559615J427531
$$ plain form
3591.7 381016105 384632587 388481945 392450601 396464080 400345355 404140443 408048034 412181944
3608.1 412181944 416430444 420683712 424881190 429038286 433476865 438120484 442215353 445860505
3624.4 445860505 449813068 454504073 459277928 463524997 467693955 471895278 476010561 480039597
3640.7 480039597 484016061 488070965 492542028 497560382 502090514 505777061 509541273 513804972
3657 513804972 518006861 521690071 525028288 528418720 532003641 535677493 539387167 543022811 546429396
3675.4 546429396 549574912 552565038 555484414 558468223 561689377 565119505 568079591 570365071
3691.7 570365071 572642088 575005174 577322245 579634309 581855655 583964467 586107135 588272750
3708 588272750 590338230 592167199 593986213 595872998 597746670 599574566 601290822 602850437 604277968
3726.4F04277968J618326J873434J884818J726210J494229J332640J361192J122296
3742.7F16691113P17520J206875J530767J107573J062512J425803J446128J172304
3759F26360595J077116J196801J232863J236617J069904Q78215J000702J265407J392960
3777.3F36711180J096010P96616Q16167Q79764R81868J043498J021624R66191Q44956
3795.7F45157874R70363J060307P29561Q36432Q67486N78940P81655J151324J049637
3814.1F53183579O90461R41336Q50737M16636O94394Q11279P38323P35819P93636J025200
3834.4F60881400Q52764L79622M70221N97894N56409P33555R81629Q73983k206k17080
3854.8F66108191P81953J064897Q79764N33522L65317O01768N30899M13000N22971
$$ plain form
3726.4 604277968 605896294 607769728 609654546 611380756 612874985 614207625 615568817 616691113
3742.7 616691113 617408633 618615508 620146275 621253848 622316360 623742163 625188291 626360595
3759 626360595 627437711 628634512 629867375 631103992 632173896 633052111 634052813 635318220 636711180
3777.3 636711180 637807190 638603806 639419973 640299737 641281605 642325103 643346727 644312918 645157874
3795.7 645157874 646128237 647188544 647918105 648754537 649622023 650200963 650982618 652133942 653183579
3814.1 653183579 653874040 654815376 655666113 656082749 656777143 657588422 658326745 659062564 659856200 660881400
3834.4 660881400 661734164 662113786 662584007 663181901 663738310 664471865 665453494 666327477 666325271 666108191
3854.8 666108191 666890144 667955041 668834805 669368327 669733644 670335412 670866311 671279311 671802282
3873.2F71802282N73337P35522N82039M73321P26163N23627L64482M37737K43902K88784
3893.6F76751196O23405O90878M88579K75493J28627J78456L31819L45170L98875N39601
3914F80752099M57525K32875K21729K99573K52426K55823L80397L67820K51949K63929
3934.4F83736145L00646K95103L02911K76923L05355L36885K86460L18527L50297K28464
3954.8F86737716R6023J72258L12149L21388K74420K21849K38120K92003K85626K78890
3975.2F89230442K55525J39415J33038K82764K94030J98066J80781J93954K02298K39074
3995.6F91349387K73645
3997.6F91623032
$$ plain form
3873.2 671802282 672375619 673111141 673693180 674166501 674892664 675416291 675780773 676218510 676462412 676751196
3893.6 676751196 677374601 678065479 678554058 678829551 678958178 679136634 679468453 679813623 680212498 680752099
3914 680752099 681209624 681442499 681664228 681963801 682216227 682472050 682852447 683220267 683472216 683736145
3934.4 683736145 684036791 684331894 684634805 684911728 685217083 685553968 685840428 686158955 686509252 686737716
3954.8 686737716 686833739 687005997 687318146 687639534 687913954 688135803 688373923 688665926 688951552 689230442
3975.2 689230442 689485967 689625382 689758420 690041184 690335214 690533280 690714061 690908015 691110313 691349387
3995.6 691349387 691623032
3997.6 691623032
##END=$$ End of the data block
