##TITLE=$$ Begin of the data block
##JCAMP-DX=5.00 $$ ACD/SpecManager v 10.08
##SPECTROMETER/DATA SYSTEM=Alpha
##DATE=29 Dec 2014 11:22:02
##DATA TYPE=INFRARED SPECTRUM
##DATA CLASS=XYDATA
##ORIGIN=
##OWNER=
##NPOINTS=1765
##FIRSTX=399.76428223
##LASTX=3997.64306641
##MAXX=3997.64306641
##MINX=399.76428223
##MAXY=0.83008015
##MINY=0.20722395
##XFACTOR=1.0000000000
##YFACTOR=1.000000000000000e-9
##FIRSTY=0.51914555
##DELTAX=2.03961372
##XUNITS=1/CM
##YUNITS=ARBITRARY UNITS
##XYDATA=(X++(Y..Y))
399.8E19145548n279660m347265l333509j031696J500070K600252K129674J332402
416.1E12715816N05746j277983k582312k970934l005922k856552l025711l194541l062009
434.4D91245598k196670k70575K018273M087746N303621N179226L938735K480030J485884
452.8E13271868O75321j30832j142323j985908k504349k951264l306925l406465l390670
471.2D95128453l564805l337353k525867j637220j032323o21944j91570r1701l26634
489.5D81799036n03003q86977j689524k340793k463460k423912k407343k517700l208577
507.9D63357747l975660m138291m056990m151851m459947m590929m013449k710730
524.2D31259900j286298l91900R9987P85797K010614L825158N668968O414026N467236
$$ y = [519145548, 513865888, 509518623, 506185114, 505153418, 506653488, 509253740, 511383414, 512715816, 513221562, 511943579, 509361267, 506390333, 503384411, 500527859, 497502148, 494307607, 491245598, 489048928, 488778353, 490796626, 494884372, 500187993, 505367219, 509305954, 511785984, 513271868, 513947189, 513816357, 512674034, 510688126, 508183777, 505232513, 501925588, 498519123, 495128453, 491563648, 488226295, 485700428, 484063208, 483030885, 482408941, 482217371, 482125670, 481799036, 481296033, 480409056, 478719532, 476378739, 473915279, 471491367, 469084024, 466566324, 463357747, 459382087, 455243796, 451186806, 447034955, 442575008, 437984079, 433970630, 431259900, 429973602, 429581702, 429681689, 430467486, 432478100, 436303258, 441972226, 448386252, 453853488]
542.5D53853488L630668J957863N59271n80400j552284k548009l274203l755510m439443
560.9D43851441n477458o628454p511616p475704o058543l689677j065224J453548
577.2D07398313L867507O166429P830530Q197725P166236N328328L584832K297282
593.5D51837182J288086K47628n92679p79718l64661K88337O51598O71446Q94040J615048
613.9D55756307K555489L402323L839701L840476L872514M080326M123538L675819
630.2D85146493K830237J962423J517117J630157J899481J750857J151353O58929Q15571
648.6D99362618J427263J689255J405120R54449P61688J097202J454830J210928J177788
667E10541141J564562J268864J532495K161622K039135J464903J219273J430928J661361
$$ y = [453853488, 457484156, 459442019, 460001290, 459420890, 457868606, 455320597, 452046394, 448290884, 443851441, 438373983, 431745529, 424233913, 416758209, 410699666, 407009989, 405944765, 407398313, 411265820, 417432249, 425262779, 433460504, 440626740, 445955068, 449539900, 451837182, 453125268, 453372896, 452780217, 452000499, 451635838, 451924175, 452575773, 453247219, 454141259, 455756307, 458311796, 461714119, 465553820, 469394296, 473266810, 477347136, 481470674, 485146493, 487976730, 489939153, 491456270, 493086427, 494985908, 496736765, 497888118, 498547047, 499362618, 500789881, 502479136, 503884256, 504838705, 505600393, 506697595, 508152425, 509363353, 510541141, 512105703, 513374567, 514907062, 517068684, 519107819, 520572722, 521791995, 523222923, 524884284]
685.3E24884284J418888N93424l92437j098096j499355j986981k800226l578663l680587
703.7E11860251k812445j288354K44021J470685K573252L745854N000114O127715O625355
722E33546448O478727O203293N973757N721271N175948M181564L109395K286732J695514
740.4E74372649R96053k17497j920044l483296m410088m750967m913688n225658n349875
758.7E45097589m687964l194392j228631R01878L076673N266309P299304Q996784J0083735
777.1E71611285J0060966Q951009P541954O508231N836666N151391M323840L764749
793.4F23750091L861904M510283N079866M950165M140854L198862K627731K325058
809.7F54444814J883387J185775N88656L10063J30892l14892j240730k530515l795147
$$ y = [524884284, 526303172, 526896596, 526504159, 525406063, 523906708, 521919727, 519119501, 515540838, 511860251, 509047806, 507759452, 508003473, 509474158, 512047410, 515793264, 520793378, 526921093, 533546448, 540025175, 546228468, 552202225, 557923496, 563099444, 567281008, 570390403, 572677135, 574372649, 575368702, 575151205, 573231161, 569747865, 565337777, 560586810, 555673122, 550447464, 545097589, 540409625, 537215233, 535986602, 536888480, 539965153, 545231462, 552530766, 561527550, 571611285, 581672251, 590623260, 598165214, 604673445, 610510111, 615661502, 619985342, 623750091, 627611995, 632122278, 637202144, 642152309, 646293163, 649492025, 652119756, 654444814, 656328201, 657513976, 658102632, 658412695, 658543587, 658228695, 656987965, 654457450, 650662303]
828.1F50662303m629910n089521n516470n958497o138444n883873n244791m569292
844.4F07631505m270494m359067m563212m752338n044282n450308n243599k942443
860.7E71005762J828611P165014J1027456J3100266J3663232J2649715J0276795P191837
877F47908688L867209M10497k851486n296946o599247o980896o935239o747783o493926
895.4F10280871o190300n856692n747617o177902p118642q317113r524942j0537088
911.7E50810575j1258065j1578322j1140823r599388p133305m431635k211451p23929
928D92733657L93987J569241K770633L802001M667938N427837N698443M417956R14514
946.4E22396207l907442q451224j1936307j4393121j6075819j7224312j8016696j8652618
$$ y = [650662303, 646032393, 640942872, 635426402, 629467905, 623329461, 617445588, 612200797, 607631505, 603361011, 599001944, 594438732, 589686394, 584642112, 579191804, 573948205, 571005762, 572834373, 579999387, 591026843, 604127109, 617790341, 630440056, 640716851, 647908688, 651775897, 652186394, 649334908, 644037962, 637438715, 630457819, 623522580, 616774797, 610280871, 604090571, 598233879, 592486262, 586308360, 579189718, 570872605, 561347663, 550810575, 539552510, 527974188, 516833365, 507233977, 500100672, 495669037, 493457586, 492733657, 493127644, 494696885, 497467518, 501269519, 505937457, 511365294, 517063737, 521481693, 522396207, 518488765, 510037541, 498101234, 483708113, 467632294, 450407982, 432391286, 413738668]
962.7D13738668j9282222j9845128k0218104k0380318k0257414j9686073j8584936
977B75484473j6937703j4714063j2066722r322136o716326m430845k597049j238004
993.3B07461625k37673N16847J000598J169085J049861O51181Q0616l85583n58510
1011.6B10748047l89547O9291P47084J513809K245024K915770L475353L790170L838733
1030B28953734L709063L292456K510771J584739Q59663N18545N52908Q84414J507639
1048.4B44373932K504945L889457N468368O928683Q173197R308338J0342896J0575265
1064.7C01565081Q469373K939343m639446j0396570j1350841q291602m166812p55488
1081B73373038J744151L477126M605085N458802O223410O655306O402939N345136L706962
$$ y = [413738668, 394456446, 374611318, 354393214, 334012896, 313755482, 294069409, 275484473, 258546770, 243832707, 231765985, 222443849, 215727523, 211296678, 208699629, 207461625, 207223952, 207740799, 208741397, 209910482, 210960343, 211611524, 211692140, 211306557, 210748047, 210358500, 210427791, 211174875, 212688684, 214933708, 217849478, 221324831, 225115001, 228953734, 232662797, 235955253, 238466024, 240050763, 240910426, 241428971, 241981879, 242866293, 244373932, 246878877, 250768334, 256236702, 263165385, 271338582, 280646920, 290989816, 301565081, 310034454, 312973797, 308334351, 297937781, 286586940, 278295338, 274128526, 273373038, 275117189, 278594315, 283199400, 288658202, 294881612, 301536918, 307939857, 313284993, 316991955]
1099.4C16991955K003163Q91954Q81374J884699L209591M210710M625648M472047L874034
1117.7C43045175L003866K189964J799255K148867L245652M510551N002886M034639
1134C68980855J629472j573980m728079p138401q457542q700400q050949o774753n149096
1152.4C20037127l427625j781434k16395J361490L123760N154908P334590R464442
1168.7C41050863J1389852J2949198J4031232J4622569J4795512J4654308J4234543
1183D37728077J3487905J2269766J0509729Q408248O296128M498899L235162K424389
1199.3D98858303J936406J812339K150774K924680L902853M823088N431235N600751
1215.6E27440429N341589M586280L336846J800478K73883q90374j513421j767815j909256
$$ y = [316991955, 318995118, 319887072, 320768446, 322653145, 325862736, 330073446, 334699094, 339171141, 343045175, 346049041, 348239005, 350038260, 352187127, 355432779, 359943330, 364946216, 368980855, 370610327, 369036347, 364308268, 357169867, 348712325, 340011925, 331960976, 325186223, 320037127, 316609502, 314828068, 314611673, 315973163, 319096923, 324251831, 331586421, 341050863, 352440715, 365389913, 379421145, 394043714, 408839226, 423493534, 437728077, 451215982, 463485748, 473995477, 482403725, 488699853, 493198752, 496433914, 498858303, 500794709, 502607048, 504757822, 507682502, 511585355, 516408443, 521839678, 527440429, 532782018, 537368298, 540705144, 542505622, 542779505, 541889131, 540375710, 538607895, 536698639]
1234E36698639k021432k002954j698554j009464k3305R53018J637102K002596K223015
1252.3E36758661K340436K182007J706004J161278R03189J169204J842738K476394
1268.6E50539911K632975K180756J366794N67853o9082n60820q70108r87709r83775
1287E53816795j015722j218498j561642j953721k290666k478480k502382k426148k371132
1305.4E35998404k342164k118290j700163j409829j318037j320601j522183k072155
1321.7E22194982l045440m377782n634964o264806o062090n225569m069239k802581
1338D84712511j611650o15537J74135O51211O19769J85400k62052n35637p18147q52018
1358.4D81747985q89897r57221r93490p21604k31922K80857Q15600J181216J099765
$$ y = [536698639, 534677207, 532674253, 530975699, 529966235, 529942930, 530895948, 532533050, 534535646, 536758661, 539099097, 541281104, 542987108, 544148386, 545051575, 546220779, 548063517, 550539911, 553172886, 555353642, 556720436, 557288289, 557219207, 556658387, 555788279, 554800570, 553816795, 552801073, 551582575, 550020933, 548067212, 545776546, 543298066, 540795684, 538369536, 535998404, 533656240, 531537950, 529837787, 528427958, 527109921, 525789320, 524267137, 522194982, 519149542, 514771760, 509136796, 502871990, 496809900, 491584331, 487515092, 484712511, 483100861, 482485324, 482659459, 483310670, 483930439, 484115839, 483853787, 483318150, 482600003, 481747985, 480858088, 479900867, 478907377, 478185773, 477953851, 478234708, 479050308, 480231524, 481331289]
1376.7D81331289J050740J280517J772582K821565M298568M655689L607481K668023
1393.1E03486454J632393J85847r84371j531958j628459j821756k103925k233207k289683
1411.4D92711335k117961j591385r93728o91355m69744O5387N80489J045048J538247
1429.8D90076333J657993J689404K266705K434224J809061J699745J612008J188636
1446.1E04434109M17530n76079j234591j390040j554012j851946j024574M87000K367168
1464.5E00074565L848374M762650O955147J0668933J1318028R342074Q349657Q156121
1480.8E63475549P981181P303834P049799P167757O400585M864514M693270N377173
1497.1F14313662M717112L537297L127277M044890N074322L074468J866579K090394
$$ y = [481331289, 482382029, 483662546, 485435128, 488256693, 492555261, 497210950, 500818431, 503486454, 505118847, 505304694, 504320323, 502788365, 501159906, 499338150, 497234225, 495001018, 492711335, 490593374, 489001989, 488008261, 487316906, 486847162, 486912549, 487493038, 488538086, 490076333, 491734326, 493423730, 495690435, 498124659, 499933720, 501633465, 503245473, 504434109, 504851639, 504275560, 503040969, 501650929, 500096917, 498244971, 497220397, 497707397, 500074565, 503922939, 508685589, 515640736, 526309669, 537627697, 546969771, 555319428, 563475549, 571456730, 578760564, 585810363, 592978120, 599378705, 604243219, 608936489, 614313662, 619030774, 622568071, 625695348, 629740238, 634814560, 637889028, 639755607, 641846001]
1513.4F41846001K506733K772033K729774K758860K112568J566827J573324J490116
1529.7F59356236J746238J793384J220405J321018J937926J043498O3241q6427n8353
1548.1F68337166k5749l6657M4465K40743K8015j690090j878798j363874j146793j143396
1568.5F61365032j619041j625776j306832j773715k149343j874745j822174j910984
1584.8F47282422k036930k149999k258420k332747k475798k645612k722501k842069
1601.1F27818346l050446l209532l290117l540754l775418l677189l827095m524827
1617.4E98922968l949285l216564l573478l734827l553629l362774k554655j548827
1633.7E73428929j306117j521885j073182k90274O16252J724899J983166J506567K852320
$$ y = [641846001, 644352734, 647124767, 649854541, 652613401, 654725969, 656292796, 657866120, 659356236, 661102474, 662895858, 664116263, 665437281, 667375207, 668418705, 668481946, 668395519, 668337166, 668311417, 668274760, 668319225, 668559968, 668587983, 666897893, 665019095, 663655221, 662508428, 661365032, 659745991, 658120215, 656813383, 655039668, 652890325, 651015580, 649193406, 647282422, 645245492, 643095493, 640837073, 638504326, 636028528, 633382916, 630660415, 627818346, 624767900, 621558368, 618268251, 614727497, 610952079, 607274890, 603447795, 598922968, 594973683, 591757119, 588183641, 584448814, 580895185, 577532411, 574977756, 573428929, 572122812, 570600927, 569527745, 569237471, 569853723, 571578622, 573561788, 575068355, 577920675]
1652.1E77920675M399479K725184K516925L616333M649937M628003M092097M961312
1668.4F09509945N801558M939855N142748N618870M942835M822075N895913P205486
1684.7F53879285N463600M319370M615545M392922M856825N038977M339695M024446
1701.1F90930665K874314K457083K506196K132475K067686K268254K559960K626300
1717.4G10422933J875937J436770J652002J848996J882732J952291K016305K268434
1733.7G25356400J916945J513839J833200K022088K114296K419948K777398K986789
1750G42940903K723455K341449K462030K589881K472163K346575J914799J707137J804173
1768.4G63302565J871585J734853J216650R40502J069665J145065J075148J071215
$$ y = [577920675, 582320154, 585045338, 587562263, 591178596, 595828533, 600456536, 604548633, 609509945, 615311503, 620251358, 625394106, 631012976, 635955811, 640777886, 646673799, 653879285, 659342885, 663662255, 668277800, 672670722, 677527547, 682566524, 686906219, 690930665, 693804979, 696262062, 698768258, 700900733, 702968419, 705236673, 707796633, 710422933, 712298870, 713735640, 715387642, 717236638, 719119370, 721071661, 723087966, 725356400, 727273345, 728787184, 730620384, 732642472, 734756768, 737176716, 739954114, 742940903, 745664358, 748005807, 750467837, 753057718, 755529881, 757876456, 759791255, 761498392, 763302565, 765174150, 766909003, 768125653, 769066155, 770135820, 771280885, 772356033, 773427248]
1784.7G73427248J054525J090885J213550J079679P91788Q58605J003980R32634P57158
1803G82210052P36833Q77559R49323Q24332O31511O31631O96063O93142P27713Q12591
1823.4G89790750P91609P18355O13689L38018K87772M36842M55916M15921N02527N08428
1843.8G94859827K49028J10388J72734K56896K54273K00093K04682K75195L02911L35634
1864.2G97221661M16219L08573N8293R9719K97368L17871K46346K56479L59356M79043
1884.6H00060928N55873M83274K37167J43588K55286L21746K87235J91569Q5593R5904
1905H02718163J98245K24530J25170M9770J18434J88351J81258K02656J74462N9545
1925.4H04240584K7359R5367J77741K05338J46628P7903R6798J69694J90974J76131
$$ y = [773427248, 774481773, 775572658, 776786208, 777865887, 778657675, 779516280, 780520260, 781452894, 782210052, 782946885, 783824444, 784773767, 785598099, 786229610, 786861241, 787557304, 788250446, 788978159, 789790750, 790582359, 791300714, 791914403, 792252421, 792540193, 792977035, 793432951, 793848872, 794351399, 794859827, 795108855, 795219243, 795391977, 795648873, 795903146, 796103239, 796307921, 796583116, 796886027, 797221661, 797637880, 797946453, 798004746, 798104465, 798401833, 798719704, 798966050, 799222529, 799581885, 800060928, 800616801, 801100075, 801337242, 801480830, 801736116, 802057862, 802345097, 802536666, 802622259, 802718163, 802916408, 803140938, 803266108, 803315878, 803434312, 803622663, 803803921, 804006577, 804181039, 804240584, 804267943, 804363310, 804541051, 804746389, 804893017, 804970920, 805067718, 805237412, 805428386, 805604517]
1945.8H05604517J39475J07825J47402K21074K34485J95205J77383J80424K29239K55406
1966.2H07492435J73211R6321J04189J42634J72019J75059J38283Q1837L7849M8399
1986.6H08662236J17302J63912O0320q7082o8784M2916Q1181r775j54913k60770k59459
2009H08287084j60575j03652k16484m29571n59568n47529n24282n13613l67463k72810
2029.4H04591537l48807l39329k47419k59042l71992m75943m33445k38121r6738j15872
2049.8H01664829k23517k62797j20461R2506J78039J00911k0742o2168M7267J94668
2070.2H01588535K00093O5506n8890m8816Q6904K05278J97172J00136K1040N1976J62601
2092.7H02571535K60055K53916J42753P3135J64151L03686K93791J60992O3181P4446
$$ y = [805604517, 805743992, 805851817, 805999219, 806220293, 806454778, 806649983, 806827366, 807007790, 807237029, 807492435, 807665646, 807761967, 807866156, 808008790, 808180809, 808355868, 808494151, 808575988, 808613837, 808662236, 808779538, 808943450, 809003770, 808916688, 808847904, 808890820, 808972001, 808962226, 808807313, 808546543, 808287084, 808126509, 808022857, 807806373, 807376802, 806817234, 806269705, 805745423, 805231810, 804864347, 804591537, 804242730, 803903401, 803655982, 803396940, 803024948, 802549005, 802115560, 801877439, 801780701, 801664829, 801441312, 801178515, 801058054, 801150560, 801328599, 801429510, 801408768, 801346600, 801393867, 801588535, 801788628, 801854134, 801795244, 801746428, 801833332, 802038610, 802235782, 802335918, 802356958, 802408934, 802571535, 802831590, 803085506, 803228259, 803301394, 803465545, 803769231, 804063022, 804224014, 804287195, 804361641]
2113.1H04361641J30535J69217J48714M8101k4021J7226J00016J02818K3663j5020
2133.5H05062890M5896J15394J30713Q2672j4484n7340L0041J77503K33650J46925
2153.9H05953860L1829O7592K67386M43101M57525L30210K20895L27110N64814O88374
2174.3H09352696O34670M56095L33607M19021N90622O56188N40077L24488K41578L97801
2194.6H13946843N98252O17802M54843K86520K67625M20033N94855N84483L97027K55227
2215H18423510L13222M76658N52297M52340K71082J72972K37048L97146M73082L56197
2235.4H22125554J55389Q0765K00450L55721L63826K42353J18911R8109K07007L31462
2255.8H24279547L12209J65045Q6665J66476K97248L35515K46167J32442J31189K33353
$$ y = [804361641, 804492176, 804661393, 804810107, 804858208, 804834187, 804851413, 804951429, 805054247, 805077910, 805062890, 805108786, 805224180, 805354893, 805437565, 805423081, 805365741, 805395782, 805573285, 805806935, 805953860, 805985689, 806053281, 806320667, 806763768, 807221293, 807551503, 807772398, 808099508, 808664322, 809352696, 809987366, 810443461, 810777068, 811196089, 811786711, 812442899, 812982976, 813307464, 813549042, 813946843, 814545095, 815162897, 815617740, 815904260, 816171885, 816591918, 817186773, 817771256, 818168283, 818423510, 818736732, 819213390, 819765687, 820218027, 820489109, 820662081, 820899129, 821296275, 821769357, 822125554, 822280943, 822361708, 822562158, 822917879, 823281705, 823524058, 823642969, 823741078, 823948085, 824279547, 824591756, 824756801, 824843466, 825009942, 825307190, 825642705, 825888872, 826021314, 826152503, 826385856]
2276.2H26385856L15964L14951K11477J18137J62422K38657K25067J66476J18673Q9526
2296.6H28347206R5129J36614J63019J14023M4585Q7082K34365K73347J32561L3319
2317H29661250L8087O1870J29402J47462M2081n4002j28806j11937l0280p5280j59681
2339.5H29520166k19286k81333l30687k43962n0366N2572J5676J8835J23143N7459
2359.9H28662217j61648m00245n96464n35488l27528k91288m18126m87864l84629k11716
2380.2H24847221j41084j76132k45809k97546k60592j67489j40250k03669k88546l34620
2400.6H22591484l13819k67625k94149l83138m43518m40717l90649l81708m64320n57900
2421H18653941n91040n42163m80712n13434o03736o44803o18577n70595n84602o75500
$$ y = [826385856, 826701820, 827016771, 827228248, 827346385, 827508807, 827747464, 827972531, 828139007, 828257680, 828347206, 828442335, 828578949, 828741968, 828855991, 828900576, 828987658, 829222023, 829495370, 829627931, 829661250, 829699337, 829761207, 829890609, 830038071, 830080152, 830026150, 829897344, 829785407, 829755127, 829679847, 829520166, 829300880, 829019547, 828688860, 828444898, 828394532, 828447104, 828462780, 828481615, 828604758, 828662217, 828500569, 828100324, 827503860, 826968372, 826640844, 826349556, 825931430, 825443566, 825058937, 824847221, 824706137, 824530005, 824284196, 823986650, 823726058, 823558569, 823418319, 823214650, 822926104, 822591484, 822277665, 822010040, 821715891, 821332753, 820889235, 820448518, 820057869, 819676161, 819211841, 818653941, 818062901, 817520738, 817040026, 816526592, 815922856, 815278053, 814659476, 814088881, 813504279, 812828779]
2441.4H12828779p17580o52850n58853n36680o13153o95646o96123o33180n54084n10991
2461.8H06659639n69582o65963o54518n55098m81308m82440n67436o49095o09934m90368
2482.2H00933897m19557m25994m69208n06282m55200l40283k89917l40224l94701l88682
2502.6G96903849l54529l04997k72751k91287l45827m16398m39048m01794l99411m69744
2523G93208063n26250n20587n37395o00517o36101o57201o82234o93798p21753p53701
2543.4G86878526p29680o56664o14226o56962p45118p61330o85394o16014n78284n97656
2563.8G80237198p08938p94828p30574n80609n29229o39618p73012p78795o38961m80116
2584.2G73582518m56512n58138o44266o23644m86314l18468l03507m85897o41584n90622
$$ y = [812828779, 812111199, 811458349, 810899496, 810362816, 809749663, 809054017, 808357894, 807724714, 807170630, 806659639, 806090057, 805424094, 804769576, 804214478, 803733170, 803250730, 802683294, 802034199, 801424265, 800933897, 800514340, 800088346, 799619138, 799112856, 798657656, 798317373, 798027456, 797687232, 797292531, 796903849, 796549320, 796244323, 795971572, 795680285, 795334458, 794918060, 794479012, 794077218, 793677807, 793208063, 792681813, 792161226, 791623831, 791023314, 790387213, 789730012, 789047778, 788353980, 787632227, 786878526, 786148846, 785492182, 784877956, 784220994, 783475876, 782714546, 782029152, 781413138, 780834854, 780237198, 779528260, 778733432, 778002858, 777422249, 776893020, 776253402, 775480390, 774701595, 774062634, 773582518, 773126006, 772567868, 771923602, 771299958, 770813644, 770495176, 770191669, 769705772, 769064188, 768473566]
2604.6G68473566m50850m49061o02365p98464r66251r91284q56996p66099q97586j175821
2625G60518789j342117j268983j103461j070798j201570j350104j392067j307249j175702
2643.4G49306738j155197j287818j405060j359165j194239j085102j137317j267433
2659.7G39415407j312256j221299j101553j050294j075148j135707j151681j057744
2676G30309725r29117r00388r75132j046658j031518r59813r20236r72391j099288
2694.3G21475184j199245j175523j066268j062810j216173j342714j318336j204371
2710.7G11889744j112223j117885j197040j225948j144231j013100r26852r40859j002312
2729G02209294j004458r25243q05556p41363p93934q69155q64327p99298p57217p64430
$$ y = [768473566, 768022716, 767573655, 766971290, 766172826, 765206575, 764215291, 763358295, 762592196, 761694610, 760518789, 759176672, 757907689, 756804228, 755733430, 754531860, 753181756, 751789689, 750482440, 749306738, 748151541, 746863723, 745458663, 744099498, 742905259, 741820157, 740682840, 739415407, 738103151, 736881852, 735780299, 734730005, 733654857, 732519150, 731367469, 730309725, 729380608, 728480220, 727505088, 726458430, 725426912, 724467099, 723546863, 722574472, 721475184, 720275939, 719100416, 718034148, 716971338, 715755165, 714412451, 713094115, 711889744, 710777521, 709659636, 708462596, 707236648, 706092417, 705079317, 704152465, 703211606, 702209294, 701204836, 700279593, 699474037, 698732674, 697938740, 697069585, 696205258, 695405960, 694648743, 693884313]
2749.4F93884313p97510q28981p80881o56724o02722o38068o58870o52968o45340o57618
2769.8F86964631p10964p97689q96096r61006r70244r83894j069904j205980j287759
2788.2F78081095j284659j304567j418888j573622j701713j765907j767456j786053
2804.5F65478230j897812k068699k171337k159715k144337k221405k390862k573192
2820.8F47850871k629816k574385k591788k733589k924978l064752l113329l160239
2837.1F25057995l300845l557980l884554m205764m369139m299462m053056l694713
2853.4E93692482l352225l078878k944768l110051l583252m249573m891574n299151
2869.7E63183010n515874n713105n891085n831957n379259m628658l774763k977728
$$ y = [693884313, 693086803, 692257822, 691476941, 690820217, 690217495, 689579427, 688920557, 688267589, 687622249, 686964631, 686253667, 685455978, 684559882, 683598876, 682628632, 681644738, 680574834, 679368854, 678081095, 676796436, 675491869, 674072981, 672499359, 670797646, 669031739, 667264283, 665478230, 663580418, 661511719, 659340382, 657180667, 655036330, 652814925, 650424063, 647850871, 645221055, 642646670, 640054882, 637321293, 634396315, 631331563, 628218234, 625057995, 621757150, 618199170, 614314616, 610108852, 605739713, 601440251, 597387195, 593692482, 590340257, 587261379, 584316611, 581206560, 577623308, 573373735, 568482161, 563183010, 557667136, 551954031, 546062946, 540230989, 534851730, 530223072, 526448309, 523470581]
2886.1E23470581k300501j687825j131654p52866o29187p02381q64684j042486j238167
2904.4E13120830j524568j936554k437473k982735l544867m033983m267812m210025
2920.7D88182813l917396l372491k542495j476348l33279Q70228K159923L384948M445791
2939.1D87401694N334497N942761O202370O250680O288886O393850O445408O366431
2955.4E36626577O212414O026983N810261N526125N185902M811228M419982M132569
2971.7E78752041M006505L979325M003048L894627L500283L033638K749324K602041
2988F06520832K432882K097249J587451J153409Q71957O30140L95119P1168l42667
3006.4F15417540o49214q10444j034737j333296j612425j913488k145469k198875k210855
$$ y = [523470581, 521170080, 519482255, 518350601, 517597735, 516968548, 516266167, 515401483, 514358997, 513120830, 511596262, 509659708, 507222235, 504239500, 500694633, 496660650, 492392838, 488182813, 484265417, 480892926, 478350431, 476874083, 476540804, 477411032, 479570955, 482955903, 487401694, 492736191, 498678952, 504881322, 511132002, 517420888, 523814738, 530260146, 536626577, 542838991, 548865974, 554676235, 560202360, 565388262, 570199490, 574619472, 578752041, 582758546, 586737871, 590740919, 594635546, 598135829, 601169467, 603918791, 606520832, 608953714, 611050963, 612638414, 613791823, 614663780, 615293920, 615689039, 615760207, 615417540, 614768326, 613957882, 612923145, 611589849, 609977424, 608063936, 605918467, 603719592, 601508737]
3024.7F01508737k315402k416909k475679k550840k686620k820134k786339k713740
3041.1E80743074k843558l083170l173649l087104l031075l049492l053844l125012
3057.4E56296170l227413l170907l006578k903461k996207l223359l311634l169954
3073.7E31286657k913892k796650k977789l185510l223181l204346l101528l004849
3090E06878912l128230l249109l126979k911031k861202k999782l036976k898902k861351
3108.4D79805350k975642k883196k601207k577126k801030l054232l199160l070652
3124.7D56643105k778382k622902k712607k848268k775878k535492k443045k628118
3141D35298413k794206k745450k606362k400934k220095k335697k601206k619177k486140
$$ y = [601508737, 599193335, 596776426, 594300747, 591749907, 589063287, 586243153, 583456814, 580743074, 577899516, 574816346, 571642697, 568555593, 565524518, 562475026, 559421182, 556296170, 553068757, 549897850, 546891272, 543987811, 540991604, 537768245, 534456611, 531286657, 528372765, 525576115, 522598326, 519412816, 516189635, 512985289, 509883761, 506878912, 503750682, 500501573, 497374594, 494463563, 491602361, 488602579, 485565603, 482666701, 479805350, 476829708, 473946512, 471345305, 468768179, 465967149, 462912917, 459713757, 456643105, 453864723, 451241821, 448529214, 445680946, 442905068, 440369576, 437926531, 435298413, 432504207, 429758757, 427152395, 424751461, 422531366, 420195669, 417594463, 414975286, 412489146]
3159.4D12489146k415717k347350k263397k225250k238899k232135k184540k132713
3175.7C94449145k078683k040594k027572k020299k018899j994639j928389j881510
3192C78458560j892865j907617j880139j832485j764745j685500j647413j661002j640857
3210.3C62545937j582950j579464j546710j453162j463025j544923j504958j399248
3226.7C50471497j329691j214265j174778j359076j493096j396179j252949j138866
3243C40112597j047939j105577j248956j207530j013369r46372j050204j105965j054227
3261.3C30332458r76503q50022o96748o27727p67469r97364j074821j008690q77767
3279.7C22455347p84576q04454q21531p45744o18458n80459p06524q75235r91761r50247
$$ y = [412489146, 410073429, 407726079, 405462682, 403237432, 400998533, 398766398, 396581858, 394449145, 392370462, 390329868, 388302296, 386281997, 384263098, 382268459, 380340070, 378458560, 376565695, 374658078, 372777939, 370945454, 369180709, 367495209, 365847796, 364186794, 362545937, 360962987, 359383523, 357836813, 356383651, 354920626, 353375703, 351870745, 350471497, 349141806, 347927541, 346752763, 345393687, 343900591, 342504412, 341251463, 340112597, 339064658, 337959081, 336710125, 335502595, 334489226, 333542854, 332492650, 331386685, 330332458, 329355955, 328505933, 327809185, 327181458, 326413989, 325416625, 324341804, 323333114, 322455347, 321670771, 320866317, 320044786, 319299042, 318680584, 318100125, 317393601, 316518366, 315526605, 314576358]
3300.1C14576358p00683n09649o39797r59962j182288j188547j053959r50575r15735
3318.4C06475163q92669q27343q06540j002640j193225j124918r68159q55237p85172
3336.8B98019260q62330j030535j103520j111001j008093q13067q90583j177460j212746
3355.2B88809925r98139q45999r02235r57340p54178o14166q84592j262159j283168
3373.5B80307949j015127q29727p82638q23379q17984o53714l84778j23471k41041
3391.9B74636090o74963p23839k57134n454m42654q96692o62744k51860j80900k51234
3412.3B70288616l59952m36693k91259j07616p8529k2203J44124K94179K65867K61902
3432.7B69958436L86715K20955j21474r1285K28316M87029N42522M05222L57777M69863
$$ y = [314576358, 313875675, 313366026, 312726229, 311766267, 310583979, 309395432, 308341473, 307390898, 306475163, 305582494, 304755151, 303948611, 302945971, 301752746, 300627828, 299659669, 298804432, 298019260, 297156930, 296126395, 295022875, 293911874, 292903781, 292090714, 291200131, 290022671, 288809925, 287811786, 286965787, 286063552, 285106212, 284352034, 283737868, 282853276, 281591117, 280307949, 279292822, 278463095, 277680457, 276857078, 276039094, 275385380, 275000602, 274877131, 274636090, 273961127, 273237288, 272980154, 272974700, 272532046, 271635354, 270972610, 270720750, 270539850, 270288616, 269928664, 269491971, 269200712, 269093096, 269014567, 268992364, 269136488, 269430667, 269696534, 269958436, 270345151, 270566106, 270444632, 270353347, 270581663, 271068692, 271611214, 272016436, 272374213, 272844076]
3453.1B72844076O07401P79808Q82327P59989P45476J087039J246721Q17507L12210
3471.4B80082554L59833P37846J091778J189590Q69452O93799R32872R91195Q76248
3489.8B87825167R87560J143425J160145J073212J113414J223386R83983P63834R93967
3508.1B97268093J254886J350164J266718J051247J044363J299441J558840J395435
3524.4C07489187J044303J062989J263648J437426J630783J578569J321107J452566
3540.8C18280578J868784J928687J462102J276195J676649J924157J857609J928508
3557.1C32203269K116024K143860K134204K460063K958834K832740K453328K496242
3573.4C51798564K812058L082126L258318L340900L405988L604025L612071L356248
$$ y = [272844076, 273451477, 274231285, 275113612, 275873601, 276619077, 277706116, 278952837, 279770344, 280082554, 280442387, 281180233, 282272011, 283461601, 284331053, 285024852, 285957724, 286948919, 287825167, 288812727, 289956152, 291116297, 292189509, 293302923, 294526309, 295510292, 296274126, 297268093, 298522979, 299873143, 301139861, 302191108, 303235471, 304534912, 306093752, 307489187, 308533490, 309596479, 310860127, 312297553, 313928336, 315506905, 316828012, 318280578, 320149362, 322078049, 323540151, 324816346, 326492995, 328417152, 330274761, 332203269, 334319293, 336463153, 338597357, 341057420, 344016254, 346848994, 349302322, 351798564, 354610622, 357692748, 360951066, 364291966, 367697954, 371301979, 374914050, 378270298]
3589.7C78270298L368736L680020L894866L986865L999203L895104L858865L984183
3606D08938140M219204M281491M237413M246056M285455M510433M568100M037112L717362
3624.4D47040766M070074M823953M888683M238725M089057M135937M111648M076451
3640.7D81475294M025608M133284M575074N049854M486740L656924L777623M274666
3657E15455067M191458L735304L418565L411949L607273L730714L684998L564238L444433
3675.4E48243999L179551K925753K876640K988338L214181L396928L002703K358675
3691.7E72186768K263784K335370K266407K240598K248466K217830K250552K256334
3708E90266109K086400J728833J702488J847088J873016J855255J784265J628995J469492
$$ y = [378270298, 381639034, 385319054, 389213920, 393200785, 397199988, 401095092, 404953957, 408938140, 413157344, 417438835, 421676248, 425922304, 430207759, 434718192, 439286292, 443323404, 447040766, 451110840, 455934793, 460823476, 465062201, 469151258, 473287195, 477398843, 481475294, 485500902, 489634186, 494209260, 499259114, 503745854, 507402778, 511180401, 515455067, 519646525, 523381829, 526800394, 530212343, 533819616, 537550330, 541235328, 544799566, 548243999, 551423550, 554349303, 557225943, 560214281, 563428462, 566825390, 569828093, 572186768, 574450552, 576785922, 579052329, 581292927, 583541393, 585759223, 588009775, 590266109, 592352509, 594081342, 595783830, 597630918, 599503934, 601359189, 603143454, 604772449, 606241941]
3726.4F06241941J580596J808823J957058J774014J319766J229345J406014J195133
3742.7F18512690Q14557J296878J540542J055658J025676J410783J425504J134157
3759F28216445J040638J193941J265108J287520J099765Q72434R77635J209199J332939
3777.3F38495624J085699Q15570Q09610Q30233R70721J115859J097500J011133R03964
3795.7F47135913J016736J037836O89984Q32975Q91626O06537P49289J068771J028836
3814.1F55058503P54357R66429Q51333M30286O94216Q19444P40469P19249P69138J028300
3834.4F62831724R26375L62158L08454N49078O30259P39932R07898R12786J79172k07723
3854.8F68140113O81520J007855Q51631N53131M06325O08027N27143M19319N04196
$$ y = [606241941, 607822537, 609631360, 611588418, 613362432, 614682198, 615911543, 617317557, 618512690, 619327247, 620624125, 622164667, 623220325, 624246001, 625656784, 627082288, 628216445, 629257083, 630451024, 631716132, 633003652, 634103417, 634975851, 635953486, 637162685, 638495624, 639581323, 640396893, 641206503, 642036736, 643007457, 644123316, 645220816, 646231949, 647135913, 648152649, 649190485, 649880469, 650713444, 651605070, 652211607, 652960896, 654029667, 655058503, 655812860, 656779289, 657630622, 658060908, 658755124, 659574568, 660315037, 661034286, 661803424, 662831724, 663758099, 664120257, 664428711, 664977789, 665608048, 666347980, 667255878, 668168664, 668347836, 668140113, 668821633, 669829488, 670681119, 671234250, 671640575, 672248602, 672775745, 673195064, 673699260]
3873.2F73699260N76019Q14319O72042M64499O26147M26650L42011M86553K70128K67566
3893.6F78645194O16669O83785M87208L18110J49071J85609L81529L94404L92676M73916
3914F82728171M05252K46823K45392K94269K75611L23535L90350L12627K34723K53379
3934.4F85710132K52962K86043L31759K67923K59280L06726K55406K92063L89874K98440
3954.8F88650608J48058J93596L25441L51310K75373J76669J52528K27570L16501L35634
3975.2F91153288K60174J58668K03550L12090K81751J76012J26779J59979J83523J84715
3995.6F93200529K43604
3997.6F93444133
$$ y = [673699260, 674275279, 675089598, 675761640, 676226139, 676852286, 677278936, 677620947, 678107500, 678377628, 678645194, 679261863, 679945648, 680432856, 680750966, 680900037, 681085646, 681467175, 681861579, 682254255, 682728171, 683133423, 683380246, 683625638, 683919907, 684195518, 684519053, 684909403, 685222030, 685456753, 685710132, 685963094, 686249137, 686580896, 686848819, 687108099, 687414825, 687670231, 687962294, 688352168, 688650608, 688798666, 688992262, 689317703, 689669013, 689944386, 690121055, 690273583, 690501153, 690817654, 691153288, 691413462, 691572130, 691775680, 692087770, 692369521, 692545533, 692672312, 692832291, 693015814, 693200529, 693444133]
##END=$$ End of the data block
