##TITLE=$$ Begin of the data block
##JCAMP-DX=5.00 $$ ACD/SpecManager v 10.08
##SPECTROMETER/DATA SYSTEM=Alpha
##DATE=29 Dec 2014 11:22:02
##DATA TYPE=INFRARED SPECTRUM
##DATA CLASS=XYDATA
##ORIGIN=
##OWNER=
##NPOINTS=1765
##FIRSTX=399.76428223
##LASTX=3997.64306641
##MAXX=3997.64306641
##MINX=399.76428223
##MAXY=0.80766225
##MINY=0.15013058
##XFACTOR=1.0000000000
##YFACTOR=1.000000000000000e-9
##FIRSTY=0.46049625
##DELTAX=2.03961372
##XUNITS=1/CM
##YUNITS=ARBITRARY UNITS
##XYDATA=(X++(Y..Y))
399.8 460496247 454174787 449890316 447449148 446874917 447839409 449593008 451576442 453360140 454426080
418.1 454426080 453701705 451223791 447778910 443903297 440233141 436836183 433538646 430437088 428176135
436.5 428176135 427988321 430637240 435427278 440649807 445194304 448937118 452101141 454575747 455887288
454.8 455887288 455688030 453876168 451398283 448893368 446169347 442956507 439318091 435409307 431449324
473.2 431449324 428188890 425810903 423932821 422453076 421607077 421541065 421873063 421954066 421286494
491.5 421286494 419702232 417589605 415558100 413683981 411425054 408531666 405298531 401783824
507.9 401783824 397948503 393874943 389581859 384848386 379698902 374948829 371300936 368787766
524.2 368787766 367156029 366306454 366345227 367468417 370008677 374211282 379813790 385922611 391459346
542.5 391459346 395673811 398137689 398711413 397631526 395389676 392519057 389197707 385168284 380203545
560.9 380203545 374138981 366969973 359111905 351403296 345004082 340995133 339890867 341561615
577.2 341561615 345719904 352228642 360394597 368690193 375875026 381447732 385294497 387544125
593.5 387544125 388598382 388826489 388491333 387954772 387552470 387498230 387890905 388703525 389911413 391688168
613.9 391688168 394213259 397522271 401493937 405866861 410368174 414746553 418828696 422446638
630.2 422446638 425493896 427922428 429793715 431369454 432892352 434335619 435588628 436703831
646.6 436703831 437836438 439075708 440359354 441629082 442873836 444027215 445082277 446256280
662.9 446256280 447618812 449293405 451177508 452514946 453777969 455489963 457611948 459792614
679.2 459792614 461704522 463266522 464524120 465554953 466271847 466392398 465668410 463997632 461365640
697.5 461365640 458011538 454342693 450815946 447951317 446215063 446027547 447625428 450818956 455181986
715.9 455181986 460440814 466533333 473325580 480577141 487934917 494815618 500830531 506058335
732.2 506058335 510610044 514410019 517315328 519127846 519640923 518817067 516678393 513255179 508657634
750.6 508657634 503152609 497173369 491204739 485694826 481116056 477928519 476507992 477291852 480726838
768.9 480726838 486905009 495352983 505355656 516206920 527072966 537116408 545810401 553072572
785.3 553072572 559140563 564399481 569204688 573864639 578687251 583896816 589436829 594965160
801.6 594965160 600025654 604259610 607656538 610461056 612834990 614684224 615979016 616823137 617163897
819.9 617163897 616748810 615362763 612901270 609284341 604510248 598677874 592075586 585138321 578326583
838.3 578326583 572014570 566352427 561262906 556611657 552220762 547805965 543072581 537751198
854.6 537751198 531821847 526228607 523325682 525636852 533613265 545580745 559783280 574889600
870.9 574889600 589166999 600780666 608622134 612389028 612247884 608714998 602661133 595144987
887.2 595144987 587126851 579271436 571902275 565113962 558904111 553106308 547277689 540858030
903.5 540858030 533436000 524755836 514729977 503551364 491559744 479170084 467175543 456770897
919.9 456770897 448951304 443943262 441240460 440146446 440306157 441782653 444703281 448972166 454311907
938.2 454311907 460352540 466334075 470622718 471187085 466853350 457742602 444818556 429284096
954.5 429284096 412095696 393853784 374937534 355525553 335655093 315388590 294885725
968.8 294885725 274385273 254164666 234582067 216160610 199511513 185194969 173556402
983.1 173556402 164623648 158209696 153979063 151495442 150328889 150130585 150641188 151594192 152637616
1001.4 152637616 153506786 154047146 154115230 153714180 153059334 152495101 152361721 152876139 154072002 155905977
1021.8 155905977 158308849 161199629 164450228 167826310 171118587 174073234 176352873 177807629
1038.2 177807629 178641394 179216802 179836258 180714190 182095021 184340850 187812313 192674622 198855609
1056.5 198855609 206249639 214890897 224829540 235383168 244215429 247690856 243522421 233482212
1072.8 233482212 222342297 214032054 209649906 208545446 209824815 212779358 216849491 221747920
1089.2 221747920 227379352 233473480 239433080 244479701 248005241 249933317 250866652 251836151 253759623
1107.5 253759623 256956041 261126071 265686512 270069242 273868442 276885003 279181570 281141907
1123.8 281141907 283462644 286821157 291381180 296461731 300687492 302564383 301104248 296262741
1140.1 296262741 288877606 280205667 271387339 263256222 256394595 251115412 247524768 245611757
1156.5 245611757 245279834 246494666 249403641 254242539 261199713 270322889 281477362 294308424
1172.8 294308424 308317095 323002487 338016719 353137046 368064940 382359833 395440608
1187.1 395440608 406716615 415831983 422789127 427860320 431441903 433998853 436063141 438152224
1203.4 438152224 440700114 444043994 448345542 453561693 459459513 465618342 471472740 476418138
1219.7 476418138 479973733 481876969 482174605 481261432 479636461 477696717 475648433 473539680 471525848
1238.1 471525848 469898731 468943357 468889296 469782144 471454412 473695904 476260483 478806823 481008500
1256.4 481008500 482675016 483864456 484932750 486375183 488486439 491149843 493874937 496050388
1272.7 496050388 497312516 497657657 497277141 496431082 495384276 494254798 493006051 491638958 490175247
1291.1 490175247 488509864 486521512 484230489 481775641 479342908 477061003 474876106 472665906
1307.4 472665906 470584184 468895525 467544556 466319114 465044081 463476270 461305946 458126128
1323.7 458126128 453574181 447760016 441300094 434953868 429392874 425095588 422224969 420674890
1340 420674890 420216590 420505702 421144158 421715647 421898633 421616167 420932263 419942588 418767691 417498410
1360.4 417498410 416121930 414817393 413833261 413200706 413053751 413497239 414326280 415187836 416067600
1378.8 416067600 417206883 419014573 422040254 426576793 431547403 435523123 438357562 439891070
1395.1 439891070 439955294 438924134 437435836 435831606 433898330 431682974 429392695 427072823 424993813
1413.5 424993813 423462600 422330558 421357691 420863360 421046227 421761632 422955424 424553365 426327854
1431.8 426327854 428226948 430514246 432974249 435131073 437220246 439072132 440315574 440659970
1448.1 440659970 440128148 439178467 438131809 436494380 434253663 433378577 434255809 436948061 441222697
1466.5 441222697 446556658 453966975 465010256 477088600 487618238 497162640 506253123 514929533
1482.8 514929533 522818089 530480981 538371444 545546055 551004529 555995047 561479092 566415429
1499.1 566415429 570418656 574064672 578293085 582992613 585792363 587739527 590071142 592747092
1515.4 592747092 595441818 597821057 600087762 601909697 603332102 604650557 605715215 606759787
1531.8 606759787 607655585 608311832 609297276 610499144 610400736 609444916 608581483 608030736 607688487 607375383
1552.2 607375383 607112825 606990576 606526911 604765892 603352666 602509439 601827025 601160586 600296974
1570.5 600296974 599661887 599476993 599045217 598076224 597145677 596320510 595554948 594720900 593641222
1588.9 593641222 592184544 590411901 588411510 586248398 583924294 581256151 578115821 574629545
1605.2 574629545 570929945 566876948 562631071 558557570 554047525 548425496 543627977 539709151
1621.5 539709151 535253525 530655026 526188076 521823645 518393874 515810549 512983143 510290563
1637.8 510290563 508551657 507601202 507458150 508172810 509358704 510629475 512836456 516098499 518627167
1656.2 518627167 521391571 525252521 530121863 535113573 539674938 545115113 551626980 557424307
1672.5 557424307 563376069 569783807 575457871 580944061 587545335 595766366 602192581 607122600
1688.8 607122600 612230659 617082536 622518599 628299296 633279979 637921989 641309619 644293368
1705.1 644293368 647579968 650587976 653498411 656484306 659475267 661982358 663055420 663541198
1721.5 663541198 664674163 666746020 669419885 672470391 675692260 679327548 682387829 684452891
1737.8 684452891 686773300 689473748 692330718 695467353 698850453 702406526 705801725 708872259
1754.1 708872259 712164164 715529501 718428969 720995128 723087847 725085258 727397680 729757488
1770.4 729757488 731772721 733057737 733996391 735252261 736867011 738393128 739603162 740598679 741676152
1788.8 741676152 743153930 744830132 746054292 746951938 747823358 748723745 749703526 750800610 751945972
1807.1 751945972 752968669 753770828 754449487 755304456 756375790 757399917 758215785 758937716 759701967
1825.5 759701967 760588288 761605918 762330234 762661695 762952983 763368785 763963223 764768779 765582621
1843.8 765582621 765919149 765871465 765943468 766302168 766811311 767247736 767471015 767593265 767830431 768317640
1864.2 768317640 768993497 769541144 769643247 769570172 769774318 770294845 770904541 771364212 771637797 771913707
1884.6 771913707 772387803 773070455 773700774 774061561 774232090 774361134 774592102 774999022 775407553 775609374
1905 775609374 775655746 775727272 775904834 776176155 776501358 776774168 776872039 776908755 777080059 777335584 777569652
1927.5 777569652 777696192 777711153 777768910 777965903 778272271 778582513 778812230 778910398 778960526 779116452
1947.9 779116452 779409826 779740691 780003726 780192137 780375004 780639827 780976355 781299233 781515539 781608939
1968.3 781608939 781704903 781939983 782264709 782501340 782584667 782595038 782661736 782836854 783091486 783308446
1988.7 783308446 783358097 783252716 783165872 783239782 783389091 783426702 783301234 783108413 782942355 782824993
2009 782824993 782677829 782407284 782011569 781539917 781024992 780483902 779869020 779200137 778705537 778391480
2029.4 778391480 778075874 777737260 777362406 776902914 776390254 775908589 775508225 775204182 774948895 774661243
2049.8 774661243 774371445 774206579 774189055 774245262 774298787 774309218 774345636 774440229 774555564 774688005 774799287
2072.3 774799287 774822474 774784446 774771094 774846435 774986625 775105476 775180995 775242627 775361300 775578380 775838912
2094.7 775838912 776057124 776206255 776330113 776486576 776706338 776965201 777205229 777362525 777445197 777519166
2115.1 777519166 777620971 777745724 777843058 777850449 777810037 777826548 777911603 778018832 778097093 778118730 778102636
2137.5 778102636 778115094 778204322 778315902 778374612 778397501 778444529 778535604 778679430 778865874 779083967 779344738
2160 779344738 779666603 780066252 780501604 780943871 781453371 782037616 782633543 783238828 783866823 784507275
2180.4 784507275 785123527 785697043 786263108 786812723 787341237 787881494 788425207 788950324 789466202 789985597
2200.8 789985597 790495336 790994883 791507423 792017937 792518675 793049932 793605268 794126391 794584632 795018077
2221.2 795018077 795466483 795921683 796352983 796748817 797115803 797456563 797789514 798125327 798453271 798750937
2241.6 798750937 799015284 799282074 799583375 799900174 800195098 800464392 800719738 800980508 801254511 801522613
2262 801522613 801766813 802018642 802338898 802709758 803057730 803359926 803615212 803830862 804063618 804347456
2282.3 804347456 804650545 804907739 805082738 805213988 805388689 805592060 805751979 805904329 806052268 806155741
2302.7 806155741 806251645 806396008 806588352 806787133 806938648 807016134 807076931 807210028 807414949 807571709
2323.1 807571709 807601929 807555616 807570815 807662249 807645380 807531714 807442844 807311594 807135880 807021737 806811631
2345.6 806811631 806299388 805751085 805597425 805876851 806242824 806508541 806531966 806308866 806014121 805753350
2366 805753350 805484772 805124879 804706216 804328322 803997040 803677678 803383231 803095877 802814603 802568197
2386.4 802568197 802356064 802159607 801952958 801706135 801417232 801111996 800835431 800600052 800327122 799972296
2406.8 799972296 799571157 799140394 798684239 798211873 797728419 797230959 796676040 796055675 795437455 794844091
2427.2 794844091 794249654 793611526 792907059 792176604 791471004 790796578 790132642 789453208 788745046 788037419
2447.6 788037419 787345886 786639690 785910904 785202801 784536660 783897281 783269823 782624722 781963229 781331182
2467.9 781331182 780740917 780156076 779555380 778949738 778341234 777710855 777096152 776553512 776063561 775595665
2488.3 775595665 775130689 774653077 774197161 773822725 773508251 773188591 772849798 772472382 772051275 771663547
2508.7 771663547 771364450 771091759 770740867 770281732 769768178 769254148 768772900 768298924 767729104 767039478
2529.1 767039478 766326964 765653431 764975786 764256299 763491631 762677372 761864841 761093318 760342538 759580374
2549.5 759580374 758776307 757960796 757185996 756451309 755725503 754946828 754109979 753327966 752666712 752043843
2569.9 752043843 751352489 750588596 749817312 749098063 748456299 747859299 747256041 746618867 745961189 745361924
2590.3 745361924 744880378 744462192 743998349 743442774 742868900 742359817 741884112 741350591 740678072 739871979
2610.7 739871979 739030361 738196075 737309575 736293793 735134363 733883858 732613385 731356323 730082870
2629.1 730082870 728768647 727387309 725915015 724427581 722996056 721583843 720147312 718691528
2645.4 718691528 717221379 715725005 714248419 712847233 711476266 710090280 708701789 707329094
2661.7 707329094 706001639 704705358 703403950 702111006 700842023 699596465 698385119 697242022
2678 697242022 696169972 695099294 693976104 692833543 691733241 690662146 689528167 688316822 687099636
2696.4 687099636 685851812 684523940 683163643 681803584 680406213 678981066 677576542 676189840
2712.7 676189840 674824119 673510432 672246218 670993865 669749498 668546140 667412400 666356266
2729 666356266 665346563 664363623 663434267 662549496 661630034 660662174 659707785 658767760 657867372 657051206
2749.4 657051206 656259477 655424297 654560387 653751671 653040588 652373135 651684761 650946021 650173128 649387002
2769.8 649387002 648568213 647694826 646773279 645778239 644674659 643494606 642275572 641017437 639678538
2788.2 639678538 638195515 636597276 634956002 633261979 631477833 629585922 627593577 625521719
2804.5 625521719 623392999 621197283 618889511 616463900 613946438 611378014 608774364 606086433
2820.8 606086433 603273809 600333273 597273886 594134271 590943635 587692142 584323704 580767274
2837.1 580767274 577022552 573108196 569001079 564655304 560127199 555639029 551411748 547541261
2853.4 547541261 543978274 540529013 536938012 533028007 528647244 523659766 518081248 512009084
2869.7 512009084 505574822 498952389 492314994 485881478 479932576 474707931 470365107 466982126
2886.1 466982126 464473516 462650388 461361200 460446954 459688842 458893746 457975835 456886172 455544353
2904.4 455544353 453861415 451761842 449201971 446140587 442518830 438423604 434131086 429876745
2920.7 429876745 425842196 422278732 419437736 417506546 416703165 417261809 419257283 422586262 427067995
2939.1 427067995 432456315 438482374 444946289 451656789 458455205 465314865 472212017 479044944
2955.4 479044944 485728443 492215306 498416871 504219174 509561121 514443755 518973768 523330510
2971.7 523330510 527617991 531886876 536219120 540564239 544692516 548486829 551982045 555193126
2988 555193126 558096468 560606062 562671423 564382434 565817058 566942513 567653894 567905307 567761302
3006.4 567761302 567294240 566539764 565470994 564053476 562313795 560326338 558169723 555867910 553413928
3024.7 553413928 550821006 548127532 545355499 542487085 539467573 536334455 533236921 530158281
3041.1 530158281 526958168 523612857 520203531 516824543 513450146 509996474 506502032 503024876
3057.4 503024876 499576747 496183008 492837071 489479959 486019969 482446343 478905469 475522786
3073.7 475522786 472277582 469063193 465748608 462311298 458843797 455393761 451999813 448666424
3090 448666424 445297241 441895664 438599378 435437649 432265818 428981960 425691396 422550201 419502944
3108.4 419502944 416385323 413275719 410310060 407377809 404360771 401218683 397987425 394847482
3124.7 394847482 391896963 389034778 386127412 383173883 380294830 377559274 374860913 372045785
3141 372045785 369173110 366391391 363723725 361186832 358753115 356244087 353573620 350884378 348302811
3159.4 348302811 345846534 343467236 341100007 338753015 336443305 334155709 331912607 329748511
3175.7 329748511 327628732 325516045 323386371 321256787 319200724 317223430 315290391 313378096
3192 313378096 311477005 309594691 307732612 305915892 304172248 302477330 300788283 299080640 297396153
3210.3 297396153 295787275 294225067 292699575 291210562 289728016 288271070 286852121 285460889
3226.7 285460889 284125268 282899112 281732827 280431688 278992683 277615577 276359707 275209427
3243 275209427 274165750 273101687 271919221 270754248 269720167 268718362 267645389 266590714 265654594
3261.3 265654594 264780819 263910532 263104439 262394756 261637986 260763913 259840935 258901358 257981598 257137746
3281.7 257137746 256387681 255679578 254975528 254314810 253678739 252977341 252197593 251384169 250613958 249985307
3302.1 249985307 249479175 248883322 248043358 247065306 246087775 245161355 244290635 243452311 242660522 241942480
3322.5 241942480 241220042 240320995 239279374 238344476 237578928 236894086 236244410 235527426 234688386
3340.9 234688386 233790815 232869416 232043326 231382042 230641708 229659215 228629261 227774382 227074444
3359.2 227074444 226391271 225721121 225167811 224636003 223870426 222851127 221868694 221109733 220438674
3377.6 220438674 219744429 219051376 218425885 217962697 217715696 217592493 217332929 216824725 216304362 216052338
3398 216052338 215941727 215552911 214886054 214379728 214146510 213998675 213845536 213589147 213259593 213072002
3418.4 213072002 213006437 212900758 212865859 213066846 213370562 213538751 213679388 213962272 214158133 214118734
3438.8 214118734 214112595 214345708 214759931 215189621 215529785 215895459 216343179 216813937 217401996 218141913
3459.2 218141913 218793303 219412684 220315203 221331850 222019374 222358450 222739801 223365441 224219590
3477.5 224219590 225090489 225732431 226354063 227187395 228034854 228805184 229703099 230735302 231755078
3495.9 231755078 232721254 233700305 234651640 235429645 236124367 236953601 238004759 239229679 240367100
3514.2 240367100 241264269 242169663 243332565 244690388 245869651 246736825 247599512 248670593 249934256
3532.6 249934256 251343429 252732515 253986001 255353183 256950170 258478761 259713024 260971099
3548.9 260971099 262456357 263992548 265613765 267470181 269520849 271623582 273620933 275540501
3565.2 275540501 277761787 280293375 282776922 285222441 287793487 290525526 293455929 296600968
3581.5 296600968 299809128 302919060 305998325 309229672 312527090 315910846 319487333 323218882
3597.9 323218882 326977164 330735266 334453762 338120639 342037916 346185327 350309432 354458928
3614.2 354458928 358552516 362724453 367170036 371409088 375299782 379133105 383477896 388286263
3630.5 388286263 392660379 396823317 401014090 405197710 409479260 413822651 418055087 422313094
3646.8 422313094 427031428 431800634 435885012 439849108 444355369 448819607 452768445 456524104
3663.1 456524104 460348219 464173317 468097180 472078711 475659877 479241192 482915878 486212671
3679.4 486212671 489369363 492572635 495844424 499257833 502489269 505194724 507695138 510220647
3695.8 510220647 512691617 515088439 517550111 519991338 522269428 524515629 526783884 528960526
3712.1 528960526 531020641 532923996 534738719 536570013 538413644 540185273 541901290 543631017
3728.4 543631017 545400500 547378123 549411774 551159799 552633584 553824544 554819047 556153297
3744.7 556153297 557771862 559086502 560403824 561906874 563316166 564592361 565882087 567200899
3761 567200899 568425834 569660783 570934176 572143078 573325753 574495554 575702310 576991558 578242660
3779.4 578242660 579286754 580136776 581040263 582087100 583168983 584251583 585343122 586472631 587539136
3797.7 587539136 588476956 589545488 590595365 591401815 592232585 593091846 593930364 594799161 595805287
3816.1 595805287 596858859 597775161 598679304 599408507 600005507 600677848 601464927 602414727 603398621
3834.4 603398621 604254127 605013251 605650187 606200933 606771350 607341647 607961357 608592033 609255016 610148847
3854.8 610148847 610959888 611593246 612206042 612832963 613448679 613946974 614471436 615211010 615914285 616476119
3875.2 616476119 616907418 617393672 618100762 618763685 619336069 619782925 620094240 620573461 621143758 621556938
3895.6 621556938 621982098 622554898 623134613 623615324 623971581 624191821 624445856 624841928 625245094 625593603
3916 625593603 625946641 626262367 626524031 626850247 627219200 627497673 627786517 628228545 628621995 628819406
3936.4 628819406 628982604 629250109 629648983 630066633 630404532 630711257 631004930 631275892 631560206 631871164
3956.8 631871164 632161260 632385910 632573962 632813394 633134186 633480966 633795261 634008229 634155333 634354234
3977.2 634354234 634612143 634947360 635264754 635416150 635497868 635666251 635953426 636249959 636511803 636811316
3997.6 636811316
##END=$$ End of the data block
