##TITLE=$$ Begin of the data block
##JCAMP-DX=5.00 $$ ACD/SpecManager v 10.08
##SPECTROMETER/DATA SYSTEM=Alpha
##DATE=29 Dec 2014 11:22:02
##DATA TYPE=INFRARED SPECTRUM
##DATA CLASS=XYDATA
##ORIGIN=
##OWNER=
##NPOINTS=1765
##FIRSTX=399.76428223
##LASTX=3997.64306641
##MAXX=3997.64306641
##MINX=399.76428223
##MAXY=0.80916440
##MINY=0.15047270
##XFACTOR=1.0000000000
##YFACTOR=1.000000000000000e-9
##FIRSTY=0.46299893
##DELTAX=2.03961372
##XUNITS=1/CM
##YUNITS=ARBITRARY UNITS
##XYDATA=(X++(Y..Y))
399.8D62998927o173998m306823k552331p97510P83533J886546K226383J889854P98196
$$ 462998927 456824929 452518106 449965775 449168265 449951798 451838344 454064727 455954581 456752777
418.1D56752777j522303k776831l101319l710628l796935l491550l238023k852797
$$ 456752777 455230474 452453643 449352324 445641696 441844761 438353211 435115188 432262391
434.4D32262391k003938k74897K213389M503012N283296M672885L888607L280431K221614
$$ 432262391 430258453 429983556 432196945 436699957 441983253 446656138 450544745 453825176 456046790
452.8D56046790Q09193l41744j528680k135187k330929k738089l396660m018664m066795
$$ 456046790 456855983 456514239 454985559 452850372 450519443 447781354 444384694 440366030 436299235
471.2D36299235l811360l225684k358466j734376j320482q18520k06828J98125O914
$$ 436299235 432487875 429262191 426903725 425169349 423848867 423030347 422823519 423021644 423028558
489.5D23028558p24226j502931j920372j983136j959324k310038k954661l324658l511280
$$ 423028558 422304332 420801401 418881029 416897893 414938569 412628531 409673870 406349212 402837932
507.9D02837932l714800l937006m294783m941970n384266m838228l581167k380371
$$ 402837932 399123132 395186126 390891343 385949373 380565107 375726879 372145712 369765341
524.2C69765341j586675q97199M2438J181931K525240M102498N607873O276101N587429
$$ 369765341 368178666 367281467 367323905 368505836 371031076 375133574 380741447 387017548 392604977
542.5C92604977M057944K307206M94033j097262k189427k797097l271669m018456n010754
$$ 392604977 396662921 398970127 399464160 398366898 396177471 393380374 390108705 386090249 381079495
560.9C81079495o045461p062614p869690p802695o354452l900170j147360J549274
$$ 381079495 375034034 367971420 360101730 352299035 345944583 342044413 340897053 342446327
577.2C42446327M148543O492287P972717Q187741P334262N746395L987759K409458
$$ 342446327 346594870 353087157 361059874 369247615 376581877 382328272 386316031 388725489
593.5C88725489J052469j907n24729n92232m51505n5015M15444P93844J246900J875519
$$ 388725489 389777958 389776051 389251322 388659090 388207585 388152570 388568014 389361858 390608758 392484277
613.9C92484277K626390L409624L973067M239380M363954M326314M114866L674358
$$ 392484277 395110667 398520291 402493358 406732738 411096692 415423006 419537872 423212230
630.2D23212230L009796K320260J834095J638382J592696J485974J313358J151234
$$ 423212230 426222026 428542286 430376381 432014763 433607459 435093433 436406791 437558025
646.6D37558025J095533J177073J323611J404672J309872J184851J091242J083612
$$ 437558025 438653558 439830631 441154242 442558914 443868786 445053637 446144879 447228491
662.9D47228491J188577J565814J890927J447916J401007J709700J975983K110273
$$ 447228491 448417068 449982882 451873809 453321725 454722732 456432432 458408415 460518688
679.2D60518688J983076J669318J304865J014083P21693J41293q16941j840204k674401
$$ 460518688 462501764 464171082 465475947 466490030 467211723 467353016 466536075 464695871 462021470
697.5D62021470l267199l565132l440142k862930j815915k53410J573205L207088M422903
$$ 462021470 458754271 455189139 451748997 448886067 447070152 446816742 448389947 451597035 456019938
715.9D56019938N336702O165236O834298P199944P241755O858528O093234N206108
$$ 456019938 461356640 467521876 474356174 481556118 488797873 495656401 501749635 506955743
732.2E06955743M487812L875196K992452J789271M55022q67784k170920l450275m635870
$$ 506955743 511443555 515318751 518311203 520100474 520555496 519687712 517516792 514066517 509430647
750.6E09430647n514324n949467n956233n543709m701763l321975j352102J037419
$$ 509430647 503916323 497966856 492010623 486466914 481765151 478443176 477091074 478128493
766.9D78128493L617167O191165Q402049R991914J0867894J0819018R913504Q633017
$$ 478128493 481745660 487936825 496338874 506330788 517198682 528017700 537931204 546564221
783.2E46564221P354021O171644N258620M730582M589379M849434N337775N643308
$$ 546564221 553918242 560089886 565348506 570079088 574668467 579517901 584855676 590498984
799.5E90498984N485058M955172M259765L482163K763927K278328J813293J305103
$$ 590498984 595984042 600939214 605198979 608681142 611445069 613723397 615536690 616841793
815.8F16841793Q69811L24428m41969j392126k538740l710509m765570n766988o574929
$$ 616841793 617711604 618036032 617594063 616201937 613663197 609952688 605187118 599420130 592845201
834.2E92845201o964445o859362o359219n723298n182564m705966m347443m357636
$$ 592845201 585880756 579021394 572662175 566938877 561756313 557050347 552702904 548345268
850.5E48345268m753292n340099n842507n487919k877176K289236P966697J1991441
$$ 548345268 543591976 538251877 532409370 526921451 524044275 526333511 534300208 546291649
866.8E46291649J4192403J5027344J4199376J1534870P754802L723681j88231l618717
$$ 546291649 560484052 575511396 589710772 601245642 609000444 612724125 612535894 608917177
883.2F08917177o119073p521987p983446p842362p394671o774962o136119n782784
$$ 608917177 602798104 595276117 587292671 579450309 572055638 565280676 559144557 553361773
899.5E53361773n913674o485343p455588q745253j0023951j1085511j1941105j2390881
$$ 553361773 547448099 540962756 533507168 524761915 514737964 503652453 491711348 479320467
915.8D79320467j1997879j0418385p844419n019456k687126j054078K20954J508474
$$ 479320467 467322588 456904203 449059784 444040328 441353202 440299124 440520078 442028552
932.1D42028552K891630M237265N308181N959958N910038M265190N31017m357427r070009
$$ 442028552 444920182 449157447 454465628 460425586 466335624 470600814 471131831 466774404 457704395
950.5D57704395j2876719j5557766j7233193j8231541j8882692j9407481j9900471
$$ 457704395 444827676 429269910 412036717 393805176 374922484 355515003 335614532
964.7C35614532k0283848k0457536k0429343k0154893j9522280j8402666j6661733
$$ 335614532 315330684 294873148 274443805 254288912 234766632 216363966 199702233
979A99702233j4322653j1645884q908987o340682m173830k467707j169458k00331N01662
$$ 199702233 185379580 173733696 164824709 158484027 154310197 151842490 150673032 150472701 150974363
997.4A50974363R37864J063183Q80376M96328K2277m08903o16148m81069q0675M70087
$$ 150974363 151912227 152975410 153855786 154352114 154374391 153965488 153349340 152868271 152787596 153257683
1017.8A53257683J128450J810685K412289K897948L228814L387197L324002K923742
$$ 153257683 154386133 156196818 158609107 161507055 164735869 168123066 171447068 174370810
1034.1A74370810K236233J464247Q71197N98475O42896R31576J429542K262831L471330
$$ 174370810 176607043 178071290 178942487 179540962 180183858 181115434 182544976 184807807 188279137
1052.4A88279137M834607O141112P392764Q671090R945839J0503322Q752778L428549
$$ 188279137 193113744 199254856 206647620 215318710 225264549 235767871 244520649 247949198
1068.8B47949198m164845j0015339j1102691q254260m333183j090079J250952K922654
$$ 247949198 243784353 233769014 222666323 214412063 210078880 208988801 210239753 213162407
1085.1B13162407M078612M938617N673737O110251N931392M971564L466800J945033
$$ 213162407 217241019 222179636 227853373 233963624 239895016 244866580 248333380 250278413
1101.4B50278413R76980R95785J943052L194690M143595M550487M401296L822327L045231
$$ 250278413 251255393 252251178 254194230 257388920 261532515 266083002 270484298 274306625 277351856
1119.8B77351856K320320J941621K276540L325015M537106N078584M228204J848340
$$ 277351856 279672176 281613797 283890337 287215352 291752458 296831042 301059246 302907586
1136.1C02907586j491934m842162p363081q653075q798360q104057o849795n258143
$$ 302907586 301415652 296573490 289210409 280557334 271758974 263654917 256805122 251546979
1152.4B51546979l555194j893162l35262J196996K902686M829690O944955R128242
$$ 251546979 247991785 246098623 245763361 246960357 249863043 254692733 261637688 270765930
1168.7B70765930J1155099J2821853J4017791J4721185J5048206J5145003J4940322
$$ 270765930 281921029 294742882 308760673 323481858 338530064 353675067 368615389
1183C68615389J4278769J3064295J1286319R122759O928384N017132L543019K563328
$$ 368615389 382894158 395958453 407244772 416367531 423295915 428313047 431856066 434419394
1199.3D34419394K080887K077967K556056L387332M323303N220175N906075O156415
$$ 434419394 436500281 438578248 441134304 444521636 448844939 454065114 459971189 466127604
1215.6D66127604N862445M973978L547012J835078K17766r46164j586706j897007k039075
$$ 466127604 471990049 476964027 480511039 482346117 482563883 481617719 480031013 478134006 476094931
1234D76094931k090037k004235j638443r39339j7971R18746J690418K230733K521098
$$ 476094931 474004894 472000659 470362216 469422877 469404906 470323652 472014070 474244803 476765901
1252.3D76765901K533018K243460J713872J204878J058727J428813K102911K640576
$$ 476765901 479298919 481542379 483256251 484461129 485519856 486948669 489051580 491692156
1268.6D91692156K684921K147883J252055L44574l73452q24214j007944j085073j222640
$$ 491692156 494377077 496524960 497777015 498121589 497748137 496923923 495915979 494830906 493608266
1287D93608266j382261j483232j664311j995057k311736k481490k450735k278894k190352
$$ 493608266 492226005 490742773 489078462 487083405 484771669 482290179 479839444 477560550 475370198
1305.4D75370198k230882k090246j697093j347452j196087j249641j552582k177268
$$ 475370198 473139316 471049070 469351977 468004525 466808438 465558797 464006215 461828947
1321.7D61828947l214568m578948n809426o429166o293654n516857m290849k876103
$$ 461828947 458614379 454035431 448226005 441796839 435503185 429986328 425695479 422819376
1338D22819376j562983m88162K73883O51569N72204J49489k99305o59376r58771j165599
$$ 422819376 421256393 420768231 421042114 421693683 422265887 422415376 422116071 421456695 420497924 419332325
1358.4D19332325j284539j390547j301765r89348o59048j68980M81904R15289Q99672
$$ 419332325 418047786 416657239 415355474 414366126 413707078 413538098 414020002 414935291 415834963
1376.7D15834963Q62122J115501J792103L003806M491776M936427L971338K823770
$$ 415834963 416697085 417812586 419604689 422608495 427100271 432036698 436008036 438831806
1393.1D38831806J524121Q9079j005173j499444j632601j944214k208114k296805k332568
$$ 438831806 440355927 440445006 439439833 437940389 436307788 434363574 432155460 429858655 427526087
1411.4D27526087k043874j440584j056194r90361n56976J48058O91771J177550J622736
$$ 427526087 425482213 424041629 422985435 421995074 421438098 421586156 422277927 423455477 425078213
1429.8D25078213J810849J903355K294838K468288K122432K049655J862943J297444
$$ 425078213 426889062 428792417 431087255 433555543 435677975 437727630 439590573 440888017
1446.1D40888017L91305n19365r40561r91494j558304k266556r61870Q44300K703816
$$ 440888017 441279322 440759957 439819396 438827902 437269598 435003042 434041172 434885472 437589288
1464.5D37589288M293382N352586P456780J1099458J2051761J0454505R508759R107858
$$ 437589288 441882670 447235256 454692036 465791494 477843255 488297760 497806519 506914377
1480.8E06914377Q711934P912934P678270P909716P184088N455017N002141N480826
$$ 506914377 515626311 523539245 531217515 539127231 546311319 551766336 556768477 562249303
1497.1E62249303M896939L988444L669978M271209M722178K782345J934647K322972
$$ 562249303 567146242 571134686 574804664 579075873 583798051 586580396 588515043 590838015
1513.4E90838015K662778K698660K399385K242267J766741J425684J356303J077116
$$ 590838015 593500793 596199453 598598838 600841105 602607846 604033530 605389833 606466949
1529.7F06466949J046598R21845O98150J043379J266479j21712j017452q92758n38111
$$ 606466949 607513547 608435392 609133542 610176921 611443400 611321688 610304236 609411478 608873367
1548.1F08873367l11374l29554l12269r2626l32117j765370j529038r07123o93262
$$ 608873367 608561993 608232439 607920170 607827544 607495427 605730057 604201019 603293896 602600634
1566.4F02600634o66559q59320o11126j45614m09305j015008r80496q31664p69854
$$ 602600634 601934075 601074755 600463629 600318015 599908710 598893702 597913206 597081542 596311688
1584.8E96311688q39591j069307j465797j789093k004087k171994k323210k657175
$$ 596311688 595472097 594402790 592936993 591147900 589143813 586971819 584648609 581991434
1601.1E81991434l140509l494740l710925m056871m226565m039109m476428n616248
$$ 581991434 578850925 575356185 571645260 567588389 563361824 559322715 554846287 549230039
1617.4E49230039m814088l920973m465341m638612m498661m350364l379882k532303
$$ 549230039 544415951 540494978 536029637 531391025 526892364 522542000 519162118 516629815
1633.7E16629815k813816k709687j738131r45449j36971P53939J238227J328468K295077
$$ 516629815 513815999 511106312 509368181 508422732 508285761 509039700 510277927 511606395 513901472
1652.1E13901472L262997K468228K756655L875196M893244N018234M583597N476117
$$ 513901472 517164469 519632697 522389352 526264548 531157792 536176026 540759623 546235740
1668.4E46235740O535769N798697N964339O423891N675852N468607O600916Q237839
$$ 546235740 552771509 558570206 564534545 570958436 576634288 582102895 588703811 596941650
1684.7E96941650O384432M895210N097509M831731N451679N875469N061149M586697
$$ 596941650 603326082 608221292 613318801 618150532 623602211 629477680 634538829 639125526
1701.1F39125526L280759K936661L283262L034115K946973K994001K992213K534806
$$ 639125526 642406285 645342946 648626208 651660323 654607296 657601297 660593510 663128316
1717.4F63128316J084924M99427J150072K044499K627969L049135L269613L668606
$$ 663128316 664213240 664712667 665862739 667907238 670535207 673584342 676853955 680522561
1733.7F80522561L020227K008796K300143K712369K860665L125549L373623L543674
$$ 680522561 683542788 685551584 687851727 690564096 693424761 696550310 699923933 703467607
1750G03467607L386021L087521L326535L380954K884150K554416K103687K004504K304256
$$ 703467607 706853628 709941149 713267684 716648638 719532788 722087204 724190891 726195395 728499651
1768.4G28499651K364635K024591J266420R34422J289547J651823J536370J201927
$$ 728499651 730864286 732888877 734155297 735089719 736379266 738031089 739567459 740769386
1784.7G40769386R79185J053930J461506J671552J215995R00924Q99255R19759R59516
$$ 740769386 741748571 742802501 744264007 745935559 747151554 748052478 748951733 749871492 750831008
1803G50831008J069367J149058J046956Q09192O59228Q38101J080990J041352Q12173
$$ 750831008 751900375 753049433 754096389 754905581 755564809 756402910 757483900 758525252 759337425
1821.4G59337425P16210P80940R08553J010299O80745K95996K81573M19795O01590
$$ 759337425 760053635 760834575 761743128 762753427 763434172 763730168 764011741 764431536 765033126
1839.8G65033126Q11994Q22306L54111k5094Q7738L76165N14269M17411K08617J01447
$$ 765033126 765845120 766667426 767021537 766996443 767084181 767460346 767974615 768392026 768600643 768702090
1860.2G68702090K03371M81009O98805N70238J13427p4803J94072N01871O00458M75883
$$ 768702090 768905461 769386470 770085275 770655513 770768940 770694137 770888209 771390080 771990538 772466421
1880.5G72466421K94745K85387M87983P08700O25789L29375J51396J28925K53379M19855
$$ 772466421 772761166 773046553 773534536 774243236 774869025 775198400 775349796 775478721 775732100 776151955
1900.9G76151955L95775K00748N5314O8664J64509K51830L09884K70248J07467M8876
$$ 776151955 776547730 776748478 776803792 776872456 777036965 777288795 777598679 777868927 777976394 778025270
1921.3G78025270J89065K65956K00689R5129M5121R6023J93715K79427K89261K37286
$$ 778025270 778214335 778480291 778680980 778776109 778821230 778917253 779110968 779390395 779679656 779916942
1941.7G79916942J34111P5757J48416L00586L53396K28464J20163J62661K99097L82900
$$ 779916942 780051053 780126810 780275226 780575812 780929208 781157672 781277835 781440496 781739593 782122493
1962.1G82122493L59416K50459J14917P6771J83225K96354K58267J06454J7762Q7023
$$ 782122493 782481909 782732368 782847285 782924056 783107281 783403635 783661902 783768356 783786118 783873141
1982.5G83873141J94251K31266J71602O5863l9875o0439M7028J14023L6121j13487
$$ 783873141 784067392 784298658 784470260 784536123 784496248 784435809 784482837 784596860 784632981 784519494
2002.9G84519494j96279j67965j15276j74999l25143m19796m40061m76301n29587o20425
$$ 784519494 784323215 784155250 784039974 783864975 783539832 783120036 782679975 782203674 781674087 781053662
2023.3G81053662o87062m84884k85864l30925l60072l81171m89176n42283m76658l68774
$$ 781053662 780366600 779881716 779595852 779264927 778904855 778523684 778034508 777492225 777015567 776646793
2043.7G76646793k63453k26617k70783k81930j73271l1114M5300N4240K5153L6836
$$ 776646793 776383340 776156723 775885940 775604010 775430739 775399625 775444925 775499165 775524318 775561154
2064.1G75561154P9036J22010J36495Q1241R954p570L7194J07646J30415R7036Q1062
$$ 775561154 775640190 775762200 775898695 775979936 775989890 775982320 776019514 776127160 776257575 776354611 776435673
2086.6G76435673Q0943J08779J83880K35081K06828J60038J58072J84655K28942K72154
$$ 776435673 776516616 776625395 776809275 777044356 777251184 777411222 777569294 777753949 777982891 778255045
2106.9G78255045K52843J40488M2022O1631J32978J34826P4327K0980p74J6391N3704
$$ 778255045 778507888 778648376 778690398 778752029 778885007 779019833 779094160 779115140 779114366 779130757 779184461
2129.4G79184461Q0526P6532M2856O437K4795Q7977Q8274L8267L5107N7995Q9169J61886
$$ 779184461 779264987 779341519 779384375 779390812 779415607 779503584 779591858 779630125 779665232 779723227 779812396 779974282
2153.9G79974282K31683K46823K43962K98381M03225M65453M50670M69268N51343O04093
$$ 779974282 780205965 780452788 780696750 780995131 781398356 781863809 782314479 782783747 783335090 783939183
2174.3G83939183O21915O24299O26027O09458N74171N69225N71251N55634N32389N14865
$$ 783939183 784561098 785185397 785811424 786420882 786995053 787564278 788135529 788691163 789223552 789738417
2194.6G89738417N21242N36681N29706N18203N32031N39899N00679M79817N32627N60343
$$ 789738417 790259659 790796340 791326046 791844249 792376280 792916179 793416858 793896675 794429302 794989645
2215G94989645N07474M52757M54784M51624M04060L77893L84152L97325L99172L42906
$$ 794989645 795497119 795949876 796404660 796856284 797260344 797638237 798022389 798419714 798818886 799161792
2235.4G99161792L02195L44813L39926K73585K65539K96890K96951K63571K25127K28584
$$ 799161792 799463987 799808800 800148726 800422311 800687850 800984740 801281691 801545262 801770389 801998973
2255.8H01998973K76923L05176K95460K63453K54690L14415L61264L36766K99334K66314
$$ 801998973 802275896 802581072 802876532 803139985 803394675 803709090 804070354 804407120 804706454 804972768
2276.2H04972768K38478K39193K67506K97308K54512J63615J38044J82092K03192J85669
$$ 804972768 805211246 805450439 805717945 806015253 806269765 806433380 806571424 806753516 806956708 807142377
2296.6H07142377J71780J22846P7128J25825K01285J98186J63495J26839P9334J10566
$$ 807142377 807314157 807437003 807514131 807639956 807841241 808039427 808202922 808329761 808409095 808519661
2317H08519661J82152J78278J14917L4929n782N6327Q3923m3452j46389j45495j35302
$$ 808519661 808701813 808880091 808995008 809029937 809024155 809080482 809164405 809120953 808974564 808829069 808693767
2339.5H08693767j14739m2677j53184n00143n44905j32561L10182L67761K22802K8134
$$ 808693767 808579028 808536351 808383167 807883024 807338119 807205558 807515740 807883501 808106303 808134437
2359.9H08134437k03431l28124k99096k70366l39568m33922m27961l66271l42071l29852
$$ 808134437 807931006 807602882 807303786 807033420 806693852 806259930 805831969 805465698 805123627 804793775
2380.2H04793775l12507k84851k45273k07782j89066j97649k26855k48313k71797k99394
$$ 804793775 804481268 804196417 803951144 803743362 803554296 803356647 803129792 802881479 802609682 802310288
2400.6H02310288k75254k69115l46542m15086m35114m48227m72486m85003m90308n53966
$$ 802310288 802035034 801765919 801419377 801004291 800569177 800120950 799648464 799163461 798673153 798119187
2421G98119187o20365o04749n88178o20544o59168o87539p03633o95944o87659o87957
$$ 798119187 797498822 796894073 796305895 795685351 795026183 794338644 793635011 792939067 792251408 791563451
2441.4G91563451o90639p12037p17878p07567p11203p10904p05183p06434o61075n81682
$$ 791563451 790872812 790160775 789442897 788735330 788024127 787313223 786608040 785901606 785240531 784658849
2461.8G84658849n68747o15537o59645o53029o03735n93007o24299o32345o11425n82814
$$ 784658849 784090102 783474565 782814920 782161891 781558156 780965149 780340850 779708505 779097080 778514266
2482.2G78514266n59032n21898m66049m59313m72784m17710l18944k83182l41236m05550
$$ 778514266 777955234 777433336 776967287 776507974 776035190 775617480 775298536 775015354 774674118 774268568
2502.6G74268568m17829l78728l18646k89083l10302l80993m62234m84168m66108m68672
$$ 774268568 773850739 773472011 773153365 772864282 772553980 772172987 771710753 771226585 770760477 770291805
2523G70291805n05209n98848o97255p08401o71267o65069o97017p64131q22366q10206
$$ 770291805 769786596 769187748 768490493 767782092 767110825 766445756 765748739 764984608 764162242 763352036
2543.4G63352036p62105p37369p70151q35359q51572q04841p23243o73235p30574q10623
$$ 763352036 762589931 761852562 761082411 760247052 759395480 758590639 757867396 757194161 756463587 755652964
2563.8G55652964p85470p00891o69360o93858p33852p71761p42972o47366n90563o07133
$$ 755652964 754867494 754166603 753497243 752803385 752069533 751297772 750554800 749907434 749316871 748709738
2584.2G48709738o50584o52731n79715m79698m34697m62532n02288n14746n25176n58496
$$ 748709738 748059154 747406423 746826708 746347010 745912313 745449781 744947493 744432747 743907571 743349075
2604.6G43349075n91695o37174p33792q32916q88824r39846j005531j086711j201392
$$ 743349075 742757380 742120206 741386414 740553498 739664674 738724828 737719297 736632586 735431194
2623G35431194j278221j260281j245916j305878j402199j484573j496673j447916j443147
$$ 735431194 734152973 732892692 731646776 730340898 728938699 727454126 725957453 724509537 723066390
2641.3G23066390j464844j441121j440525j478672j447022j377464j385867j405239
$$ 723066390 721601546 720160425 718719900 717241228 715794206 714416742 713030875 711625636
2657.6G11625636j394809j395583j346826j299143j317680j300216j231611j210451
$$ 711625636 710230827 708835244 707488418 706189275 704871595 703571379 702339768 701129317
2673.9G01129317j213193j168728j105785j065075j077712j138627j155556j111924
$$ 701129317 699916124 698747396 697641611 696576536 695498824 694360197 693204641 692092717
2690.3F92092717j117230j197874j254976j251221j260876j327217j386643j406371
$$ 692092717 690975487 689777613 688522637 687271416 686010540 684683323 683296680 681890309
2706.6F81890309j421213j416862j362324j319349j326740j317024j271069j225114
$$ 681890309 680469096 679052234 677689910 676370561 675043821 673726797 672455728 671230614
2722.9F71230614j194537j132726j045466j008510r82583r39786r18210r17911r28879
$$ 671230614 670036077 668903351 667857885 666849375 665866792 664927006 664008796 663090885 662162006
2741.2F62162006r36985r39310r22084q50796p96140q39293q68320p92563p03037o63101
$$ 662162006 661225021 660285711 659363627 658512831 657716691 656877398 656009078 655216515 654513478 653850377
2761.6F53850377o81878p36355p65503p86841q29041q85367r44853j000643j090347
$$ 653850377 653168499 652432144 651666641 650879800 650050759 649165392 648220539 647219896 646129549
2780F46129549j170278j190186j243710j356125j474500j572907j641094j712621j794159
$$ 646129549 644959271 643769085 642525375 641169250 639694750 638121843 636480749 634768128 632973969
2798.4F32973969j880944j981079k082587k164125k229691k312064k424478k510846
$$ 632973969 631093025 629111946 627029359 624865234 622635543 620323479 617899001 615388155
2814.7F15388155k553880k624691k715230k799272k908230l047645l142178l179491
$$ 615388155 612834275 610209584 607494354 604695082 601786852 598739207 595597029 592417538
2831E92417538l270984l421843l580391l749192l914416m090607m312694m511475m534305
$$ 592417538 589146554 585724711 582144320 578395128 574480712 570390105 566077411 561565936 557031631
2849.3E57031631m293918l897905l588915l504694l612876l900230m402995n026102
$$ 557031631 552737713 548839808 545250893 541746199 538133323 534233093 529830098 524803996
2865.7E24803996n592167o053090o428838o668091o697953o463527n943865n197197
$$ 524803996 519211829 513158739 506729901 500061810 493363857 486900330 480956465 475759268
2882D75759268m329086l418088k549320j829296j297146r56625q00461p90000q85486
$$ 475759268 471430182 468012094 465462774 463633478 462336332 461379707 460579246 459789246 458903760
2900.3D58903760j074851j326620j636059k057492k560735l113866l699422m143297
$$ 458903760 457828909 456502289 454866230 452808738 450248003 447134137 443434715 439291418
2916.6D39291418m306943m264742m049301l565788k800465j841306p39664N21987J923383
$$ 439291418 434984475 430719733 426670432 423104644 420304179 418462873 417723209 418245196 420168579
2935D20168579L334522M537493N421758O038188O452293O696552O805271O863594O876588
$$ 420168579 423503101 428040594 433462352 439500540 445952833 452649385 459454656 466318250 473194838
2953.4D73194838O809383O743044O621957O283790N787521N299032M891753M589379
$$ 473194838 480004221 486747265 493369222 499653012 505440533 510739565 515631318 520220697
2969.7E20220697M400611M314184M312515M377008M386306M168808L808379L495217
$$ 520220697 524621308 528935492 533248007 537625015 542011321 546180129 549988508 553483725
2986E53483725L203928K881885K540171K165079J790345J440286J092792P12573K84613
$$ 553483725 556687653 559569538 562109709 564274788 566065133 567505419 568598211 569310784 569595397
3004.4E69595397j26243m67777p69735j082599j403987j689673j941860k165734k323449
$$ 569595397 569469154 569001377 568231642 567149043 565745056 564055383 562113523 559947789 557624340
3022.7E57624340k449393k602339k739191k816677k874077k986490l090084l100455
$$ 557624340 555174947 552572608 549833417 547016740 544142663 541156173 538066089 534965634
3039E34965634l140986l261745l371417l399968l349245l365099l457904l478587l469348
$$ 534965634 531824648 528562903 525191486 521791518 518442273 515077174 511619270 508140683 504671335
3057.4E04671335l476202l441960l395557l375501l430545l537595l535927l407269
$$ 504671335 501195133 497753173 494357616 490982115 487551570 484013975 480478048 477070779
3073.7D77070779l277481l250003l339439l414214l421098l432363l410578l367096
$$ 477070779 473793298 470543295 467203856 463789642 460368544 456936181 453525603 450158507
3090D50158507l399104l404767l290325l170490l192455l308117l285647l130704l080249
$$ 450158507 446759403 443354636 440064311 436893821 433701366 430393249 427107602 423976898 420896649
3108.4D20896649l176540l152579k966612k909959k999753l139913l251582l177524
$$ 420896649 417720109 414567530 411600918 408690959 405691206 402551293 399299711 396122187
3124.7C96122187k989649k869130k871275k948075k932042k773195k704144k826810
$$ 396122187 393132538 390263408 387392133 384444058 381512016 378738821 376034677 373207867
3141C73207867k896637k797782k670497k545774k449006k516001k670258k688915k599537
$$ 373207867 370311230 367513448 364842951 362297177 359848171 357332170 354661912 351972997 349373460
3159.4C49373460k494902k400547k374351k375036k321780k238661k215624k217531
$$ 349373460 346878558 344478011 342103660 339728624 337406844 335168183 332952559 330735028
3175.7C30735028k187878k167314k153367k121180k065361j981556j899899j885056
$$ 330735028 328547150 326379836 324226469 322105289 320039928 318058372 316158473 314273417
3192C14273417j923501j938403j908064j839697j760096j710981j693398j688838j650273
$$ 314273417 312349916 310411513 308503449 306663752 304903656 303192675 301499277 299810439 298160166
3210.3B98160166j589656j568735j559198j534045j499146j454651j410991j372874
$$ 298160166 296570510 295001775 293442577 291908532 290409386 288954735 287543744 286170870
3226.7B86170870j332313j256913j215368j336426j436680j323313j180887j134127
$$ 286170870 284838557 283581644 282366276 281029850 279593170 278269857 277088970 275954843
3243B75954843j095474j090586j166404j173347j064241r84430j013935j051247j007050
$$ 275954843 274859369 273768783 272602379 271429032 270364791 269380361 268366426 267315179 266308129
3261.3B66308129r43691q75085p73371p04884p71940q97467r33975r26286r08613q30412
$$ 266308129 265364438 264489353 263715982 263011098 262239158 261341691 260407716 259481430 258572817 257742405
3281.7B57742405p47800p14600o99192o71000o76035p36297p81506q34376q17000o39379
$$ 257742405 256994605 256280005 255580813 254909813 254233778 253497481 252715975 251881599 251064599 250425220
3302.1B50425220n23881o38842q42303r62988r80943r17778q46922q21874p90655p30425
$$ 250425220 249901339 249262497 248420194 247457206 246476263 245558485 244711563 243889689 243099034 242368609
3322.5B42368609p23169q60974r83178r11311q12128p57545o94230p66382r03860r04917
$$ 242368609 241645440 240784466 239801288 238889977 238077849 237320304 236626074 235859692 234955832 234050915
3342.9B34050915q54537p70226o69152p92503j033619j055181q66637o82443o49736
$$ 234050915 233196378 232426152 231757000 230964497 229930878 228875697 228009060 227326617 226676881
3361.3B26676881o85766o09338n52789p46250j012429r98661p63417o09412o09056
$$ 226676881 225991115 225381777 224828988 224082738 223070309 222071648 221308231 220698819 220089763
3379.6B20089763o75231o58005n09948k77087j05679k58550n76854n86465k47419n0857
$$ 220089763 219414532 218756527 218246579 217969492 217863813 217605263 217028409 216441944 216194525 216143668
3400B16143668l12746n82024m44815k64883k54780k26736k23622k42337j73003j30564
$$ 216143668 215830922 215248898 214804083 214539200 214284420 214057684 213834062 213591725 213418722 213288158
3420.4B13288158j34289j0580K01076K75150J88649K29999L45782J92433l6865K0772
$$ 213288158 213153869 213143289 213344365 213619515 213808164 214038163 214383945 214576378 214539513 214560285
3440.8B14560285K09302L17305L37646L02642L59908M62323N02885N90071P13706O78569
$$ 214560285 214769587 215086892 215424538 215727180 216087088 216549411 217052296 217642367 218356073 219034642
3461.2B19034642O59868Q83728R99853P00325L59297L82766N98267Q66130R37372O87659
$$ 219034642 219694510 220578238 221578091 222278416 222637713 223020479 223618746 224484876 225422248 226109907
3481.6B26109907O18324Q04484Q30993P87809Q96767J002699R94504R27999R50650
$$ 226109907 226728231 227532715 228363708 229151517 230048284 231050983 232045487 232973486 233924136
3500B33924136R56222Q02308P32318Q48606J032159J203954J124412Q85248R25764
$$ 233924136 234880358 235682666 236414984 237263590 238295749 239499703 240624115 241509363 242435127
3518.3B42435127J193166J356185J195922R14619Q87289J100585J312494J422316J343549
$$ 242435127 243628293 244984478 246180400 247095019 247982308 249082893 250395387 251817703 253161252
3536.7B53161252J202166J374125J648545J604081J289576J221537J442284J574486
$$ 253161252 254363418 255737543 257386088 258990169 260279745 261501282 262943566 264518052
3553B64518052J634717J820863K043157K092421K024919K047599K335757K536446K424955
$$ 264518052 266152769 267973632 270016789 272109210 274134129 276181728 278517485 281053931 283478886
3571.3B83478886K405941K591432K779394K971053L143549L197968L182679L184557
$$ 283478886 285884827 288476259 291255653 294226706 297370255 300568223 303750902 306935459
3587.7C06935459L260672L269434L356517L583520L793568L844410L772557L704816
$$ 306935459 310196131 313465565 316822082 320405602 324199170 328043580 331816137 335520953
3604C35520953L718764L940761M065245M071474M194170M136205M209518M493237M226476
$$ 335520953 339239717 343180478 347245723 351317197 355511367 359647572 363857090 368350327 372576803
3622.3C72576803L887862L902346M400551M795492M363835M178941M253894M267246
$$ 372576803 376464665 380367011 384767562 389563054 393926889 398105830 402359724 406626970
3638.7D06626970M288077M314214M269779M363149M833967M791140M048586L936887
$$ 406626970 410915047 415229261 419499040 423862189 428696156 433487296 437535882 441472769
3655D41472769M478216M464000L984929L768265L777116L774166L999621M142553L619313
$$ 441472769 445950985 450414985 454399914 458168179 461945295 465719461 469719082 473861635 477480948
3673.3D77480948L511935L629059L325224L202140L220350L306478L480554L240585
$$ 477480948 480992883 484621942 487947166 491149306 494369656 497676134 501156688 504397273
3689.6E04397273K623916K409577K498746K521276K461911K479315K399087K239406
$$ 504397273 507021189 509430766 511929512 514450788 516912699 519392014 521791101 524030507
3706E24030507K266109K334654K227008K045572J893520J822830J807511J830697J823842
$$ 524030507 526296616 528631270 530858278 532903850 534797370 536620200 538427711 540258408 542082250
3724.3E42082250J778245J742303J745403J932383K037108J802981J485169J216411
$$ 542082250 543860495 545602798 547348201 549280584 551317692 553120673 554605842 555822253
3740.6E55822253J062274J358032J613200J316190J252413J419186J382053J295090
$$ 555822253 556884527 558242559 559855759 561171949 562424362 563843548 565225601 566520691
3756.9E66520691J338899J376212J267314J247942J287639J215101J138925J118362
$$ 566520691 567859590 569235802 570503116 571751058 573038697 574253798 575392723 576511085
3773.3E76511085J187027J302361J270413J044512Q86381R89139J090884J046658J016557
$$ 576511085 577698112 579000473 580270886 581315398 582201779 583190918 584281802 585328460 586345017
3791.6E86345017J064360J166403J131595R63389R99690R34362P50720Q87037R28700
$$ 586345017 587409377 588575780 589707375 590670764 591670454 592604816 593355536 594242573 595171273
3810E95171273Q36015Q46683J020134J098573R44495Q80421P33614O94274P46668P30753
$$ 595171273 596007288 596853971 597874105 598972678 599917173 600797594 601531208 602225482 602972150 603702903
3830.4F03702903Q71718J011729Q97706P15315N89847N51224O31511O63817O52194
$$ 603702903 604574621 605586350 606484056 607199371 607789218 608340442 608971953 609635770 610287964
3848.7F10287964O11186O58930Q32081O98685N55098N75125O20842O32287N52296N99504
$$ 610287964 610899150 611558080 612390161 613088846 613643944 614219069 614839911 615472198 616024494 616623998
3869.1F16623998P66337O57379N11050M60744O06895Q08060O41525N00023M16398L12150
$$ 616623998 617390335 618047714 618558764 619019508 619626403 620434463 621075988 621576011 621992409 622304559
3889.5F22304559M73559N37753L56793M06623O22690N97715M36664L48270K72155K63512
$$ 622304559 622778118 623315871 623672664 624079287 624701977 625299692 625736356 626084626 626356781 626620293
3909.9F26620293L16262L50296L90590M31358L59297K49982L09706L91304K97904K40028
$$ 626620293 626936555 627286851 627677441 628108799 628468096 628718078 629027784 629419088 629716992 629957020
3930.3F29957020L34919L41713K33472J84774K60413M35412M84705L56733K89321L18110
$$ 629957020 630291939 630633652 630867124 631051898 631312311 631747723 632232428 632589161 632878482 633196592
3950.7F33196592K92123K25365K31743K82168K75374K38120K48969L06904L39568K95400
$$ 633196592 633488715 633714080 633945823 634227991 634503365 634741485 634990454 635297358 635636926 635932326
3971.1F35932326K33412K18272K18273K18868L05116L12030J74701J81497K77102K76684
$$ 635932326 636165738 636384010 636602283 636821151 637126267 637438297 637612998 637794495 638071597 638348281
3991.5F38348281K32935K08021K40385
$$ 638348281 638581216 638789237 639029622
3997.6F39029622
$$ 639029622
##END=$$ End of the data block
