##TITLE=$$ Begin of the data block
##JCAMP-DX=5.00 $$ ACD/SpecManager v 10.08
##SPECTROMETER/DATA SYSTEM=Alpha
##DATE=29 Dec 2014 11:22:02
##DATA TYPE=INFRARED SPECTRUM
##DATA CLASS=XYDATA
##ORIGIN=
##OWNER=
##NPOINTS=1765
##FIRSTX=399.76428223
##LASTX=3997.64306641
##MAXX=3997.64306641
##MINX=399.76428223
##MAXY=0.81118160
##MINY=0.15029953
##XFACTOR=1.0000000000
##YFACTOR=1.000000000000000e-9
##FIRSTY=0.46235055
##DELTAX=2.03961372
##XUNITS=1/CM
##YUNITS=ARBITRARY UNITS
##XYDATA=(X++(Y..Y))
399.8D62350547o040573m613459k836496m90367J200289J826882K018541J939297J011640
418.1D56366301j435578k815187k977550l331542l501296l682524l752977l217608
434.4D31652039k077996l7075K674580M646808M965544M392504L741593L110557K240003
452.8D55308557J075327k70158j745194k283305k163649k494454l440380m123628m094929
471.2D35768187l822118l169954k282440j737267j457870q34435n3198K00302p7307
489.5D22533900p58887j596093k002746j856536j725107k179503k878428l254831l510654
507.9D02771115l729224l928423m284769m905194n414516m941195l645241k474755
524.2C69447798j617611p70211J00732J117617K470344M193008N768150O219864N462587
$$ y = [462350547, 456309974, 451696515, 448860019, 448369652, 449569941, 451396823, 453415364, 455354661, 456366301, 454930723, 452115536, 449137986, 445806444, 442305148, 438622624, 434869647, 431652039, 429574043, 429536968, 432211548, 436858356, 441823900, 446216404, 449957997, 453068554, 455308557, 456383884, 456113726, 454368532, 452085227, 449921578, 447427124, 443986744, 439863116, 435768187, 431946069, 428776115, 426493675, 424756408, 423298538, 422464103, 422410905, 422611207, 422533900, 421775013, 420178920, 418176174, 416319638, 414594531, 412415028, 409536600, 406281769, 402771115, 399041891, 395113468, 390828699, 385923505, 380508989, 375567794, 371922553, 369447798, 367830187, 367059976, 367160708, 368278325, 370748669, 374941677, 380709827, 386929691, 392392278]
542.5C92392278M120052K445697O08564j020044k197266k907962l373682m043639n008220
560.9C81015778o082178p161259p854760p634818o324292m008263j158446J585692
577.2C42377454M108310O433755Q031517Q236438P209212N680412M030913K333403
593.5C88441414R72092R6112m07755n47439l74556M7058N37932Q91507J164734J698852
613.9C92519951K577394L452093L972411M215240M404426M379302M019529L543347
630.2D23083693L079474K531588J955777J604349J592993J555384J282304J037389
646.6D37722951R88364J155496J398325J454175J301407J151473J119077J186550J205533
664.9D48683351J481802J920610J522660J394392J747220K015055K063989J928955
$$ y = [392392278, 396512330, 398958027, 399566591, 398546547, 396349281, 393441319, 390067637, 386023998, 381015778, 374933600, 367772341, 359917581, 352282763, 345958471, 341950208, 340791762, 342377454, 346485764, 352919519, 360951036, 369187474, 376396686, 382077098, 386108011, 388441414, 389413506, 389509618, 389101863, 388554424, 388179868, 388226926, 388764858, 389656365, 390821099, 392519951, 395097345, 398549438, 402521849, 406737089, 411141515, 415520817, 419540346, 423083693, 426163167, 428694755, 430650532, 432254881, 433847874, 435403258, 436685562, 437722951, 438711315, 439866811, 441265136, 442719311, 444020718, 445172191, 446291268, 447477818, 448683351, 450165153, 452085763, 453608423, 455002815, 456750035, 458765090, 460829079, 462758034]
681.2D62758034J624316J331538J108706P25449N8919q76218j842231k631158l229856
699.6D59027499l560990l469169k930373j841754j69337J688451L245592M389584N291611
717.9D61671114O126523O820232P239282P296949O871224O098509N239010M498302
734.3E11861145L844023K974332J839518N21600q83638k234996l468275m620254n549610
752.6E04283845o021678n975366n544960m715324l273338j327544R58770L597021O266326
771D88247752Q428723R933144J0809183J0875404J0060250Q716941P297397O035209
787.3E60404003N196273M789770M651248M865825N349577N659461N511164M924298
803.6F01351619M129529L435015K831400K274454J773774J298070Q31127K58327n14448
$$ y = [462758034, 464382350, 465713888, 466822594, 467548043, 467606962, 466730744, 464888513, 462257355, 459027499, 455466509, 451997340, 449066967, 447225213, 447055876, 448744327, 451989919, 456379503, 461671114, 467797637, 474617869, 481857151, 489154100, 496025324, 502123833, 507362843, 511861145, 515705168, 518679500, 520519018, 521040618, 520156980, 517921984, 514453709, 509833455, 504283845, 498262167, 492286801, 486741841, 482026517, 478753179, 477425635, 478384405, 481981426, 488247752, 496676475, 506609619, 517418802, 528294206, 538354456, 547071397, 554368794, 560404003, 565600276, 570390046, 575041294, 579907119, 585256696, 590916157, 596427321, 601351619, 605481148, 608916163, 611747563, 614022017, 615795791, 617093861, 617924988, 618183315, 617668867]
822F17668867j415968k471804l705502m886270n876660o613254o946981o842137o374001
840.3E72536290n714655n118847m651845m382670m410862m742206n323290n840838
856.6E32351077n450249k827346K302110P973969J2026608J4215052J4977872J4120579
873E89689672J1503816P715404L617763l01480l696323o170213p552802q011937p863343
891.3E78930557p372856o760717o181001n816102n899430o460130p434070q752167
907.6E24254084j0088921j1168718j1984885j2374818j1927843j0355324p812023m977614
923.9D43563938k612471r86606K22712J492709K902568M219860N261629N946100N904466
942.3D65914905M220218M63902m436641r162546j2953370j5578837j7195701j8159688
$$ y = [617668867, 616252899, 613781095, 610075593, 605189323, 599312663, 592699409, 585752428, 578910291, 572536290, 566821635, 561702788, 557050943, 552668273, 548257411, 543515205, 538191915, 532351077, 526900828, 524073482, 526375592, 534349561, 546376169, 560591221, 575569093, 589689672, 601193488, 608908892, 612526655, 612225175, 608528852, 602358639, 594805837, 586793900, 578930557, 571557701, 564796984, 558615983, 552799881, 546900451, 540440321, 533006251, 524254084, 514165163, 502996445, 491011560, 478636742, 466708899, 456353575, 448541552, 443563938, 440951467, 439964861, 440187573, 441680282, 444582850, 448802710, 454064339, 460010439, 465914905, 470135123, 470599025, 466162384, 456999838, 444046468, 428467631, 411271930, 393112242]
958.6C93112242j8825978j9407421j9925773k0315320k0499348k0421535k0087987
972.9B53628880j9448206j8323571j6607403j4302075j1589036q816376o291032m186481
989.2A54064700k478793j137063j49310N37366R42990J047343Q77693M92752J3977
1007.6A54211655l89963o25238n33819p0036N60716J188934J800567K365783K851844
1025.9A61360443L211110L365189L290519K934441K295316J509145Q42914N38408O47456
1044.3A79994941R88438J455412K229020L427148M840359O178915P398859Q631810
1060.6B15144902R921089J0518343Q742108L400580m131005r954393j1082842q257464
1076.9B14301318m338324j092672J261785K923459M061609M936472N678058O085708
$$ y = [393112242, 374286264, 354878843, 334953070, 314637750, 294138402, 273716867, 253628880, 234180674, 215857103, 199249700, 184947625, 173358589, 164542213, 158251181, 154064700, 151585907, 150448844, 150299534, 150836900, 151779890, 152827233, 153704926, 154197678, 154211655, 153821692, 153196454, 152662635, 152592599, 153153315, 154342249, 156142816, 158508599, 161360443, 164571553, 167936742, 171227261, 174161702, 176457018, 177966163, 178809077, 179347485, 179994941, 180983379, 182438791, 184667811, 188094959, 192935318, 199114233, 206513092, 215144902, 225065991, 235584334, 244326442, 247727022, 243596017, 233641624, 222558782, 214301318, 209962994, 208870322, 210132107, 213055566, 217117175, 222053647, 227731705, 233817413]
1093.2B33817413N878434M953221L513246K002225J018881J001120J899421L159106
1109.6B57243067M150867M579366M429280L816605K982557K271771J975358K331555
1125.9B83780426L340393M535109N062729M191041J836509j454175m810363p379919
1142.2B89101750q676499q789301q071095o815821n243748l549263j887158l15770
1158.5B45753095J222819K897158M834086O996989R173214J1144549J2792200J4006853
1174.8C08820963J4709711J5042275J5157312J4959783J4278680J3037324J1268377
1189.1D07274425R132147O947875N018681L541500K581536K102316K095014K559274
1205.4D41252768L385663M343569N233169N885094O136150N863010M963905L502458
$$ y = [233817413, 239695847, 244649068, 248162314, 250164539, 251183420, 252184540, 254083961, 257243067, 261393934, 265973300, 270402580, 274219185, 277201742, 279473513, 281448871, 283780426, 287120819, 291655928, 296718657, 300909698, 302746207, 301292032, 296481669, 289101750, 280425251, 271635950, 263564855, 256749034, 251505286, 247956023, 246068865, 245753095, 246975914, 249873072, 254707158, 261704147, 270877361, 282021910, 294814110, 308820963, 323530674, 338572949, 353730261, 368690044, 382968724, 396006048, 407274425, 416406572, 423354447, 428373128, 431914628, 434496164, 436598480, 438693494, 441252768, 444638431, 448982000, 454215169, 460100263, 466236413, 472099423, 477063328, 480565786]
1221.7D80565786J812190K65479r04202j609832j931310k048552k065837j947850j601965
1240.1D70533907r29504l547R37641J702845K213091K484679K508730K233147J716703
1258.4D83397692J218766J076758J439542K100140K654224K708018K130270J224011
1274.8D97949421L62277l24100p98017j034259j133204j237243j364112j483381j676738
1293.1D89260644j994312k296716k446383k422929k298355k226353k228349k073467
1309.4D71273780j694888j355261j216828j266122j560390k191067l210813m532605
1325.8D54245806n766750o437063o311953n502283m277409k889007j564085m59552
1342.1D21037704K95281O28859N40346J64628k65598o59705r95427j197934j287282
$$ y = [480565786, 482377976, 482643455, 481739253, 480129421, 478198111, 476149559, 474083722, 472135872, 470533907, 469604403, 469600856, 470538497, 472241342, 474454433, 476939112, 479447842, 481680989, 483397692, 484616458, 485693216, 487132758, 489232898, 491887122, 494595140, 496725410, 497949421, 498311698, 497987598, 497189581, 496155322, 495022118, 493784875, 492420763, 490937382, 489260644, 487266332, 484969616, 482523233, 480100304, 477801949, 475575596, 473347247, 471273780, 469578892, 468223631, 467006803, 465740681, 464180291, 461989224, 458778411, 454245806, 448479056, 442041993, 435730040, 430227757, 425950348, 423061341, 421497256, 421037704, 421332985, 421961844, 422502190, 422666818, 422401220, 421741515, 420746088, 419548154, 418260872]
1360.4D18260872j392632j307667r78797o46681j76072M38839Q65072Q96007R03666
1378.8D16862607J148880J773923K977401M494876M928917L943502K808661J513213
1395.1D40451980N5939j022160j476884j600087j922697k195805k260626k277195k029926
1413.5D25722539j486271j097620r59992n03063J65701O86943J180470J639605J834422
1431.8D27182734J930684K319664K472102K107442K033621J850456J302719M13746
1448.1D41613168n07921r57787j042754j611412k243697r09418Q53240K689928M303754
1466.5D42187101N384415P480502J1114568J2076169J0472864R521723R110480Q668721
1482.8E16016543P849336P664144P955312P225514N453169M981280N491673M936517
$$ y = [418260872, 416868240, 415560573, 414581776, 413935095, 413759023, 414197862, 415062934, 415958941, 416862607, 418011487, 419785410, 422762811, 427257687, 432186604, 436130106, 438938767, 440451980, 440507919, 439485759, 438008875, 436408788, 434486091, 432290286, 430029660, 427752465, 425722539, 424236268, 423138648, 422178656, 421675593, 421841294, 422528237, 423708707, 425348312, 427182734, 429113418, 431433082, 433905184, 436012626, 438046247, 439896703, 441199422, 441613168, 441105247, 440147460, 439104706, 437493294, 435249597, 434340179, 435193419, 437883347, 442187101, 447571516, 455052018, 466166586, 478242755, 488715619, 498237342, 507347822, 516016543, 523865879, 531530023, 539485335, 546710849, 552164018, 557145298, 562636971, 567573488]
1499.1E67573488L989756L634989M256129M767597K813995J919985K305269K685547
1515.4E93946755K745628K415061K256573J819372J470327J348257J028717J000106
1531.8F08030796R04322O88016R89139J197100q1897r12189q07345m95255l00110l35991
1552.2F08876586l52204j91927m28378j703561j442671q76307o87599o50049q43524
1570.5F01700366o44923k00450m39167j014710r74834q21828p45476q33749j107157
1588.9E94918072j488566j758337j971424k187550k379000k696455l123104l464043
1605.2E75849593l702164m045069m214287m060149m536271n659104m804671l892958
1621.5E40934920m419565m589856m479169m367233l390372k497911k753139k674996
$$ y = [567573488, 571563244, 575198233, 579454362, 584221959, 587035954, 588955939, 591261208, 593946755, 596692383, 599107444, 601364017, 603183389, 604653716, 606001973, 607030690, 608030796, 608935118, 609623134, 610612273, 611809373, 611727476, 610815287, 610007942, 609512687, 609212577, 608876586, 608524382, 608332455, 607904077, 606200516, 604757845, 603881538, 603193939, 602543890, 601700366, 601055443, 600854993, 600415826, 599401116, 598426282, 597604454, 596858978, 596025229, 594918072, 593429506, 591671169, 589699745, 587512195, 585133195, 582436740, 579313636, 575849593, 572147429, 568102360, 563888073, 559827924, 555291653, 549632549, 544827878, 540934920, 536515355, 531925499, 527446330, 523079097, 519688725, 517190814, 514437675, 511762679]
1637.8E11762679j730204r41396j27554P83742J281082J316131K269566L355264K526045
1656.2E20495355K742767L898859M965544N068600M598737N505860O587744N827129
1672.5E59690595N987346O439030N655885N461871O622434Q256078O377399M862010
1688.8F09352648N095065M879296N482912N803287M923165M582047L386974K986551
1705.1F46491945L270507K994656K905011K975285K999902K577484J149535N21660
1721.5F65885985J147628K063930K665937L071248L230036L570556K954126J993000
1737.8F86582446K300084K718150K865672L117443L348767L531635L410638L128290
1754.1G11003125L356278L393352K885639K540112K093255K022684K318382K343715
$$ y = [511762679, 510032475, 509091079, 508963525, 509747267, 511028349, 512344480, 514614046, 517969310, 520495355, 523238122, 527136981, 532102525, 537171125, 541769862, 547275722, 553863466, 559690595, 565677941, 572116971, 577772856, 583234727, 589857161, 598113239, 604490638, 609352648, 614447713, 619327009, 624809921, 630613208, 635536373, 640118420, 643505394, 646491945, 649762452, 652757108, 655662119, 658637404, 661637306, 664214790, 665364325, 665885985, 667033613, 669097543, 671763480, 674834728, 678064764, 681635320, 684589446, 686582446, 688882530, 691600680, 694466352, 697583795, 700932562, 704464197, 707874835, 711003125, 714359403, 717752755, 720638394, 723178506, 725271761, 727294445, 729612827, 731956542]
1770.4G31956542J999676J269519R61900J331508J677096J534521J188517R47058J028896
1788.8G43895233J471996J698911J221121Q74280Q75175R22800R94026J120150J170695
1807.1G54244387J030684P87854O49750Q31902J070917J036882Q04961O88076P54237
1825.5G61899650R24051J055598P15733L05176K79009M25041O11364Q18432Q30412
1843.8G67864466L54886m4406N9367L62694N19454M42326K30730J02580K17258N00203
1864.2G70609558O97374N51999Q2433q3029K30789N37932N87105M27843K57194K88069
1884.6G74187267N09023P08521O18279L36766J70410J48058K51472M01377L81291J99855
1905G77912319Q1360R9063J61350K31445K96175K58386J16408Q2016K02656K58565
$$ y = [731956542, 733956218, 735225737, 736187637, 737519145, 739196241, 740730762, 741919279, 742866337, 743895233, 745367229, 747066140, 748287261, 749161541, 750036716, 750959516, 751953542, 753073692, 754244387, 755275071, 756062925, 756712675, 757544577, 758615494, 759652376, 760457337, 761145413, 761899650, 762823701, 763879299, 764595032, 764900208, 765179217, 765604258, 766215622, 767034054, 767864466, 768219352, 768174946, 768234313, 768597007, 769116461, 769558787, 769789517, 769892097, 770109355, 770609558, 771306932, 771858931, 771941364, 771858335, 772089124, 772627056, 773214161, 773642004, 773899198, 774187267, 774696290, 775404811, 776023090, 776359856, 776530266, 776678324, 776929796, 777331173, 777712464, 777912319, 777993679, 778092742, 778254092, 778485537, 778781712, 779040098, 779156506, 779238522, 779441178, 779699743]
1925.4G79699743K09689J06871K5988Q1598K09153K99752L13759K42650R9302N3107
1945.8G81341612J69814L14534L28064K22444J57297J85489L01958M01854L60370K09987
1966.2G83993423R0182J01149K19762K91407K14160R5725N1021R8348J80245K30252
1986.6G85565674J74761M9889n9962o1333P3254J55985M4048j45614k07305j71423
2007G85417974j35362j47402k68937m19259m73320m76420n17309o32107p00474m97222
2027.4G81150162k83181k90633l29256l88264m94361n24640m59612l68237k87474k53200
2047.8G77471304k56836k47062j60455k9743M6670N3525M8280P0155O9260P9811J29282
2070.2G77274191J25885K9207n7400j6331J01208J49966J25289J06156R2983J18673
$$ y = [779699743, 779909432, 780016303, 780042291, 780123889, 780333042, 780632794, 780946553, 781189203, 781288505, 781341612, 781511426, 781825960, 782154024, 782376468, 782533765, 782719254, 783021212, 783423066, 783783436, 783993423, 784083605, 784184754, 784404516, 784695923, 784910083, 785005808, 785056829, 785155177, 785335422, 785565674, 785740435, 785790324, 785730362, 785669029, 785742283, 785898268, 785942316, 785796702, 785589397, 785417974, 785282612, 785135210, 784866273, 784447014, 783973694, 783497274, 782979965, 782347858, 781647384, 781150162, 780866981, 780576348, 780247092, 779858828, 779364467, 778839827, 778380215, 778011978, 777724504, 777471304, 777214468, 776967406, 776806951, 776777208, 776823878, 776877403, 776925683, 776995838, 777065098, 777144909, 777274191, 777400076, 777429283, 777371883, 777355552, 777456760, 777606726, 777732015, 777838171, 777931154, 778049827]
2090.6G78049827J91211K54751K35974J54317J33514J78456K25366K52187K30610J50800
2111G80057013Q7678Q3209J09851J27852R8348L6656J908J7643N4896O9260M3810J1861
2135.5G80799985L040M0233J07765J27852P5460L4987N9665R7334J38164J94728K30074
2157.9G81909287K42829K96951M07278M85957M82619M87685N55098O05643O15775O41644
2178.3G86730766O72818O27219N60582N67794N76615N49495N29409N17189N12243N13792
2198.7G92357922N18024N33640N46813N27859M75287M69387N41627N89490N54085M76062
2219.1G97590196M24922M21524M32431M16696L87550L74317L62933L48329L46661L59535
2239.5H01465094L32296K82049K62618K68162K81155K85446K57433K24530K58983L20732
$$ y = [778049827, 778241038, 778495789, 778731763, 778886080, 779019594, 779198050, 779423416, 779675603, 779906213, 780057013, 780144691, 780227900, 780337751, 780465603, 780563951, 780600607, 780602515, 780620158, 780675054, 780744314, 780788124, 780799985, 780803025, 780843258, 780951023, 781078875, 781154335, 781189322, 781248987, 781346321, 781484485, 781679213, 781909287, 782152116, 782449067, 782856345, 783342302, 783824921, 784312606, 784867704, 785473347, 786089122, 786730766, 787403584, 788030803, 788591385, 789159179, 789735794, 790285289, 790814698, 791331887, 791844130, 792357922, 792875946, 793409586, 793956399, 794484258, 794959545, 795428932, 795970559, 796560049, 797114134, 797590196, 798015118, 798436642, 798869073, 799285769, 799673319, 800047636, 800410569, 800758898, 801105559, 801465094, 801797390, 802079439, 802342057, 802610219, 802891374, 803176820, 803434253, 803658783, 803917766, 804238498]
2259.9H04238498L29197K84671K48373K84612L42548L44634L07083K66254K35975K25663
2280.3H07107508K51055K86400K74897K41339J91927J63674J93835K08378J96456J61469
2300.7H09276938J09017J06514J58369J95206K02179J47223O1572J10209K29418K10345
2321.1H10806990Q0049P987L5047J29700J21832p4387k02179j88350j26183m6492l1889
2343.5H10512125k25484n26011n28991j24753L49105M37677K51412M6134j52409l28422
2363.9H09710383l89695l79860l98815m31657m07636l57151l33667l32653l45290l12567
2384.3H06021392k48253k16246k08497k24352k65359k63811k38597k61903k83599l01420
2404.7H03509355l57628m11809m29690m36723m68790n08309n06759n14566n78821o20961
$$ y = [804238498, 804567695, 804852366, 805100739, 805385351, 805727899, 806072533, 806379616, 806645870, 806881845, 807107508, 807358563, 807644963, 807919860, 808161199, 808353126, 808516800, 808710635, 808919013, 809115469, 809276938, 809385955, 809492469, 809650838, 809846044, 810048223, 810195446, 810257018, 810367227, 810596645, 810806990, 810887039, 810895026, 810930073, 811059773, 811181605, 811107218, 810905039, 810716689, 810590506, 810544014, 810512125, 810286641, 809760630, 809231639, 809106886, 809455991, 809893668, 810145080, 810191214, 810038805, 809710383, 809320688, 808940828, 808542013, 808110356, 807702720, 807345569, 807011902, 806679249, 806333959, 806021392, 805773139, 805556893, 805348396, 805124044, 804858685, 804594874, 804356277, 804094374, 803810775, 803509355, 803151727, 802739918, 802310228, 801873505, 801404715, 800896406, 800389647, 799875081, 799296260, 798675299]
2425.1G98675299o24061o28531o45220o70076o81817o90937p05719o86407o73116p24077
2445.5G91945338p52628p16030o86109o83785o77585o67394o38663o11067o43134o63162
2465.9G85205781o33657o18755o05166n87583o06000o40810o39558n81801n13196m75168
2486.3G79304087m54545m60029m67598m30822l52323l12806l54707l89278l91245l82721
2506.7G75308013l43502l11553l19839l61204m11093m33981m68314n18918n50568o07729
2527.1G70981312o73056o75797o46949o64473p21335p86185q46565q34286p47979o99163
2547.5G63685524p45713q19147q37505q05914p46310p02083p36833p85231p55966o85334
2567.9G56065488o43730o70731p57933q08895p47025o50942o14524o17087o36279o46770
$$ y = [798675299, 798051238, 797422707, 796777487, 796107411, 795425594, 794734657, 794028938, 793342531, 792669415, 791945338, 791192710, 790476680, 789790571, 789106786, 788429201, 787761807, 787123144, 786512077, 785868943, 785205781, 784572124, 783953369, 783348203, 782760620, 782154620, 781513810, 780874252, 780292451, 779779255, 779304087, 778849542, 778389513, 777921915, 777491093, 777138770, 776825964, 776471257, 776081979, 775690734, 775308013, 774964511, 774652958, 774333119, 773971915, 773560822, 773126841, 772658527, 772139609, 771589041, 770981312, 770308256, 769632459, 768985510, 768321037, 767599702, 766813517, 765966952, 765132666, 764384687, 763685524, 762939811, 762120664, 761283159, 760477245, 759730935, 759028852, 758292019, 757506788, 756750822, 756065488, 755421758, 754751027, 753993094, 753184199, 752437174, 751786232, 751171708, 750554621, 749918342, 749271572]
2588.3G49271572n88239n01573m58002m58836n06878n44250n15402m81546n36799o78241
2608.7G44001806p94411q31425q55386r31204j034736j112044j169861j225411j257003
2627G34790325j286685j343012j415074j478493j485646j450777j428068j426875j439572
2645.4G22036123j467883j493037j472056j410186j358509j349807j391769j418471
2661.7G10674405j350820j292527j323402j322507j253605j210571j186669j129984
2678G00604320j090885j103818j140654j145959j096487j070976j115680j188815j245618
2696.4F90405428j276493j301050j321673j331866j371026j420975j420200j382887
2712.7F79579258j346827j337289j329005j293898j240551j178503j105130j038551
$$ y = [749271572, 748683333, 748181760, 747723758, 747264922, 746758044, 746213794, 745698392, 745216846, 744680047, 744001806, 743207395, 742375970, 741520584, 740589380, 739554644, 738442600, 737272739, 736047328, 734790325, 733503640, 732160628, 730745554, 729267061, 727781415, 726330638, 724902570, 723475695, 722036123, 720568240, 719075203, 717603147, 716192961, 714834452, 713484645, 712092876, 710674405, 709323585, 708031058, 706707656, 705385149, 704131544, 702920973, 701734304, 700604320, 699513435, 698409617, 697268963, 696123004, 695026517, 693955541, 692839861, 691651046, 690405428, 689128935, 687827885, 686506212, 685174346, 683803320, 682382345, 680962145, 679579258, 678232431, 676895142, 675566137, 674272239, 673031688, 671853185, 670748055, 669709504]
2729F69709504j013399r99093r64403r33170r31263r34839r31204r32037r08316q54313
2749.4F60307467q11100q23319q49843p92921o97374o60539o93500p39753p56562p82191
2769.8F52700365q23737q67307r32157j023412j111626j152933j173973j251101j381755
2788.2F42982364j501561j578927j626968j694441j792550j880586j977026k085448
2804.5F28844857k165854k234697k316654k425968k534509k592325k638698k722919
2820.8F09213233k821922k930045l048063l137707l213644l288508l394186l573239
2837.1E83805919l757358l933966m145622m370213m543304m540682m290521l905535
2853.4E50318718l586590l478885l626227l972054m453540n031526n629420o130278
$$ y = [669709504, 668696105, 667697012, 666732609, 665799439, 664868176, 663933337, 663002133, 662070096, 661161780, 660307467, 659496367, 658673048, 657823205, 657030284, 656332910, 655672371, 654978871, 654239118, 653482556, 652700365, 651876628, 651009321, 650077164, 649053752, 647942126, 646789193, 645615220, 644364119, 642982364, 641480803, 639901876, 638274908, 636580467, 634787917, 632907331, 630930305, 628844857, 626679003, 624444306, 622127652, 619701684, 617167175, 614574850, 611936152, 609213233, 606391311, 603461266, 600413203, 597275496, 594061852, 590773344, 587379158, 583805919, 580048561, 576114595, 571968973, 567598760, 563055456, 558514774, 554224253, 550318718, 546732128, 543253243, 539627016, 535654962, 531201422, 526169896, 520540476, 514410198]
2869.7E14410198o465972o653547o677896o475359n987346n232930m347146l457993
2886.1D69112009k606273j848757j283050r45925q08478q03530q85993j071185j332075
2904.4D57526743j654207k054423k530545l095180l692359m154056m348010m302412
2920.7D31695551m067868l587812k818972j851917p42584N53429J981407L362447M517138
2939.1D29040819N396992O037414O468624O715626O835610O907820O925315O873399
2955.4D81201619O770432O585956O289392N863488N355418M927754M646182M443407
2971.7E26083648M323602M322946M402816M413605M218400L882527L537714L231228
2988E58416486K951801K606093K180517J802027J462281J093567P14898L10361j10984
$$ y = [514410198, 507944226, 501290679, 494612783, 488137424, 482150078, 476917148, 472570002, 469112009, 466505736, 464656979, 463373929, 462428004, 461619526, 460815996, 459930003, 458858818, 457526743, 455872536, 453818113, 451287568, 448192388, 444500029, 440345973, 435997963, 431695551, 427627683, 424039871, 421220899, 419368982, 418626398, 419179827, 421161234, 424523681, 429040819, 434437811, 440475225, 446943849, 453659475, 460495085, 467402905, 474328220, 481201619, 487972051, 494558007, 500847399, 506710887, 512066305, 516994059, 521640241, 526083648, 530407250, 534730196, 539133012, 543546617, 547765017, 551647544, 555185258, 558416486, 561368287, 563974380, 566154897, 567956924, 569419205, 570512772, 571227670, 571538031, 571427047]
3006.4E71427047m61876p32124j028299j379431j699388j957357k178073k338886k453208
3024.7E57198405k586126k715707k781451k833604k994657l153205l136516l126919
3041.1E33870220l266275l401935l425300l388047l398061l447890l470719l482342
3057.4E06589651l476322l436058l397107l381730l430038l533036l563762l452450
3073.7D78919148l285944l252894l381133l448695l438145l459125l436029l396035
3090D51821148l409206l391356l298670l185093l187031l310650l316880l169089l112853
3108.4D22440320l215581l191858k970189k889604l023952l189534l261119l172457
3124.7C97526026l033221k951622k919912k951712k931386k766818k689540k839685
$$ y = [571427047, 570965171, 570233047, 569204748, 567825317, 566125929, 564168572, 561990499, 559651613, 557198405, 554612279, 551896572, 549115121, 546281517, 543286860, 540133655, 536997139, 533870220, 530603945, 527202010, 523776710, 520388663, 516990602, 513542712, 510071993, 506589651, 503113329, 499677271, 496280164, 492898434, 489468396, 485935360, 482371598, 478919148, 475633204, 472380310, 468999177, 465550482, 462112337, 458653212, 455217183, 451821148, 448411942, 445020586, 441721916, 438536823, 435349792, 432039142, 428722262, 425553173, 422440320, 419224739, 416032881, 413062692, 410173088, 407149136, 403959602, 400698483, 397526026, 394492805, 391541183, 388621271, 385669559, 382738173, 379971355, 377281815, 374442130]
3141C74442130k937495k808780k654135k555490k491176k576381k703339k671331k571136
3159.4C50472867k485126k435714k429187k395392k352833k335191k297342k230048
3175.7C31512034k191693k149760k092541k083450k085507k046615j979768j928926
3192C14953774j912743j898080j886159j868308j786828j724720j725167j701802j664847
3210.3B98785120j625985j584172j562029j527876j469314j444191j445025j407623
3226.7B86718905j341999j254648j203030j311362j432001j394093j305223j197338
3243B76279211j053780j038969j160830j176328j063376r90331j015604j052618j002073
3261.3B66725302r17822q93742q49962p37250p51347q91864r68814r69231r05186q20875
$$ y = [374442130, 371504635, 368695855, 366041720, 363486230, 360995054, 358418673, 355715334, 353044003, 350472867, 347987741, 345552027, 343122840, 340727448, 338374615, 336039424, 333742082, 331512034, 329320341, 327170581, 325078040, 322994590, 320909083, 318862468, 316882700, 314953774, 313041031, 311142951, 309256792, 307388484, 305601656, 303876936, 302151769, 300449967, 298785120, 297159135, 295574963, 294012934, 292485058, 291015744, 289571553, 288126528, 286718905, 285376906, 284122258, 282919228, 281607866, 280175865, 278781772, 277476549, 276279211, 275225431, 274186462, 273025632, 271849304, 270785928, 269795597, 268779993, 267727375, 266725302, 265807480, 264913738, 264063776, 263326526, 262575179, 261683315, 260714501, 259745270, 258840084, 258019209]
3281.7B58019209p71582p34151p05123o55084o18786o83516q13693r01312q31514o43850
3302.1B50660598n29796o25968q58977j004264r82076r03725q57219q11696p47577
3320.5B43339300p12156p68364r18462j007423r30578q16569p54222p13661p61539
3338.8B35956326q67948q69736q21486p78973p12708p84978r81167j024574q59901
3357.2B28254855o92696p20426p95677o46756n38438p53120j013621r98333p81015
3375.5B21314773o28755o02617o61180o64294n15535k85775j05887k60368n99116n54338
3395.9B16436908j93149p6860l89815o61537m83244k08185j36748j78575k99841l41743
3416.3B13467211k02895j11192j24023m038K27571L08543J85535J99154L48165K08229
$$ y = [258019209, 257247627, 256513476, 255808353, 255153269, 254534483, 253850967, 253037274, 252135962, 251304448, 250660598, 250130802, 249504834, 248645857, 247641593, 246659517, 245755792, 244898573, 244086877, 243339300, 242627144, 241858780, 240940318, 239932895, 239002317, 238185748, 237431526, 236717865, 235956326, 235088378, 234218642, 233397156, 232618183, 231905475, 231120497, 230139330, 229114756, 228254855, 227562159, 226841733, 226046056, 225399300, 224860862, 224107742, 223094121, 222095788, 221314773, 220686018, 220083401, 219422221, 218757927, 218242392, 217956617, 217850730, 217590362, 216991246, 216436908, 216243759, 216166899, 215777084, 215115547, 214632303, 214424118, 214287370, 214108795, 213808954, 213467211, 213264316, 213153124, 213029101, 213025063, 213252634, 213561177, 213746712, 213945866, 214294031, 214502260]
3436.7B14502260o7592m7475J94744L86163M03315L36364L74898M47989M96536O06954
3457.1B17634156P11322O36324O19621Q77678R96798O98969L48166L73602O37203R21801
3477.5B24455640R78887O85334N89699Q40634Q79302P56815Q67382J032174J028537
3495.9B32114404R15036R17032R85519Q61480P47606Q47176J048774J219928J114115
3514.2B40771070Q82194R44092J205057J372919J198724Q87230Q65847J074850J303435
3532.6B50505418J456201J374006J234502J429796J675516J562089J264006J289725
3548.9B61791259J503766J602530J714826J882285K047658K115637K038717K029687
3565.2B76726365K310425K518535K467185K480894K635181K808869L012717L208727
$$ y = [214502260, 214434668, 214387193, 214581937, 214968100, 215371415, 215707779, 216082677, 216530666, 217027202, 217634156, 218345478, 218981802, 219601423, 220479101, 221475899, 222174868, 222523034, 222896636, 223533839, 224455640, 225434527, 226119861, 226709560, 227550194, 228429496, 229186311, 230053693, 231085867, 232114404, 233029440, 233946472, 234931991, 235793471, 236541077, 237388253, 238437027, 239656955, 240771070, 241653264, 242597356, 243802413, 245175332, 246374056, 247261286, 248127133, 249201983, 250505418, 251961619, 253335625, 254570127, 255999923, 257675439, 259237528, 260501534, 261791259, 263295025, 264897555, 266612381, 268494666, 270542324, 272657961, 274696678, 276726365, 279036790, 281555325, 284022510, 286503404, 289138585, 291947454, 294960171, 298168898]
3581.5B98168898L268063L187358L135592L259837L336013L447026L648311L792077
3597.9C25243175L798813L759205L744066L773749M023730M221887M233122M258543
3614.2C57056290M140228M204661M504799M287124L935099L889054M400939M860580
3630.5C91278774M417419M198194M243254M257053M319191M326016M231632M379868
3646.8D25651401M965574M893273M017174L863096M482329M545093M043102L780604
3663.1D60241646L792435L833919M013241M024624L565520L643275L764093L293097
3679.4D90171850L147006L263831L352195L489941L278375K655387K421021K497077
3695.8E14276683K481938K417803K488076K487540K325535K235473K251684K224684
$$ y = [298168898, 301436961, 304624319, 307759911, 311019748, 314355761, 317802787, 321451098, 325243175, 329041988, 332801193, 336545259, 340319008, 344342738, 348564625, 352797747, 357056290, 361196518, 365401179, 369905978, 374193102, 378128201, 382017255, 386418194, 391278774, 395696193, 399894387, 404137641, 408394694, 412713885, 417039901, 421271533, 425651401, 430616975, 435510248, 439527422, 443390518, 447872847, 452417940, 456461042, 460241646, 464034081, 467868000, 471881241, 475905865, 479471385, 483114660, 486878753, 490171850, 493318856, 496582687, 499934882, 503424823, 506703198, 509358585, 511779606, 514276683, 516758621, 519176424, 521664500, 524152040, 526477575, 528713048, 530964732, 533189416]
3712.1E33189416K066255J876711J865387J924396J873434J773238J721859J738548
3728.4E48029244J821697K032041K076090J766264J397431J138449J047909J413524
3744.7E60722649J665473J360476J336277J427829J343667J305700J325905J310766
3761E71798742J234412J278460J336515J251459J150608J076520J150190J330555J306295
3779.4E82913756J053393Q68976R42707J084447J118720J080275J018166J093686J145363
3797.7E92319489J004993J044691R80258P12097P72536Q55326Q29518Q93533J107157
3816.1F00519598J139819R21607Q70049P05123O20067P43091Q36254R53435R90630
3834.4F08299673Q53419P12573O14524O04987O75917O34253N72801N68092O94930R04262
$$ y = [533189416, 535255671, 537132382, 538997769, 540922165, 542795599, 544568837, 546290696, 548029244, 549850941, 551882982, 553959072, 555725336, 557122767, 558261216, 559309125, 560722649, 562388122, 563748598, 565084875, 566512704, 567856371, 569162071, 570487976, 571798742, 573033154, 574311614, 575648129, 576899588, 578050196, 579126716, 580276906, 581607461, 582913756, 583967149, 584836125, 585778832, 586863279, 587981999, 589062274, 590080440, 591174126, 592319489, 593324482, 594369173, 595349431, 596061528, 596834064, 597689390, 598518908, 599412441, 600519598, 601659417, 602581024, 603451073, 604156196, 604776263, 605519354, 606355608, 607309043, 608299673, 609153092, 609865665, 610480189, 611085176, 611761093, 612395346, 612968147, 613536239, 614231169, 615135431]
3854.8F15135431P19965N31673N94259O71744O33716N58436O36161P65383O28352M98116
3875.2F21373236M46141N79059P97629O53208N26964M70877L62277M65810N06938L76940
3895.6F26559079M11391N45263N51343M58420L43203K72632L09825L47614L42488L91424
3916F30532682M43041L89695K88248K81811L52919L58999L65079M44829L65555J88172
3936.4F34011030J79112K64883L56019L97861L75628L12865K19822K07007K82168L39866
3956.8F36946261L16799K46465K16365K65777L34561L36110K83897K42472K29299J76907
3977.2F39594913J85251L45051L29018J67429J60456K21968K91049K92897K14279K17378
3997.6F42019689
$$ y = [615135431, 615855396, 616387069, 616981328, 617653072, 618286788, 618845224, 619481385, 620246768, 620875120, 621373236, 621819377, 622398436, 623196065, 623849273, 624376237, 624847114, 625209391, 625675201, 626182139, 626559079, 626970470, 627515733, 628067076, 628525496, 628868699, 629141331, 629451156, 629798770, 630141258, 630532682, 630975723, 631365418, 631653666, 631935477, 632288396, 632647395, 633012474, 633457303, 633822858, 634011030, 634190142, 634455025, 634811044, 635208905, 635584533, 635897398, 636117220, 636324227, 636606395, 636946261, 637263060, 637509525, 637725890, 637991667, 638326228, 638662338, 638946235, 639188707, 639418006, 639594913, 639780164, 640125215, 640454233, 640621662, 640782118, 641004086, 641295135, 641588032, 641802311, 642019689]
##END=$$ End of the data block
