##TITLE=$$ Begin of the data block
##JCAMP-DX=5.00 $$ ACD/SpecManager v 10.08
##SPECTROMETER/DATA SYSTEM=Alpha
##DATE=29 Dec 2014 11:22:02
##DATA TYPE=INFRARED SPECTRUM
##DATA CLASS=XYDATA
##ORIGIN=
##OWNER=
##NPOINTS=1765
##FIRSTX=399.76428223
##LASTX=3997.64306641
##MAXX=3997.64306641
##MINX=399.76428223
##MAXY=0.81431228
##MINY=0.19838156
##XFACTOR=1.0000000000
##YFACTOR=1.000000000000000e-9
##FIRSTY=0.48982003
##DELTAX=2.03961372
##XUNITS=1/CM
##YUNITS=ARBITRARY UNITS
##XYDATA=(X++(Y..Y))
$$ plain form
399.8 489820033 485031098 479929060 475217044 472950637 474110574 477928966 481824487 483484477
416.1 483484477 483035892 481599808 480152041 478328913 475331426 471301705 467007458 463555783 461453646
434.4 461453646 460464656 460514814 461835116 465157241 470685720 476925313 481684327 483805150 483871281
452.8 483871281 483394772 483553320 483768612 482348174 478955925 474773705 471231848 468669266 465903521
471.2 465903521 461828917 457505882 454527289 453334063 453360319 453513771 453124046 452328742 451709628
489.5 451709628 451501399 451053143 449527532 446791649 443629384 440893143 438816071 436811060 433679253
507.9 433679253 429237187 424636126 420736462 417191923 413200408 408779383 404667526 401793838
524.2 401793838 400827408 401308179 402050257 402788162 404441476 408138335 414020389 420836806 426781178
$$ packed form
399.8D89820033m788935n102038m712016k266407J159937L818392L895521J659990
416.1D83484477m48585j436084j447767j823128k997487m029721m294247l451675k102137
434.4D61453646r88990N0158J320302L322125N528479O239593M759014K120823O6131
452.8D83871281m76509J58548K15292j420438l392249m182220l541857k562582k765745
471.2D65903521m074604m323035k978593j193226K6256J53452l89725p95304o19114
489.5D51709628k08229m48256j525611k735883l162265k736241k077072k005011l131807
507.9D33679253m442066m601061l899664l544539l991515m421025m111857k873688
524.2D01793838r66430M80771P42078P37905J653314L696859N882054O816417N944372
$$ plain form
542.5 426781178 430542916 431953967 431955159 431503057 430460781 428095192 424349934 419875622 415199578
560.9 415199578 410267234 404614300 397788495 390251845 383706599 379909098 379586101 382184595 386720657
579.3 386720657 392794192 400179774 408205867 415696442 421410799 424826503 426235050 426594824 426809311
597.6 426809311 427044898 426975042 426440507 425890654 425945461 426835120 428312182 429979533 431799442 434196562
618 434196562 437617213 441970855 446522743 450408578 453440785 456032753 458607495 461223155 463464260
636.4 463464260 464932412 465854466 466835886 468259007 470008582 471659750 472839981 473602384 474553794
654.7 474553794 476148248 478057235 479565442 480427980 480929524 481728822 483695030 485870183 487524062
673.1 487524062 488833427 490053803 491696149 493851006 495868981 497108519 497534931 497572333 497629911
$$ packed form
542.5D26781178L761738J411051J192m52102j042276k365589l745258m474312m676044
560.9D15199578m932344n652934o825805p536650o545246l797501l22997K598494M536062
579.3C86720657O073535P385582Q026093P490575N714357L415704J408547L59774K14487
597.6D26809311K35587o9856n34535n49853N4807Q89659J477062J667351J819909K397120
618D34196562L420651M353642M551888L885835L032207K591968K574742K615660K241105
636.4D63464260J468152R22054R81420J423121J749575J651168J180231P62403R51410
654.7D74553794J594454J908987J508207Q62538N01544P99298J966208K175153J653879
673.1D87524062J309365J220376J642346K154857K017975J239538M26412L7402N7578
$$ plain form
691.4 497629911 497518390 496551424 494227052 490774781 487103790 484115660 482108593 481038272 480966389
709.8 480966389 482112348 484767914 489025295 494463652 500387013 506320715 512287021 518530607
726.1 518530607 524960041 530964494 535806835 539375842 542240500 544887006 547251344 548664033
742.4 548664033 548394203 546339810 543091416 539317727 535178006 530384183 524849772 519170702 514415801
760.8 514415801 511392117 510202348 510699451 513016045 517468274 524222672 533124208 543363631
777.1 543363631 553462684 562326372 570033371 577205658 584046006 590130925 594880044 598553538
793.4 598553538 602294087 606975973 612451792 617690980 621663094 624248266 626243234 628338099
809.7 628338099 630264401 631272435 631242871 630851686 630892634 631380379 631388426 629886866 626530349 621924102
$$ packed form
691.4D97629911j11521r66966k324372l452271l670991k988130k007067j070321p1883
709.8D80966389J145959K655566M257381N438357N923361N933702N966306O243586
726.1E18530607O429434O004453M842341L569007K864658K646506K364338J412689
742.4E48664033k69830k054393l248394l773689m139721m793823n534411n679070m754901
760.8E14415801l023684j189769M97103K316594M452229O754398Q901536J0239423
777.1E43363631J0099053Q863688P706999P172287O840348O084919M749119L673494
793.4E98553538L740549M681886N475819N239188L972114K585172J994968K094865
809.7F28338099J926302J008034k9564l91185M0948M87745Q047j501560l356517m606247
$$ plain form
830.1 621924102 617021978 612136006 606831968 600817442 594517052 588729322 583895206 579763114
846.4 579763114 575523317 570382297 564300478 557851076 551485956 545830190 542661369 544187665
862.8 544187665 551092863 562308550 576313198 591339111 605090678 615746915 622881651 626920223
879.1 626920223 628051162 626047313 620957255 613698065 605862200 598731577 592530727 586663246
895.4 586663246 580503702 574026465 567699969 561554968 554773808 546459496 536339879 524856150
911.7 524856150 512860358 501155257 490294367 480794996 473337770 468439788 466053098 465609550
928 465609550 466388822 467950463 470216930 473366439 477743328 483384877 489304155 493396133 493511230
946.4 493511230 488812387 479911149 467790931 453117907 436548948 418923110 400928855 382843524
$$ packed form
830.1F21924102m902124m885972n304038o014526o300390n787730m834116m132092
846.4E79763114m239797n141020o081819o449402o365120n655766l168821J526296
862.8E44187665O905198J1215687J4004648J5025913J3751567J0656237P134736M038572
879.1F26920223J130939k003849n090058p259190p835865p130623o200850n867481
895.4E86663246o159544o477237o326496o145001o781160q314312j0119617j1483729
911.7E24856150j1995792j1705101j0860890r499371p457226m897982k386690m43548
928D65609550P79272J561641K266467L149509M376889N641549N919278M091978J15097
946.4D93511230m698843q901238j2120218j4673024j6568959j7625838j7994255j8085331
$$ plain form
962.7 382843524 364576161 345869154 326646775 307226866 288161755 270016938 253233254
977 253233254 238142520 225149542 214700937 207059652 202130824 199443713 198381558 198408261 199176148
995.3 199176148 200494945 202199861 204041496 205714673 206894189 207419828 207527235 207586735 207849532
1013.7 207849532 208477437 209547520 211110100 213307798 216213375 219657287 223318562 226889864
1030 226889864 230219752 233203307 235606819 237197816 237983629 238213003 238344356 238858402 240054131
1048.4 240054131 242168874 245465353 250078321 255924582 262956351 271260351 280742645 290482163
1064.7 290482163 298184246 300705045 296295524 286771357 276483089 268935412 265065759 264271319
1081 264271319 265791327 269015074 273300052 278146863 283433676 289130479 294865191 299868464 303376019
$$ packed form
962.7C82843524j8267363j8707007j9222379j9419909j9065111j8144817j6783684
977B53233254j5090734j2992978j0448605p641285m928828k687111j062155K6703P67887
995.3A99176148J318797J704916J841635J673177J179516N25639J07407N9500K62797
1013.7B07849532O27905J070083J562580K197698K905577L443912L661275L571302
1030B26889864L329888K983555K403512J590997P85813K29374J31353N14046J195729
1048.4B40054131K114743L296479M612968N846261P031769Q304000R482294R739518
1064.7B90482163P702083K520799m409521r524167j0288268p547677l869653p94440
1081B64271319J520008L223747M284978M846811N286813N696803N734712N003273L507555
$$ plain form
1099.4 303376019 305126339 305641294 306081086 307618439 310633600 314589411 318684936 322444201 325777411
1117.7 325777411 328647584 330927074 332674235 334437698 337075412 341148525 346238732 350862831
1134 350862831 353274226 352385730 348205239 341690719 334095836 326294124 318804920 312125772 306768864
1152.4 306768864 303066462 301012039 300356448 300877512 302663356 306147993 311814696 319793552 329776108
1170.7 329776108 341241091 353693366 366812110 380488873 394552350 408465892 421510994
1185 421510994 433160782 443237305 451744556 458635926 463802159 467294216 469571352 471438408
1201.3 471438408 473596036 476307690 479544997 483277649 487653226 492883950 498851508 504887223
1217.7 504887223 509981036 513359129 514982343 515360355 514991879 514057398 512481630 510285378 507849991
$$ packed form
1099.4C03376019J750320N14955M39792J537353L015161L955811M095525L759265L333210
1117.7C25777411K870173K279490J747161J763463K637714M073113N090207M624099
1134C50862831K411395q88496m180491o514520p594883p801712p489204o679148n356908
1152.4C06768864l702402k054423o55591N21064J785844L484637N666703P978856R982556
1170.7C29776108J1464983J2452275J3118744J3676763J4063477J3913542J3045102
1185D21510994J1649788J0076523Q507251O891370N166233L492057K277136J867056
1201.3D71438408K157628K711654L237307L732652M375577N230724N967558O035715
1217.7E04887223N093813L378093J623214L78012l68476r34481j575768k196252k435387
$$ plain form
1236 507849991 505713761 504212856 503400087 503169954 503493905 504522681 506380439 508871078 511428058
1254.4 511428058 513451040 514693797 515407145 516185522 517573476 519703150 522227645 524643481 526668012
1272.7 526668012 528220654 529221058 529516399 528999388 527903736 526760399 525942028 525359571 524537981
1291.1 524537981 523045838 520861685 518340886 515915930 513766468 511724889 509447753 506867707
1307.4 506867707 504506528 502882838 501851916 500894964 499666244 498052806 495962679 493111372
1323.7 493111372 489101112 483813018 477656931 471462995 466076523 461986661 459245175 457602352
1340 457602352 456771731 456570953 456900984 457509726 457960397 457948714 457385272 456439584 455465466 454679132
1360.4 454679132 454037398 453474760 452960789 452568829 452651650 453471422 454823941 456080526 456955791
$$ packed form
1236E07849991k136230j500905q12769k30133L23951J028776J857758K490639K556980
1254.4E11428058K022982J242757P13348P78377J387954K129674K524495K415836K024531
1272.7E26668012J552642J000404K95341n17011j095652j143337q18371n82457q21590
1291.1E24537981j492143k184153k520799k424956k149462k041579k277136k580046
1307.4E06867707k361179j623690j030922r56952j228720j613438k090127k851307
1323.7D93111372m010260n288094o156087o193936n386472m089862k741486j642823
1340D57602352q30621k00778L30031O08742M50671j1683n63442r45688r74118p86334
1360.4D54679132o41734n62638n13971l91960Q2821Q19772J352519J256585Q75265
$$ plain form
1378.8 456955791 457718313 459070802 461870998 466434389 471412241 475139976 477582514 478923649
1395.1 478923649 479148924 478410393 477016240 475176394 472902834 470564842 468359709 466125697 463930607
1413.5 463930607 462010801 460334271 458994836 458473831 458628088 459085256 459761262 460768551 462198049
1431.8 462198049 463940024 465972483 468005359 469625771 471150160 472633809 473754525 474037439
1448.1 474037439 473277628 471851945 470194131 468005747 465594321 464692026 465192884 467045099 470413893
1466.5 470413893 475094348 481823683 491843462 502635062 511836112 520201802 528449893 536643744
1482.8 536643744 544142723 551143467 558161438 564800501 570234358 575360060 580919147 585805357
1499.1 585805357 589675069 593133926 597150564 602159798 605752647 608129561 610477984 613075018
$$ packed form
1378.8D56955791P62522J352489K800196M563391M977852L727735K442538J341135
1395.1D78923649K25275p38531j394153j839846k273560k337992k205133k234012k195090
1413.5D63930607j919806j676530j339435n21005J54257M57168O76006J007289J429498
1431.8D62198049J741975K032459K032876J620412J524389J483649J120716K82914
1448.1D74037439p59811j425683j657814k188384k411426r02295N00858J852215L368794
1466.5D70413893M680455O729335J0019779J0791600R201050Q365690Q248091Q193851
1482.8E36643744P498979P000744P017971O639063N433857N125702N559087M886210
1499.1E85805357L869712L458857M016638N009234L592849K376914K348423K597034
$$ plain form
1515.4 613075018 616007626 618920863 621739388 624057889 625906527 627848089 629847825 631928742
1531.8 631928742 633903146 635416627 636867523 638701141 640037239 640660942 641046584 641293466 641462564
1550.1 641462564 641658366 642036498 642473578 642149448 640402555 639021635 637987077 636955678 635615885
1568.5 635615885 633657753 631783545 629950762 627451837 624977350 622854471 620500386 617884040
1584.8 617884040 615197420 612575233 609969139 607279062 604400754 601377130 598347962 595351517
1601.1 595351517 592402875 589438379 586262107 582684636 579000354 575580776 571856260 567316175
1617.4 567316175 563532054 560323834 556559205 552813172 549348235 546107233 543757260 542208135
1633.7 542208135 540733099 539605200 539215624 539396763 540043235 541159689 542668581 544258118 546603501
$$ packed form
1515.4F13075018K932608K913237K818525K318501J848638J941562J999736K080917
1531.8F31928742J974404J513481J450896J833618J336098O23703L85642K46882J69098
1550.1F41462564J95802L78132M37080l24130j746893j380920j034558j031399j339793
1568.5F35615885j958132j874208j832783k498925k474487k122879k354085k616346
1584.8F17884040k686620k622187k606094k690077k878308l023624l029168k996445
1601.1E95351517k948642k964496l176272l577471l684282l419578l724516m540085
1617.4E67316175l784121l208220l764629l746033l464937l241002k349973j549125
1633.7E42208135j475036j127899l89576J81139O46472J116454J508892J589537K345383
$$ plain form
1652.1 546603501 550051451 552709281 555148363 558244348 562195301 566496968 570451558 574799538
1668.4 574799538 579807341 584395409 589344203 594981909 600171685 605070055 610651910 617597878
1684.7 617597878 623462796 628264308 633217096 637692153 642201722 646820128 650923193 655009568
1701.1 655009568 658098221 660400212 662574351 664595425 666756988 669148088 671614408 674050808
1717.4 674050808 676133573 678017855 680155516 682578921 685027540 687473059 689849973 692463338
1733.7 692463338 695104837 697377682 699805260 702335060 704839170 707593203 710715890 714200079
1750 714200079 717666686 720652580 723521292 726510048 729422748 732291877 734744906 736791551 738797963
1768.4 738797963 740805328 742809176 744584024 745989144 747237086 748483360 749785185 751199603
$$ packed form
1652.1E46603501L447950K657830K439082L095985L950953M301667L954590M347980
1668.4E74799538N007803M588068M948794N637706N189776M898370N581855O945968
1684.7F17597878N864918M801512M952788M475057M509569M618406M103065M086375
1701.1F55009568L088653K301991K174139K021074K161563K391100K466320K436400
1717.4F74050808K082765J884282K137661K423405K448619K445519K376914K613365
1733.7F92463338K641499K272845K427578K529800K504110K754033L122687L484189
1750G14200079L466607K985894K868712K988756K912700K869129K453029K046645K006412
1768.4G38797963K007365K003848J774848J405120J247942J246274J301825J414418
$$ plain form
1784.7 751199603 752646744 753962874 755131781 756235838 757327318 758525908 759794056 760924041
1801 760924041 761835337 762677073 763654292 764805198 765952349 766855657 767550826 768237948 769086182 770082414
1821.4 770082414 771060944 771863759 772457421 773004353 773651421 774381220 775056362 775554359 775897861 776264489
1841.8 776264489 776785254 777359307 777768195 777963579 778073668 778285921 778686941 779192030 779618800 779844701
1862.2 779844701 780014217 780303895 780708075 781124473 781430781 781602383 781757057 782092810 782644331 783266962
1882.6 783266962 783790886 784159184 784452975 784823418 785339475 785847723 786150932 786248803 786314785 786506712
1903 786506712 786859751 787228525 787422001 787419260 787418246 787615597 787991405 788333058 788455367 788428426 788460791
1925.4 788460791 788686275 789040208 789319336 789401829 789372206 789419889 789651394 790014148 790279329 790318787
$$ packed form
1784.7G51199603J447141J316130J168907J104057J091480J198590J268148J129985
1801G60924041R11296Q41736R77219J150906J147151R03308O95169O87122Q48234R96232
1821.4G70082414R78530Q02815N93662N46932O47068P29799O75142M97997L43502L66628
1841.8G76264489N20765N74053M08888J95384J10089K12253M01020N05089M26770K25901
1862.2G79844701J69516K89678M04180M16398L06308J71602J54674L35753N51521O22631
1882.6G83266962N23924L68298K93791L70443N16057N08248L03209R7871O5982J91927
1903G86506712L53039L68774J93476k741j014J97351L75808L41653J22309k6941L2365
1925.4G88460791K25484L53933K79128Q2493k9623M7683K31505L62754K65181L9458
$$ plain form
1945.8 790318787 790285230 790411353 790763319 791178942 791472077 791603088 791695297 791902661 792258263 792631090
1966.2 792631090 792857945 792914152 792946160 793108821 793406904 793705940 793850243 793852329 793875456 794017375
1986.6 794017375 794227123 794385254 794399440 794325948 794312358 794414163 794568121 794620633 794450223 794124842
2007 794124842 793860078 793739140 793632090 793379247 792940915 792404473 791899562 791472137 791092098 790738881
2027.4 790738881 790318131 789806068 789351940 789028466 788733363 788340628 787841678 787357211 787038565 786893427
2047.8 786893427 786781549 786584914 786334634 786163449 786181867 786361635 786535621 786593199 786571205 786566138
2068.2 786566138 786665201 786868930 787009299 786980510 786914587 786962986 787138999 787351906 787478387 787470937 787454247
2090.6 787454247 787599027 787913203 788227618 788416982 788509488 788602591 788801491 789138794 789470673 789591253
$$ packed form
1945.8G90318787l3557J26123L51966M15623K93135J31011R2209K07364L55602L72827
1966.2G92631090K26855N6207L2008J62661K98083K99036J44303K086K3127J41919
1986.6G94017375K09748J58131J4186p3492j3590J01805J53958N2512j70410l25381
2007G94124842k64764j20938j07050k52843m38332n36442n04911m27425l80039l53217
2027.4G90738881m20750n12063m54128l23474k95103l92735m98950m84467l18646j45138
2047.8G86893427j11878j96635k50280j71185J8418J79768J73986N7578k1994n067
2068.2G86566138R9063K03729J40369k8789o5923M8399J76013K12907J26481p450j6690
2090.6G87454247J44780L14176L14415J89364R2506R3103J98900L37303L31879J20580
$$ plain form
2111 789591253 789539874 789541662 789702594 789950073 790134609 790157259 790059745 789982080 790058553 790284455 790455818
2133.5 790455818 790433466 790306985 790258765 790399790 790648401 790784478 790719807 790606797 790641844 790896475
2153.9 790896475 791262507 791538298 791644096 791749895 792071998 792598248 793173552 793675423 794065297 794439673
2174.3 794439673 794986129 795746684 796519399 797079265 797418356 797739387 798248827 798947752 799621105 800068498
2194.6 800068498 800320327 800598204 801085949 801743329 802349985 802733779 802943647 803232431 803784966 804490924
2215 804490924 805101514 805451810 805612445 805848300 806306243 806876481 807337344 807556510 807625055 807789028
2235.4 807789028 808215737 808771312 809130669 809192896 809155703 809291065 809709072 810195327 810439765 810406685
2255.8 810406685 810335279 810490251 810948312 811472774 811726570 811693132 811681628 811946511 812439680 812888324
$$ packed form
2111G89591253n1379J788J60932K47479J84536K2650r7514p7665P6473K25902J71363
2133.5G90455818k2352j26481m8220J41025K48611J36077o4671j13010L5047K54631
2153.9G90896475L66032K75791J05798J05799L22103N26250N75304N01871L89874L74376
2174.3G94439673N46456P60555P72715N59866L39091L21031N09440O98925O73353M47393
2194.6H00068498K51829K77877M87745O57380O06656L83794K09868K88784N52535P05958
2215H04490924O10590L50296J60635K35855M57943N70238M60863K19166O8545J63973
2235.4H07789028M26709N55575L59357O2227l7193J35362M18007M86255K44438l3080
2255.8H10406685p1406J54972M58061N24462K53796l3438j1504K64883M93169M48644
$$ plain form
2276.2 812888324 813065350 813022554 813033521 813287795 813695192 813985825 813963532 813739121 813635647 813812554
2296.6 813812554 814132452 814312279 814171076 813825965 813556790 813521683 813643575 813691854 813522637 813155711
2317 813155711 812735617 812527001 812583864 812583089 812239051 811677873 811280310 811187267 811123192 810819507 810307741
2339.5 810307741 809831679 809755206 810226738 810729682 810660362 809937894 808894932 808075964 807798505 807783365
2359.9 807783365 807644069 807425141 807342350 807537436 807987332 808449209 808611929 808461785 808353186 808583498
2380.2 808583498 809031606 809343517 809281647 808889925 808461547 808253109 808244467 808193326 807861567 807272375
2400.6 807272375 806699693 806375206 806249022 806042969 805537820 804791629 804102123 803676963 803397238 802969992
2421 802969992 802241564 801321924 800469637 799900472 799533427 799024761 798164546 797115624 796225071 795659065
$$ packed form
2276.2H12888324J77026m2796J0967K54274M07397K90633k2293k24411j03474J76907
2296.6H13812554L19898J79827j41203l45111k69175l5107J21892M8279j69217l66926
2317H13155711m20094k08616N6863p75l44038n61178l97563r3043o4075l03685n11766
2339.5H10307741m76062p6473M71532N02944o9320p22468j042962q18968k77459j5140
2359.9H07783365j39296k18928q2791J95086M49896M61877J62720j50144j08599K30312
2380.2H08583498M48108L11911o1870l91722m28378k08438q642n1141l31759n89192
2400.6H07272375n72682l24487j26184k06053n05149p46191o89506m25160k79725m27246
2421H02969992p28428r19640q52287n69165l67045n08666q60215j048922q90553n66006
$$ plain form
2441.4 795659065 795237005 794642568 793746889 792709351 791857243 791316867 790874898 790250063 789359927
2459.8 789359927 788382590 787610292 787158608 786798418 786199212 785296142 784345865 783635080 783227086 782897055
2480.2 782897055 782327116 781494856 780675173 780113220 779816628 779564738 779103637 778397024 777681053 777264535
2500.6 777264535 777158797 777003169 776528180 775852561 775275767 774955451 774783850 774473608 773840427 773010373
2521 773010373 772275507 771808743 771483183 770999312 770204782 769227028 768350124 767741084 767256081 766598344
2541.4 766598344 765642047 764562726 763651192 763017714 762503684 761834025 760899186 759868264 758992076
2559.7 758992076 758361995 757814467 757109702 756189823 755210817 754407883 753834426 753285468 752552390 751611650
2580.1 751611650 750674784 749984324 749516666 749052703 748422325 747657001 746950269 746447623 746106267 745723963
$$ packed form
2441.4G95659065m22060n94437q95679j037538q52108n40376m41969o24835q90136
2459.8G89359927r77337p72298m51684l60190n99206r03070r50277p10785m07994l30031
2480.2G82897055n69939q32260q19683n61953k96592k51890m61101p06613p15971m16518
2500.6G77264535j05738j55628m74989o75619n76794l20316j71601l10242o33181q30054
2521G73010373p34866m66764l25560m83871p94530r77754q76904o09040m85003o57737
2541.4G66598344r56297j079321r11534o33478n14030o69659r34839j030922q76188
2559.7G58992076o30081n47528p04765r19879r79006q02934n73457n48958p33078r40740
2580.1G51611650r36866o90460m67658m63963o30378p65324p06732n02646l41356l82304
$$ plain form
2600.5 745723963 745129645 744348884 743572235 742962837 742423058 741695821 740666270 739444256 738282561
2618.9 738282561 737309873 736401916 735347867 734039962 732576370 731162548 729914844 728759229 727479517
2637.2 727479517 725948095 724302948 722794116 721519589 720347285 719060421 717583954 716054201
2653.5 716054201 714649081 713434517 712313652 711082399 709681749 708245099 706954479 705887675
2669.9 705887675 704894900 703778803 702518344 701266527 700195074 699313223 698435962 697378218 696152687
2688.2 696152687 694925427 693825781 692834020 691815376 690631211 689260304 687837243 686548114
2704.5 686548114 685411334 684236705 682862699 681350887 679925978 678742826 677747071 676730156
2720.9 676730156 675544083 674266517 673111141 672196686 671411574 670561075 669560492 668464601 667452931
$$ packed form
2600.5G45723963n94318p80761p76649o09398n39779p27237j029551j222014j161695
2618.9G38282561r72688r07957j054049j307905j463592j413822j247704j155615j279712
2637.2G27479517j531422j645147j508832j274527j172304j286864j476467j529753
2653.5G16054201j405120j214564j120865j231253j400650j436650j290620j066804
2669.9G05887675r92775j116097j260459j251817j071453q81851q77261j057744j225531
2688.2F96152687j227260j099646r91761j018644j184165j370907j423061j289129
2704.5F86548114j136780j174629j374006j511812j424909j183152r95755j016915
2720.9F76730156j186073j277566j155376r14455p85112q50499j000583j095891j011670
$$ plain form
2739.2 667452931 666646183 665947080 665195942 664306223 663341582 662480593 661789238 661164165 660468698 659645557
2759.6 659645557 658794880 658089459 657554805 657012522 656276643 655326128 654303491 653395116 652586401
2778 652586401 651666701 650510848 649167061 647768319 646432102 645141304 643757105 642186821 640438616
2796.3 640438616 638620615 636855423 635128558 633290887 631204307 628925145 626640081 624431610
2812.6 624431610 622235954 619925439 617409527 614759266 612138152 609577239 606954038 604166865
2828.9 604166865 601192594 598053038 594854414 591691017 588457048 584943771 581076562 576926112
2845.3 576926112 572673082 568537652 564638555 561062515 557874322 554988265 552196920 549262881
2861.6 549262881 545950532 542052746 537519813 532522500 527306676 522008002 516654432 511345148
$$ packed form
2739.2F67452931q06748o99103p51138q89719r64641q60989o91355o25073o95467q23141
2759.6F59645557q50677p05421n34654n42283p35879r50515j022637r08375q08715
2778F52586401r19700j155853j343787j398742j336217j290798j384199j570284j748205
2796.3F40438616j818001j765192j726865j837671k086580k279162k285064k208471
2812.6F24431610k195656k310515k515912k650261k621114k560913k623201k787173
2828.9F04166865k974271l139556l198624l163397l233969l513277l867209m150450
2845.3E76926112m253030m135430l899097l576040l188193k886057k791345k934039
2861.6E49262881l312349l897786m532933m997313n215824n298674n353570n309284
$$ plain form
2877.9 511345148 506361723 502038360 498562425 495942354 494057000 492702246 491697401 490952969
2894.2 490952969 490378052 489814907 489111632 488152146 486871541 485299975 483461827 481238872 478459239
2912.6 478459239 475081563 471261829 467266411 463344872 459728956 456647187 454315960 452910304
2928.9 452910304 452554792 453409523 455591500 458990782 463334858 468370676 473900437 479738265 485711485
2947.2 485711485 491717309 497697473 503614724 509485602 515350819 521165669 526730537 531849682
2963.6 531849682 536495924 540783763 544818640 548647106 552299261 555795312 559217155 562604845
2979.9 562604845 565828562 568728685 571220100 573314965 575136840 576765776 578151703 579239786
2996.2 579239786 579990268 580376744 580437720 580234528 579799831 579131424 578161120 576832652 575232863
$$ packed form
2877.9E11345148m983425m323363l475935k620071j885354j354754j004845p44432
2894.2D90952969n74917n63145p03275r59486j280605j571566j838148k222955k779633
2912.6D78459239l377676l819734l995418l921539l615916l081769k331227j405656
2928.9D52910304l55512Q54731K181977L399282M344076N035818N529761N837828N973220
2947.2D85711485O005824N980164N917251N870878N865217N814850N564868N119145
2963.6E31849682M646242M287839M034877L828466L652155L496051L421843L387690
2979.9E62604845L223717K900123K491415K094865J821875J628936J385927J088083
2996.2E79239786P50482L86476O0976k03192m34697o68407r70304j328468j599789
$$ plain form
3014.5 575232863 573474407 571578383 569506168 567255974 564882040 562419415 559914351 557390869
3030.9 557390869 554811120 552085757 549219906 546419799 543743014 540997624 538062334 534979224
3047.2 534979224 531889200 528900802 525980294 523048460 520030141 516909540 513841152 510951817
3063.5 510951817 508153737 505283475 502272725 499186248 496175468 493379235 490720153 487946212
3079.8 487946212 484999478 482014984 479065537 476204157 473404109 470522583 467581958 464738697
3096.1 464738697 462043583 459381729 456633359 453882188 451259315 448678285 445995271 443365455
3112.4 443365455 440952688 438576818 436049104 433339179 430542231 427862644 425377220 422970027
3128.8 422970027 420506239 418001771 415636569 413501561 411398530 409072280 406587303 404190779
$$ packed form
3014.5E75232863j758456j896024k072215k250194k373934k462625k505064k523482
3030.9E57390869k579749k725363k865851k800107k676785k745390k935290l083110
3047.2E34979224l090024k988398k920508k931834l018319l120601l068388k889335
3063.5E10951817k798080k870262l010750l086477l010780k796233k659082k773941
3079.8D87946212k946734k984494k949447k861380k800048k881526k940625k843261
3096.1D64738697k695114k661854k748370k751171k622873k581030k683014k629816
3112.4D43365455k412767k375870k527714k709925k796948k679587k485424k407193
3128.8D22970027k463788k504468k365202k135008k103031k326250k484977k396524
$$ plain form
3145.1 404190779 401994675 399991065 398055404 395953238 393639088 391357243 389269441 387315720
3161.4 387315720 385368824 383386284 381419182 379489303 377615958 375821471 374059618 372260779
3177.7 372260779 370450914 368686467 366990030 365388453 363815963 362170994 360493839 358879507
3194 358879507 357330561 355811119 354301870 352805197 351360500 349993914 348663270 347335070 346001446
3212.4 346001446 344665200 343384475 342180818 340981632 339748532 338505208 337288320 336165994
3228.7 336165994 335178852 334254205 333206713 331999362 330817372 329756081 328796566 327926069 327066183
3247.1 327066183 326094419 325075686 324168801 323352665 322523177 321683645 320865005 320060194 319316059
3265.4 319316059 318684518 318123132 317468524 316645503 315789640 314997107 314268798 313581795 312896937 312209427
$$ packed form
3145.1D04190779k196104k003610j935661k102166k314150k281845k087802j953721
3161.4C87315720j946896j982540j967102j929879j873345j794487j761853j798839
3177.7C72260779j809865j764447j696437j601577j572490j644969j677155j614332
3194C58879507j548946j519442j509249j496673j444697j366586j330644j328200j333624
3212.4C46001446j336246j280725j203657j199186j233100j243324j216888j122326
3228.7C36165994r87142r24647j047492j207351j181990j061291r59515q70497q59886
3247.1C27066183r71764j018733r06885q16136q29488q39532q18640q04811p44135
3265.4C19316059o31541n61386o54608q23021q55863p92533p28309o87003o84858o87510
$$ plain form
3285.8 312209427 311560422 310998529 310470998 309853792 309110940 308281660 307473242 306840986 306376785 305834770
3306.2 305834770 305029154 304015160 302966595 302024692 301177651 300357431 299551845 298773736 297980934
3324.6 297980934 297072798 296093166 295163661 294275045 293447495 292710483 291886300 290891796 289857268
3342.9 289857268 288805544 287830710 287049502 286201924 285091460 283945680 282970399 282099307 281197041
3361.3 281197041 280294210 279524505 278832525 277972162 276819527 275632560 274712712 274005592 273315787
3379.6 273315787 272516638 271697223 271026969 270588249 270367861 270043463 269365609 268658668 268323392 268195599
3400 268195599 267778724 267025024 266394347 266051859 265795082 265500158 265119106 264714807 264446288 264273226
3420.4 264273226 264094859 264016300 264107287 264282048 264413238 264569640 264839351 264996976 264899909 264768898
$$ packed form
3285.8C12209427o49005n61893n27531o17206p42852q29280q08418o32256m64201n42015
3306.2C05834770q05616j013994j048565r41903q47041q20220q05586p78109p92802
3324.6B97980934r08136r79632r29505q88616q27550p37012q24183r94504j034528
3342.9B89857268j051724r74834p81208q47578j110464j145780r75281q71092r02266
3361.3B81197041r02831p69705o91980q60363j152635j186967r19848p07120o89805
3379.6B73315787p99149q19415o70254m38720k20388l24398o77854p06941l35276j27793
3400B68195599m16875p53700o30677l42488k56777k94924l81052m04299k68519j73062
3420.4B64273226j78367p8559R0987J74761J31190J56402K69711J57625r7067j31011
$$ plain form
3440.8 264768898 264851570 265172452 265577793 265934765 266311765 266777694 267290711 267852813 268498212 269108862
3461.2 269108862 269731551 270639986 271676600 272367090 272672445 273029953 273672789 274543971 275424570
3479.6 275424570 276075840 276701063 277524561 278340250 279086649 279922009 280833662 281807661 282819360
3497.9 282819360 283815265 284740090 285476565 286110550 286880463 287877679 289039671 290123045 291002989
3516.3 291002989 291876197 292936295 294218421 295423985 296328723 297175974 298202217 299420297 300756752
3534.6 300756752 301989138 303048253 304259568 305739760 307231247 308517337 309736699 311064899
3551 311064899 312530160 314143270 315911114 317813993 319774896 321655422 323403150 325442672 327936918
3569.3 327936918 330406040 332774550 335271567 337939650 340800911 343871385 346949726 349802047
$$ packed form
3440.8B64768898Q2672L20882M05341L56972L77000M65929N13017N62102O45399O10650
3461.2B69108862O22689R08435J036614O90490L05355L57508O42836Q71182Q80599
3479.6B75424570O51270O25223Q23498Q15689P46399Q35360R11653R73999J011699
3497.9B82819360R95905R24825P36475O33985P69913R97216J161992J083374Q79944
3516.3B91002989Q73208J060098J282126J205564R04738Q47251J026243J218080J336455
3534.6C00756752J232386J059115J211315J480192J491487J286090J219362J328200
3551C11064899J465261J613110J767844J902879J960903J880526J747728K039522K494246
3569.3C27936918K469122K368510K497017K668083K861261L070474L078341K852321
$$ plain form
3585.6 349802047 352607191 355755001 359014183 362268120 365723342 369361579 372975171 376595348
3601.9 376595348 380266249 383824944 387436479 391223401 395054638 399066359 403088391 407018900
3618.3 407018900 411272794 415566534 419505090 423022598 426638842 431026310 435358971 439435482
3634.6 439435482 443491846 447511107 451610595 455837756 459931493 463683575 467512667 471873343
3650.9 471873343 476014167 479680777 483626455 487796366 491587311 495146960 498776048 502244294
3667.2 502244294 505541325 509101510 512263298 514956772 518126607 521438003 524608910 527788818
3683.5 527788818 530855477 533656001 536170244 538666546 541233182 543711126 546010911 548093319
3699.8 548093319 550141096 552440703 554827094 556942165 558593333 560214520 562334239 564483166
$$ packed form
3585.6C49802047K805144L147810L259182L253937L455222L638237L613592L620177
3601.9C76595348L670901L558695L611535L786922L831237M011721M022032L930509
3618.3D07018900M253894M293740L938556L517508L616244M387468M332661M076511
3634.6D39435482M056364M019261M099488M227161M093737L752082L829092M360676
3650.9D71873343M140824L666610L945678M169911L790945L559649L629088L468246
3667.2E02244294L297031L560185L161788K693474L169835L311396L170907L179908
3683.5E27788818L066659K800524K514243K496302K566636K477944K299785K082408
3699.8E48093319K047777K299607K386391K115071J651168J621187K119719K148927
$$ plain form
3716.2 564483166 566373408 568098009 569676578 571118832 572709560 574592113 576371312 577842653
3732.5 577842653 579129636 580645084 582534730 584219396 585079551 585747838 587328851 588697791 589426577
3750.8 589426577 590628922 592256010 593576550 594603479 595865726 597278774 598548591 599694729
3767.1 599694729 600641787 601633191 602902472 604205430 605288327 606142163 607023060 607927322 608888268
3785.5 608888268 610019624 611159086 612225473 613184988 614097118 615129590 615873873 616393924 617320359
3803.9 617320359 618085861 618765235 619935989 621244907 622162700 622823358 623641849 624124467 624623597
3822.2 624623597 625603676 626534402 627341211 628066659 628882289 629874527 630506098 630747497 631241262 631925106
3842.6 631925106 632701337 633703828 634766221 635266781 634716153 634750724 636053681 637220740 637914777
$$ packed form
3716.2E64483166J890242J724601J578569J442254J590728J882553J779199J471341
3732.5E77842653J286983J515448J889646J684666Q60155O68287J581013J368940P28786
3750.8E89426577J202345J627088J320540J026929J262247J413048J269817J146138
3767.1E99694729R47058R91404J269281J302958J082897Q53836Q80897R04262R60946
3785.5F08888268J131356J139462J066387R59515R12130J032472P44283N20051R26435
3803.9F17320359P65502O79374J170754J308918R17793O60658Q18491M82618M99130
3822.2F24623597R80079R30726Q06809P25448Q15630R92238O31571K41399M93765O83844
3842.6F31925106P76231J002491J062393N00560n50628L4571J302957J167059O94037
$$ plain form
3861 637914777 638365746 638950229 639540315 639769495 640129387 640805721 641595066 642382383 642848074 643313766
3881.4 643313766 643910289 644364834 644952595 645445585 645660698 646137953 646877944 647424221 647685826 647781730
3901.8 647781730 647819638 648127258 648708165 649267435 649771452 650193989 650423825 650610507 650987446 651370406
3922.1 651370406 651584983 651858211 652217269 652438879 652672589 653076887 653438926 653702021 653936267 654153824
3942.5 654153824 654448867 654779911 655078232 655416250 655718744 655946553 656231523 656549037 656771541 656958103
3962.9 656958103 657206953 657490790 657767296 657992363 658181250 658433795 658742487 658993840 659214616 659493208
3983.3 659493208 659771800 659974575 660141349 660333276 660536051 660713315 660884380
3997.6 660884380
$$ packed form
3861F37914777M50969N84483N90086K29180L59892O76334P89345P87317M65691M65692
3881.4F43313766N96523M54545N87761M92990K15113M77255P39991N46277K61605R5904
3901.8F47781730L7908L07620N80907N59270N04017M22537K29836J86682L76939L82960
3922.1F51370406K14577K73228L59058K21610K33710M04298L62039K63095K34246K17557
3942.5F54153824K95043L31044K98321L38018L02494K27809K84970L17514K22504J86562
3962.9F56958103K48850K83837K76506K25067J88887K52545L08692K51353K20776K78592
3983.3F59493208K78592K02775J66774J91927K02775J77264J71065
3997.6F60884380
##END=$$ End of the data block
