##TITLE=$$ Begin of the data block
##JCAMP-DX=5.00 $$ ACD/SpecManager v 10.08
##SPECTROMETER/DATA SYSTEM=Alpha
##DATE=29 Dec 2014 11:22:02
##DATA TYPE=INFRARED SPECTRUM
##DATA CLASS=XYDATA
##ORIGIN=
##OWNER=
##NPOINTS=1765
##FIRSTX=399.76428223
##LASTX=3997.64306641
##MAXX=3997.64306641
##MINX=399.76428223
##MAXY=0.81542844
##MINY=0.19829558
##XFACTOR=1.0000000000
##YFACTOR=1.000000000000000e-9
##FIRSTY=0.48862141
##DELTAX=2.03961372
##XUNITS=1/CM
##YUNITS=ARBITRARY UNITS
##XYDATA=(X++(Y..Y))
399.8D88621414m743398m897445m655421k106487J410931L866672L759236J509934
416.1D82765436q30322j870901j331627j379371k615064l958911m443556l755540k332121
434.4D60248023r38236J05172J449764L665179N741536O159395M597992K096534K86758
452.8D83412117j44512K54095l6985j695096l548831m290342l572584k377569k332807
471.2D65667486l709435m277587l186941j534582j78843J94043m38869r31055o15954
489.5D50988263j88321l30418j278162k507806l012955k707750k108335k140344l338664
507.9D33375508m459680m484891l975332l740758m076302m419029m017532k723515
524.2D01478469q99940M51535Q22156J004309J785069L542394N805313O961614N911410
$$ plain form
399.8 488621414 483878016 478980571 474325150 472218663 473629594 477496266 481255502 482765436
416.1 482765436 481935114 480064213 478732586 477353215 474738151 470779240 466335684 462580144 460248023
434.4 460248023 459309787 459414959 460864723 464529902 470271438 476430833 481028825 483125359 483412117
452.8 483412117 483267605 483521700 483484715 481789619 478240788 473950446 470377862 468000293 465667486
471.2 465667486 461958051 457680464 454493523 452958941 452780098 452974141 452535272 451604217 450988263
489.5 450988263 450799942 450469524 449191362 446683556 443670601 440962851 438854516 436714172 433375508
507.9 433375508 428915828 424430937 420455605 416714847 412638545 408219516 404201984 401478469
524.2 401478469 400578529 401030064 401852220 402856529 404641598 408183992 413989305 420950919 426862329
542.5D26862329L461808J305074J29372m56423j094103k236098l615111m562527m749000
560.9D15045321m781842n626530p077545p671833o395161l596842k61098K541929M494637
579.3C86671036O108076P370084P887721P452161N781710L351569J363605M61072L28123
597.6D26775157K91229j41114o35982n37008J09285Q85517J446515J706928J916021
616D31816548K494693L473669M350722M536271L831118K944589K577990K694011K736330
634.3D61455941K245069J400977Q52257R90063J483619J774729J636386J155734P80105
652.7D73774880J006693J597732J822800J392990P62850M47690Q85576K235800K316595
671D86243606J592278J201630J208186J672476K111376J949876J234591N04732J04785
$$ plain form
542.5 426862329 430324137 431629211 431758583 431302160 430208057 427971959 424356848 419794321 415045321
560.9 415045321 410263479 404636949 397559404 389887571 383492410 379895568 379634470 382176399 386671036
579.3 386671036 392779112 400149196 408036917 415489078 421270788 424622357 425985962 426447034 426775157
597.6 426775157 427066386 426925272 426289290 425752282 425861567 426747084 428193599 429900527 431816548
616 431816548 434311241 437784910 442135632 446671903 450503021 453447610 456025600 458719611 461455941
634.3 461455941 463701010 465101987 465954244 466944307 468427926 470202655 471839041 472994775 473774880
652.7 473774880 474781573 476379305 478202105 479595095 480357945 480805635 481691211 483927011 486243606
671 486243606 487835884 489037514 490245700 491918176 494029552 495979428 497214019 497718751 497823536
689.4D97823536J7375k01940j042635k369225l433704l610998k969116k009869j085401
707.7D81118023j46299J108318K731204M365147N506277N961954N915106N922377O293535
726.1E18775642O504059O030380M879177L555954K763688K634168K510190J500070
742.4E49153328l44694k171635l306806l767670m156470m859507n581498n682409m714608
760.8E14568031k962053j165748M24803K159178M362464O855547R089470J0330320
777.1E43662012J0068059Q815884P713854P219971O799459N919278M692197L789127
793.4E98679841L821671M698097N513549N267680L949523K584278K076507K122343
809.7F28713489J870691J032293K3306m58002j16408L86059l874j528502l374100m594087
$$ plain form
689.4 497823536 497840911 497638971 496596336 494227111 490793407 487182409 484213293 482203424 481118023
707.7 481118023 480971724 482080042 484811246 489176393 494682670 500644624 506559730 512482107 518775642
726.1 518775642 525279701 531310081 536189258 539745212 542508900 545143068 547653258 549153328
742.4 549153328 548808634 546636999 543330193 539562523 535406053 530546546 524965048 519282639 514568031
760.8 514568031 511605978 510440230 510865033 513024211 517386675 524242222 533331692 543662012
777.1 543662012 553730071 562545955 570259809 577479780 584279239 590198517 594890714 598679841
793.4 598679841 602501512 607199609 612713158 617980838 621930361 624514639 626591146 628713489
809.7 628713489 630584180 631616473 631639779 631181777 631065369 631451428 631447554 629919052 626544952 621950865
830.1F21950865m936338m926800n326152o019831o232679n699575m793942m155278
846.4E79860270m298091n132735o061315o507874o363868n557955l176451J427472
862.8E44189453O899178J1251927J3981640J5051186J3849139J0672629P063389L978729
879.1F26937270J124799k039492n222916p372678p866621p090032o110966n833387
895.4E86525977o203056o520927o395220o227851o778837q273840j0117709j1499167
911.7E24509370j2007594j1714697j0869264r476424p391959m839182k373934m68522
928D65367794P57456J561582K269119L150552M382253N644918N914837M076600O6519
946.4D93191630m763186q930236j2087852j4592171j6551047j7715097j8047422j8047750
$$ plain form
830.1 621950865 617014527 612087727 606761575 600741744 594509065 588809490 584015548 579860270
846.4 579860270 575562179 570429444 564368129 557860255 551496387 545938432 542761981 544189453
862.8 544189453 551088631 562340558 576322198 591373384 605222523 615895152 622958541 626937270
879.1 626937270 628062069 626022577 620799661 613426983 605560362 598470330 592359364 586525977
895.4 586525977 580322921 573801994 567406774 561178923 554400086 546126246 536008537 524509370
911.7 524509370 512501776 500787079 489917815 480441391 473049432 468210250 465836316 465367794
928 465367794 466125250 467686832 469955951 473106503 477488756 483133674 489048511 493125111 493191630
946.4 493191630 488428444 479498208 467410356 452818185 436267138 418552041 400504619 382456869
962.7C82456869j8253178j8737226j9231260j9401968j9028037j8105358j6757459
977B52942383j5055984j2928456j0367885p581249m919127k716601j077503L2634P72655
995.3A99100867J352787J765713J846835J588151J095772N46157J85117R8601K63184
1013.7B07843184O00636J051188J601309K221733K864435L415197L667161L598944
1030B26863787L380596L005356K392575J567438P48724K08244J21340M92662J184404
1048.4B39965126K144143L340214M622817N841494P039398Q311927R456575R675920
1064.7B90397614P669121K561391m328460r464890j0263145p532328l882110q21143
1081B64336050J501679L190130M252881M859239N331307N719334N728066N026370L559918
$$ plain form
962.7 382456869 364203691 345466465 326235205 306833237 287805200 269699842 252942383
977 252942383 237886399 224957943 214590058 207008809 202089682 199373081 198295578 198328212 199100867
995.3 199100867 200453654 202219367 204066202 205654353 206750125 207296282 207481399 207580000 207843184
1013.7 207843184 208443820 209495008 211096317 213318050 216182485 219597682 223264843 226863787
1030 226863787 230244383 233249739 235642314 237209752 237958476 238166720 238288060 238780722 239965126
1048.4 239965126 242109269 245449483 250072300 255913794 262953192 271265119 280721694 290397614
1064.7 290397614 298066735 300628126 296299666 286834776 276571631 269039303 265157193 264336050
1081 264336050 265837729 269027859 273280740 278139979 283471286 289190620 294918686 299945056 303504974
1099.4C03504974J758426M85063M18961J510262K979487L935695M108280L804207L367811
1117.7C25873166K863497K252161J736701J768500K636164M069835N091816M621565
1134C50913405K378047r45836m193783o472945p564158p803946p500947o686389n359501
1152.4C06763947l703445k040088o17683N54949J802414L499806N668521P969439R983659
1170.7C29881519J1456430J2443244J3135702J3684839J4059067J3925582J3048082
1185D21634465J1634738J0069191Q522093O912590N158454L481954K279759J858711
1201.3D71551955K178490K770364L260732L704786M345864N236566N992592O021291
1217.7E05062640N045950L348053J613080L87550l36528r21846j587212k194404k444745
$$ plain form
1099.4 303504974 305263400 305748463 306167424 307677686 310657173 314592868 318701148 322505355 325873166
1117.7 325873166 328736663 330988824 332725525 334494025 337130189 341200024 346291840 350913405
1134 350913405 353291452 352345616 348151833 341678888 334114730 326310784 318809837 312123448 306763947
1152.4 306763947 303060502 301020414 300402731 300957680 302760094 306259900 311928421 319897860 329881519
1170.7 329881519 341337949 353781193 366916895 380601734 394660801 408586383 421634465
1185 421634465 433269203 443338394 451860487 458773077 463931531 467413485 469693244 471551955
1201.3 471551955 473730445 476500809 479761541 483466327 487812191 493048757 499041349 505062640
1217.7 505062640 510108590 513456643 515069723 515457273 515120745 514198899 512611687 510417283 507972538
1236E07972538k165317j509368q03173k06471L69907J052260J829624K472759K580762
1254.4E11593521K030432J220405P19130Q16882J400232K103806K508580K420366K029836
1272.7E26843190J575411J024782K81990n38886j093685j121641q01921o09576q73506
1291.1E24686158j513362k150238k475917k414584k154708k051950k281427k566397
1307.4E07077575k358198j653970j061678r43422j199484j604199k089203k853244
1323.7D93314177m023969n303532o144345o173194n390584m104406k750754j646847
1340D57776546q28743j88589L38763O02246M55171J2874n40048r37938r73910p93219
1360.4D54923153o73711o06239n41568l99053Q8632Q27700J356035J264304R01312
$$ plain form
1236 507972538 505807221 504297853 503494680 503288209 503658116 504710376 506540000 509012759 511593521
1254.4 511593521 513623953 514844358 515563488 516380370 517780602 519884408 522392988 524813354 526843190
1272.7 526843190 528418601 529443383 529725373 529186487 528092802 526971161 526169240 525559664 524686158
1291.1 524686158 523172796 521022558 518546641 516132057 513977349 511925399 509643972 507077575
1307.4 507077575 504719377 503065407 502003729 501060307 499860823 498256624 496167421 493314177
1323.7 493314177 489290208 483986676 477842331 471669137 466278553 462174147 459423393 457776546
1340 457776546 456947803 456759214 457097977 457700223 458155394 458168268 457628220 456690282 455716372 454923153
1360.4 454923153 454249442 453643203 453101635 452702582 452791214 453618914 454974949 456239253 457140565
1378.8D57140565P94858J349628K749711M504383M963338L760755K469271J330465
1395.1D79062974J81854p75426j387716j824230k271145k322912k166242k203047k195567
1413.5D64098543j923800j635789j279027n11646J27852M10080O41972R97185J414955
1431.8D62340325J732558K043039K056032J637757J541257J508951J137406K73585
1448.1D74270910p73638j425088j672208k252579k430737q27610N62220J874119L378511
1466.5D70703900M686713O704927R982287J0800899R243726Q410275Q268297Q177400
1482.8E36978424P484138P014334P017791O621540N445003N143762N560994M889607
1499.1E86155593L885270L476798M023612M979372L570914K386391K372146K636313
$$ plain form
1378.8 457140565 457935423 459285051 462034762 466539145 471502483 475263238 477732509 479062974
1395.1 479062974 479244828 478469402 477081686 475257456 472986311 470663399 468497157 466294110 464098543
1413.5 464098543 462174743 460538954 459259927 458748281 458876133 459286213 459928185 460925370 462340325
1431.8 462340325 464072883 466115922 468171954 469809711 471350968 472859919 473997325 474270910
1448.1 474270910 473497272 472072184 470399976 468147397 465716660 464889050 465451270 467325389 470703900
1466.5 470703900 475390613 482095540 492077827 502878726 512122452 520532727 528801024 536978424
1482.8 536978424 544462562 551476896 558494687 565116227 570561230 575704992 581265986 586155593
1499.1 586155593 590040863 593517661 597541273 602520645 606091559 608477950 610850096 613486409
1515.4F13486409K968490K918482K802313K308547J857877J953304J974761K046526
1531.8F32316709J997292J568377J487851J842618J315355O00696L76403K54452J83821
1550.1F41943574K03013L63291M11212l18885j710713j370310j039803j042128j373410
1568.5F36065841k016545j899898j833558k508759k458394k092421k346516k618312
1584.8F18291438k681613k632738k638995k720356k907336l057241l037215k964019
1601.1E95651925k931595l008604l229261l587067l668904l406584l719449m551769
1617.4E67548692l814041l234029l770948l746807l476084l253340k359212j555085
1633.7E42339146j459777j073122l22879K21849O55055J138985J578868J651465K368749
$$ plain form
1515.4 613486409 616454899 619373381 622175694 624484241 626342118 628295422 630270183 632316709
1531.8 632316709 634314001 635882378 637370229 639212847 640528202 641128898 641505301 641759753 641943574
1550.1 641943574 642146587 642509878 642921090 642602205 640891492 639521182 638481379 637439251 636065841
1568.5 636065841 634049296 632149398 630315840 627807081 625348687 623256266 620909750 618291438
1584.8 618291438 615609825 612977087 610338092 607617736 604710400 601653159 598615944 595651925
1601.1 595651925 592720330 589711726 586482465 582895398 579226494 575819910 572100461 567548692
1617.4 567548692 563734651 560500622 556729674 552982867 549506783 546253443 543894231 542339146
1633.7 542339146 540879369 539806247 539483368 539705217 540360272 541499257 543078125 544729590 547098339
1652.1E47098339L455638K665818K449155L127396L986538M317760L970564M367470
1668.4E75438678N026102M617989M987538N653858N188525M905582N588233O963611
1684.7F18370116N903899M809201M903317M423082M519105M671275M126966M070819
1701.1F55797780L068268K290308K180457K022326K117455K324224K437472K466500
1717.4F74704790K119303J899898K158284K450168K456427K430975K362073K616763
1733.7F93198681K631485K240241K421856K551019K497852K726614L117442L503979
1750G14889169L480613K997756K889037K986312K891123K888799K509415K051532J940608
1768.4G39524364J976312K059579J818895J396239J242041J267672J312256J391291
$$ plain form
1652.1 547098339 550553977 553219795 555668950 558796346 562782884 567100644 571071208 575438678
1668.4 575438678 580464780 585082769 590070307 595724165 600912690 605818272 611406505 618370116
1684.7 618370116 624274015 629083216 633986533 638409615 642928720 647599995 651726961 655797780
1701.1 655797780 658866048 661156356 663336813 665359139 667476594 669800818 672238290 674704790
1717.4 674704790 676824093 678723991 680882275 683332443 685788870 688219845 690581918 693198681
1733.7 693198681 695830166 698070407 700492263 703043282 705541134 708267748 711385190 714889169
1750 714889169 718369782 721367538 724256575 727242887 730134010 733022809 735532224 737583756 739524364
1768.4 739524364 741500676 743560255 745379150 746775389 748017430 749285102 750597358 751988649
1784.7G51988649J417697J307189J185656J125038J067817J165569J270532J131416
1801G61659563Q99791Q52466J001120J156747J138687Q83818O76512P08580Q95679
1819.4G69872963J020492R90986Q22664O08861N41568O07014O88552O49572M82023
1837.7G76284695L65674M28021N69642N75006L97265J86145Q2493J91212M14490N06103
1858.1G80000746M15802K45691J77085K61724L78966M04299L09407J98245J87099L50953
1878.5G82930017N52535O15954N02884L41177K85328L91304N29707M91976K88249R2983
1898.9G87022114P7605K26557L72589L58403J80363N305Q106J82212L55303L44634
1919.3G89133191J42872p450M6193K31088L49760K74121Q4579l6895M2379K52128L66807
$$ plain form
1784.7 751988649 753406346 754713535 755899191 757024229 758092046 759257615 760528147 761659563
1801 761659563 762559354 763411820 764412940 765569687 766708374 767592192 768268704 768977284 769872963
1819.4 769872963 770893455 771884441 772707105 773315966 773857534 774464548 775153100 775802672 776284695
1837.7 776284695 776650369 777078390 777648032 778223038 778620303 778806448 778888941 779080153 779494643 780000746
1858.1 780000746 780416548 780662239 780839324 781101048 781480014 781884313 782193720 782391965 782579064 782930017
1878.5 782930017 783482552 784098506 784601390 784942567 785227895 785619199 786148906 786640882 786929131 787022114
1898.9 787022114 787099719 787326276 787698865 788057268 788237631 788242936 788251042 788433254 788788557 789133191
1919.3 789133191 789276063 789268613 789314806 789545894 789895654 790169775 790254354 790217459 790259838 790511966 790878773
1941.7G90878773K47359M0472l2127J25825L63290M16398K92838J49429J02401J87218
1962.1G92771876L21984L52144K32995P1466L4928J55449K85626K86042J32442o56
1982.5G94644296K5332J45376K40445K00510J3828j17957m9293J13845J74880M5418
2002.9G95436680j49011k64824k50458j67132j49131k68757m43816n34177m81427l80158
2023.3G92347789l51250l69609m34875m85003m33505l44932l18646m02034n11706m84764
2043.7G88211465k92122j13488j01745k23040k83719j71244M7624K07723J56521R954
2064.1G87447929k6524M5896J52349K18511J18911n4836q4996K4795J72317K54214
2084.5G88268566J76132J3351k5093J21832L11195L27290J73926O5148R4831K23040
$$ plain form
1941.7 790878773 791126132 791166604 791134477 791260302 791623592 792039990 792332828 792482257 792584658 792771876
1962.1 792771876 793093860 793446004 793678999 793750465 793785393 793940842 794226468 794512510 794644952 794644296
1982.5 794644296 794669628 794815004 795055449 795255959 795269787 795151830 795102537 795216382 795391262 795436680
2002.9 795436680 795287669 795022845 794772387 794605255 794456124 794187367 793743551 793209374 792727947 792347789
2023.3 792347789 791996539 791626930 791192055 790707052 790273547 789928615 789609969 789207935 788696229 788211465
2043.7 788211465 787919343 787805855 787704110 787481070 787197351 787026107 787073731 787281454 787437975 787447929
2064.1 787447929 787421405 787467301 787619650 787838161 787957072 787902236 787817240 787842035 788014352 788268566
2084.5 788268566 788444698 788458049 788432956 788554788 788865983 789193273 789367199 789432347 789527178 789750218
2104.9G89750218L53158L30150J21892l9816O199J58846K58148J94311q941j46091
2125.3G90978074p4923J14977K34306J57357l0876j36077l8982J70053K77400J69813
2145.7G91821122n3167j39773M768K51592L81827K68757P8619R8288L43680N46754
2166.1G93602467N51760M72605M16636M22419N75721P62105P50840N48362L39628L18348
2186.5G98760891N12123P05957O76573M43280K48491K95878N04970O48320N90920L72589
2206.9H03759992K09212L07084N83708P19726N83410L27051J73867K50220M73797O02722
2227.3H07990789M58539J60515L4750K06291M66705N30004L30150O7532k6881J45614
2247.7H10364008M27544M95374K62797j7643o4552J63257M47572M90606K37822k5332
$$ plain form
2104.9 789750218 790103376 790433526 790555418 790515602 790521801 790680647 790938795 791133106 791124165 790978074
2125.3 790978074 790903151 791018128 791252434 791409791 791378915 791242838 791203856 791373909 791651309 791821122
2145.7 791821122 791767955 791628182 791632950 791884542 792266369 792535126 792613745 792712033 793055713 793602467
2166.1 793602467 794154227 794626832 795043468 795465887 796041608 796803713 797554553 798102915 798442543 798760891
2186.5 798760891 799273014 799978971 800655544 801098824 801347315 801643193 802148163 802796483 803387403 803759992
2206.9 803759992 803969204 804276288 804859996 805579722 806163132 806490183 806664050 806914270 807388067 807990789
2227.3 807990789 808449328 808609843 808644593 808850884 809317589 809847593 810177743 810245275 810218394 810364008
2247.7 810364008 810791552 811286926 811549723 811532080 811467528 811630785 812078357 812568963 812806785 812781453
2268.1H12781453k265K88606N28574M53651J54972o6877m231K65300M33087L06666
2288.5H15138936j6928k42352j62125J22011L34680K54214p9036l52323l08931k8193
2308.9H14659953J59443N4597j91748l66568l93212k25842P629j0907l21925n47588
2329.3H12823832l97444n6803J9312k61068n67139n39124r5903M35590M64738r3460
2349.7H11732531p42436r86814o74188j96279p867j71602l11196j53422J96397M29213
2370.1H09114337L64542J56105j3650j4007K26796M38273L03685j00553m34577m50850
2390.4H09590101j88887L4273n1260l67820o04988n50389k99275j26540k13802m98295
2410.8H06723118p31468p00355m62413k91645m11988p33196r37820q41975n41687l75629
$$ plain form
2268.1 812781453 812779188 813067794 813596368 814050019 814204991 814138114 814133883 814399183 814832270 815138936
2288.5 815138936 815122008 814879656 814717531 814839542 815174222 815428436 815349400 814997077 814688146 814659953
2308.9 814659953 814819396 814873993 814682245 814315677 813922465 813696623 813704252 813693345 813371420 812823832
2329.3 812823832 812426388 812369585 812388897 812127829 811560690 811021566 810925663 811361253 811825991 811732531
2349.7 811732531 810990095 810003281 809329093 809132814 809124947 808953345 808642149 808488727 808685124 809114337
2370.1 809114337 809478879 809634984 809621334 809607327 809834123 810272396 810576081 810475528 810040951 809590101
2390.4 809590101 809401214 809435487 809384227 809016407 808411419 807861030 807561755 807435215 807221413 806723118
2410.8 806723118 805991650 805291295 804828882 804537237 804125249 803392053 802454233 801612258 801070571 800694942
2431.2H00694942n43296q61406j020968q77798n72264m23491o05404r31979j065254
2449.6G93793082q60810n37038m20332n97477q84175r83596p57992m26829l55959o06477
2470G87362397r04262r33588o70731m14431m09901o11782q01921p78020n29766k82049
2490.4G81025946k71797n10812p20858o67215l79264j21474j87099m86017o79969n80013
2510.8G76421428k98322j46687l03745o39796q43346p38323m85063l57210m94361q04842
2531.2G71309733r74655q40485n94437n17428o83069r34065j047074r03905o24895
2549.5G64189720n04672o86527r67741j041352q50559o19888n70297p33078r48131
2567.9G57267475r66847p47025n33700n45144p39515r13858q90672o94216n30243n23805
$$ plain form
2431.2 800694942 800151646 799290240 798269272 797391474 796819210 796395719 795790315 794858336 793793082
2449.6 793793082 792932272 792395234 791974902 791377425 790493250 789509654 788751662 788324833 787968874 787362397
2470 787362397 786458135 785524547 784853816 784439385 784029484 783417702 782615781 781837761 781307995 781025946
2490.4 781025946 780754149 780243337 779522479 778855264 778476000 778354526 778167427 777681410 777001441 776421428
2510.8 776421428 776123106 775976419 775672674 775032878 774189532 773451209 772966146 772608936 772114575 771309733
2531.2 771309733 770335078 769494593 768900156 768382728 767699659 766765594 765718520 764814615 764189720
2549.5 764189720 763685048 762998521 762030780 760989428 760138869 759518981 758948684 758215606 757267475
2567.9 757267475 756300628 755553603 755019903 754474759 753735244 752821386 751930714 751236498 750706255 750182450
2588.3G50182450o46591p54476o85751m75169l28064l87966n98431p94232q05616o23763
2608.7G44082391n28574p05600j008391j218736j191914r97603r05991j035511j273096
2627G35216975j447022j437723j281560j166224j280010j525939j620888j488805j278520
2645.4G22690284j191497j299858j473665j526952j409948j213491j101851j204312
2661.7G12268710j387894j431525j309156j123250j017511j093864j245379j244724
2678G02415407j062215r08255r10580j023591j176715j219094j102030j000166j050115
2696.4F92962646j220703j371622j395225j288712j171947j179516j328528j471460
2712.7F82534933j418769j189351j022399j072466j210630j269698j177728r43363
$$ plain form
2588.3 750182450 749535859 748781383 748095632 747620463 747292399 746904433 746306002 745511770 744706154 744082391
2608.7 744082391 743553817 742848217 741839826 740621090 739429176 738431573 737525582 736490071 735216975
2627 735216975 733769953 732332230 731050670 729884446 728604436 727078497 725457609 723968804 722690284
2645.4 722690284 721498787 720198929 718725264 717198312 715788364 714574873 713473022 712268710
2661.7 712268710 710880816 709449291 708140135 707016885 705999374 704905510 703660131 702415407
2678 702415407 701353192 700444937 699534357 698510766 697334051 696114957 695012927 694012761 692962646
2696.4 692962646 691741943 690370321 688975096 687686384 686514437 685334921 684006393 682534933
2712.7 682534933 681116164 679926813 678904414 677831948 676621318 675351620 674173892 673230529
2729F73230529p58052q06749r95278j077175r77099q14379p09176p42376r02593r94205
2749.4F64453447q75831o87957o15537o73532p92027q22723o93321n65708o03318p85291
2769.8F57338202r58323r68338q54909q18670r32514j147390j369834j443922j344920
2788.2F47499382j251816j343847j592397j795113j811624j727700j714289j869798
2804.5F34392798k123058k273500k269745k209186k200365k325356k520562k626776
2820.8F15844250k612889k566516k598227k779305l020465l159761l160060l139555
2837.1E92807472l259599l548265l889322m156649m248560m154146l940224l609598
2853.4E62001109l213227k914369k800464k924681l340781l943086m539489m994035
$$ plain form
2729 673230529 672472477 671665728 670670450 669593275 668616176 667801797 667092621 666350245 665447652 664453447
2749.4 664453447 663577616 662889659 662274122 661600590 660808563 659985840 659292519 658726811 658123493 657338202
2769.8 657338202 656379879 655411541 654556632 653737962 652805448 651658058 650288224 648844302 647499382
2788.2 647499382 646247566 644903719 643311322 641516209 639704585 637976885 636262596 634392798
2804.5 634392798 632269740 629996240 627726495 625517309 623316944 620991588 618471026 615844250
2820.8 615844250 613231361 610664845 608066618 605287313 602266848 599107087 595947027 592807472
2837.1 592807472 589547873 585999608 582110286 577953637 573705077 569550931 565610707 562001109
2853.4 562001109 558787882 555873513 553073049 550148368 546807587 542864501 538325012 533330977
2869.7E33330977n240619n337000n385578n328238m973650m270434l430069k671212
2886.1D96694177j988470j388550r66877p09086n88179o13987p45357r65535j263440
2904.4D87464696j554191j831174k221793k772957l371894l840983m047692l961503
2920.7D63862509l618956l072292k336502j406282l35872Q83013K228558L420681M316330
2939.1D63941187N018770N528629N840451N994230O028563O005198N951017N892217
2955.4E10200262N870044N821228N579174N113244M628777M307032M097939L896176
2971.7E49513876L698647L545285L475189L406763L198504K877474K513051K150417
2988E74379206J892149J694322J415133J083970P40588L71933O2227j71780m09723
$$ plain form
2869.7 533330977 528090358 522753358 517367780 512039542 507065892 502795458 499365389 496694177
2886.1 496694177 494705707 493317157 492350280 491641194 491053015 490439028 489693671 488728136 487464696
2904.4 487464696 485910505 484079331 481857538 479084581 475712687 471871704 467824012 463862509
2920.7 463862509 460243553 457171261 454834759 453428477 453092605 453975618 456204176 459624857 463941187
2939.1 463941187 468959957 474488586 480329037 486323267 492351830 498357028 504308045 510200262
2955.4 510200262 516070306 521891534 527470708 532583952 537212729 541519761 545617700 549513876
2971.7 549513876 553212523 556757808 560232997 563639760 566838264 569715738 572228789 574379206
2988 574379206 576271355 577965677 579380810 580464780 581205368 581577301 581639528 581467748 581058025
3006.4E81058025o82056r86874j300156j564503j755118j917303k089500k252340k390266
3024.7E66119909k491116k504826k489984k559066k729594k877653k829254k705991
3041.1E44932425k742708k914726l063918l082335l001034k936542k940237l011883
3057.4E21239042l077209l030717k911985k833962k891243l051639l130912l020525
3073.7D97290850k776087k652943k802461k980262l007919k977133k883434k776742
3090D74433869k842128k969533k915860k730935k659411k744466k774387k671093k594322
3108.4D49531734k646685k612620k422571k400279k559394k716631k814889k711743
3124.7D28646922k487093k409309k486110k516657k379090k182841k149880k318084
$$ plain form
3006.4 581058025 580375969 579389095 578088939 576524436 574769318 572852015 570762515 568510175 566119909
3024.7 566119909 563628793 561123967 558633983 556074917 553345323 550467670 547638416 544932425
3041.1 544932425 542189717 539274991 536211073 533128738 530127704 527191162 524250925 521239042
3057.4 521239042 518161833 515131116 512219131 509385169 506493926 503442287 500311375 497290850
3073.7 497290850 494514763 491861820 489059359 486079097 483071178 480094045 477210611 474433869
3090 474433869 471591741 468622208 465706348 462975413 460316002 457571536 454797149 452126056 449531734
3108.4 449531734 446885049 444272429 441849858 439449579 436890185 434173554 431358665 428646922
3124.7 428646922 426159829 423750520 421264410 418747753 416368663 414185822 412035942 409717858
3141D09717858k455264k417475k247513k016067j925499k117753k328991k272904k080918
3159.4C89855474j955479j950979k003014j999498j938462j861602j812130j803905
3175.7C74530405j803726j785100j740247j672923j628578j634479j658320j665354
3192C60941678j641094j591236j523554j479775j481443j473934j411974j345337j319825
3210.3C47673506j332969j353681j316965j245111j198500j190096j232624j251072
3226.7C37552488j152903r91046r40443j097738j238376j197308j095772r66996q32975
3245C28038931q50082r86307j009554q93921p98702q24571q75622q43018q06063p92712
3265.4C19358379o76304n25743o06150q14587q93086q41021p35492o65098o65158o87450
$$ plain form
3141 409717858 407262594 404845119 402597606 400581539 398656040 396538287 394209296 391936392 389855474
3159.4 389855474 387899995 385949016 383946002 381946504 380008042 378146440 376334310 374530405
3175.7 374530405 372726679 370941579 369201332 367528409 365899831 364265352 362607032 360941678
3192 360941678 359300584 357709348 356185794 354706019 353224576 351750642 350338668 348993331 347673506
3210.3 347673506 346340537 344986856 343669891 342424780 341226280 340036184 338803560 337552488
3226.7 337552488 336399585 335408539 334468096 333370358 332131982 330934674 329838902 328871906 328038931
3245 328038931 327188849 326202542 325192988 324299067 323500365 322675794 321800172 320957154 320151091 319358379
3265.4 319358379 318682075 318156332 317550182 316735595 315842509 315001488 314265996 313600898 312935740 312248290
3285.8C12248290o55294n41746m95852o40332q18849q81404q02665n91219m38183n58019
3306.2C05824727q34167j016826j020848r14842q49724q53717q43645p78883p51496
3324.6B97960579q95112j031936r64403q78900q60870p88838p92771r27031j015246
3342.9B89805472j055867j006394q47012q65370j084775j140922r45747q05885q94725
3361.3B81158775r41127p57874o99520r65237j223237j161545r02921p48724p40468
3379.6B73018122q19028q17507o51270m44264k67177l20524o28561p38919l92944q5234
3400B67852694l59625p66873o57439l36677k47032l01987l77535l97295k98381k30163
3420.4B63879687j91659k9624J32472J56909Q7321J42216K78265J63436r2864r8378
$$ plain form
3285.8 312248290 311592996 311051250 310555398 309915066 309096217 308214813 307412148 306820929 306382746 305824727
3306.2 305824727 304990560 303973734 302952886 302038044 301188320 300334603 299490958 298712075 297960579
3324.6 297960579 297065467 296033531 295069128 294190228 293329358 292540520 291747749 290820718 289805472
3342.9 289805472 288749605 287743211 286896199 286030829 284946054 283805132 282859385 282053500 281158775
3361.3 281158775 280217648 279459774 278760254 277795017 276571780 275410235 274507314 273758590 273018122
3379.6 273018122 272199094 271381587 270730317 270286053 270018876 269698352 269069791 268330872 267937928 267852694
3400 267852694 267493069 266726196 266068757 265732080 265485048 265183061 264805526 264408231 264109850 263879687
3420.4 263879687 263688028 263658404 263790876 263947785 264035106 264177322 264455587 264619023 264526159 264427781
3440.8B64427781J27256K94477L39150L57777M27634M68641M63098N78255P13318O10084
3461.2B68807471N66363Q38578J004368P26581L32623L49820O64890R21607R08643
3479.6B75120944O67393O36071Q50290Q50976P22944Q01802R29296J003742J011163
3497.9B82594621R79424R53823Q06540O59764P40588R93669J228094J118421P88361
3516.3B90863305P89345J109182J367987J234471Q85904Q21203J017243J199245J307220
3534.6C00595105J265049J152903J296371J529217J481890J246184J243204J395613
3551C11205536J461387J540005J720637J953185K080291J929283J713753K018422K517611
3569.3C28140110K512932K378553K480238K686054K906948L118426L124773K848953
$$ plain form
3440.8 264427781 264555037 264849514 265188664 265546441 265974075 266442716 266905814 267484069 268197387 268807471
3461.2 268807471 269373834 270212412 271216780 271943361 272275984 272625804 273290694 274212301 275120944
3479.6 275120944 275788337 276424408 277274698 278125674 278848618 279650420 280579716 281583458 282594621
3497.9 282594621 283574045 284527868 285334408 285994172 286734760 287728429 288956523 290074944 290863305
3516.3 290863305 291652650 292761832 294129819 295364290 296250194 297071397 298088640 299287885 300595105
3534.6 300595105 301860154 303013057 304309428 305838645 307320535 308566719 309809923 311205536
3551 311205536 312666923 314206928 315927565 317880750 319961041 321890324 323604077 325622499 328140110
3569.3 328140110 330653042 333031595 335511833 338197887 341104835 344223261 347348034 350196987
3585.6C50196987K752871L155589L332019L324955L481776L638089L658771L690750
3601.9C77231807L675282L506124L600180L885865L968269M048824L985524L943175
3618.3D07845050M293889M268259L865123L502190L713458M491687M407227M144758
3634.6D40531641M090578M006594M043371M181891M119426L836513L877342M306286
3650.9D72993642M086942L695815M035324M237682L788978L517300L633558L509015
3667.2E03498256L288329L528952L198445K793014L266394L362597L163039L160835
3683.5E29259861L101706K858579K496004K417982K511382K454638K320111K138198
3699.8E49558461K094745K303601K359450K103626J696646J655102K113343K204835
$$ plain form
3585.6 350196987 352949858 356105447 359437466 362762421 366244197 369882286 373541057 377231807
3601.9 377231807 380907089 384413213 388013393 391899258 395867527 399916351 403901875 407845050
3618.3 407845050 412138939 416407198 420272321 423774511 427487969 431979656 436386883 440531641
3634.6 440531641 444622219 448628813 452672184 456854075 460973501 464810014 468687356 472993642
3650.9 472993642 477080584 480776399 484811723 489049405 492838383 496355683 499989241 503498256
3667.2 503498256 506786585 510315537 513513982 516306996 519573390 522935987 526099026 529259861
3683.5 529259861 532361567 535220146 537716150 540134132 542645514 545100152 547420263 549558461
3699.8 549558461 551653206 553956807 556316257 558419883 560116529 561771631 563884974 566089809
3716.2E66089809J917899J626849J519978J516402J670062J894951J744807J437783
3732.5E79418540J263738J469075J905620J774669R17733N99980J433790J293659P96318
3750.8E90873122J312852J693964J388550J052499J209497J368165J232565J089275
3767.1F01220489R35673J017034J286030J349211J170933R15349R01281R33648R51230
3785.5F10680878J063049J096547J083851J003205R36091J018822P25151N40971R74298
3803.9F19122863P89225O76870J158059J263082Q61645O51121Q39114M92811N21302
3822.2F26376092J028955R32873P49349O85811Q05259R96173O55770K76863N26429
3840.6F33033574O83546P60555J019657J058638M20928o37412N1379J370609J216113
$$ plain form
3716.2 566089809 568007708 569634557 571154535 572670937 574340999 576235950 577980757 579418540
3732.5 579418540 580682278 582151353 584056973 585831642 586749375 587349355 588783145 590076804 590873122
3750.8 590873122 592185974 593879938 595268488 596320987 597530484 598898649 600131214 601220489
3767.1 601220489 602156162 603173196 604459226 605808437 606979370 607894719 608796000 609729648 610680878
3785.5 610680878 611743927 612840474 613924325 614927530 615863621 616882443 617607594 618148565 619122863
3803.9 619122863 619912088 620588958 621747017 623010099 623871744 624522865 625361979 625854790 626376092
3822.2 626376092 627405047 628337920 629087269 629773080 630578339 631574512 632230282 632507145 633033574
3840.6 633033574 633717120 634477675 635497332 636555970 636976898 636339486 636390865 637761474 638977587
3858.9F38977587P03812M07517N54502O67691L46541L69013N90503P09713P61270N10454
3879.3F44598603N49674O35684M13298N14389M43696J91629M70758P55787O05166L36587
3899.7F49515271J26124R1612L64602N25832M86016N20587M77672K30491J18673L07202
3920.1F52764082L70026K46286L10242M08054K71976K64227M38869L99470K30789J29641
3940.5F55833662J65164L12924L29853K42352K73228L41177L43561L23653K64883J63794
3960.9F58594251J62065K60532K88665K76327K78533K66909K73168K69175K28166K40326
3981.3F61138117K52247J73807J47105K40206K65658K06411K05696J99556
3997.6F62828803
$$ plain form
3858.9 638977587 639681399 640088916 640643418 641311109 641657650 642026663 642617166 643326879 644088149 644598603
3879.3 644598603 645148277 645783961 646197259 646711648 647155344 647346973 647817731 648573518 649178684 649515271
3899.7 649515271 649641395 649733007 650097609 650623441 651109457 651630044 652107716 652338207 652456880 652764082
3920.1 652764082 653134108 653380394 653690636 654098690 654370666 654634893 655073762 655473232 655704021 655833662
3940.5 655833662 655998826 656311750 656641603 656883955 657157183 657498360 657841921 658165574 658430457 658594251
3960.9 658594251 658756316 659016848 659305513 659581840 659860373 660127282 660400450 660669625 660897791 661138117
3981.3 661138117 661390364 661564171 661711276 661951482 662217140 662423551 662629247 662828803
3997.6 662828803
##END=$$ End of the data block
