##TITLE=$$ Begin of the data block
##JCAMP-DX=5.00 $$ ACD/SpecManager v 10.08
##SPECTROMETER/DATA SYSTEM=Alpha
##DATE=29 Dec 2014 11:22:02
##DATA TYPE=INFRARED SPECTRUM
##DATA CLASS=XYDATA
##ORIGIN=
##OWNER=
##NPOINTS=1765
##FIRSTX=399.76428223
##LASTX=3997.64306641
##MAXX=3997.64306641
##MINX=399.76428223
##MAXY=0.81719393
##MINY=0.19861187
##XFACTOR=1.0000000000
##YFACTOR=1.000000000000000e-9
##FIRSTY=0.49221250
##DELTAX=2.03961372
##XUNITS=1/CM
##YUNITS=ARBITRARY UNITS
##XYDATA=(X++(Y..Y))
399.8 492212504 486637324 481704861 477393150 475277603 476715118 480631679 484311432 486122757
416.1 486122757 485812366 483569503 481500775 479805768 476908088 472639978 468195617 464657366 462412268
434.4 462412268 461346984 461198270 462467790 466177553 472084492 478272378 482606888 484228849 484028369
452.8 484028369 483839661 484484106 484546691 482748002 479286999 475128859 471741945 469560534 467274547
471.2 467274547 463496000 459106535 455889881 454431474 454176664 454076827 453483164 452621549 452043802
489.5 452043802 451826394 451453328 450123876 447570622 444531888 441867113 439797938 437678695 434432507
507.9 434432507 429950893 425278246 421213180 417491227 413364142 408877701 404943585 402458370
524.2 402458370 401710927 402027756 402606070 403467774 405232430 408790588 414517850 421367854 427401185
542.5 427401185 431225449 432702988 432654172 432022214 430920154 428706616 425091207 420545071 415750772
560.9 415750772 410854220 405213743 398221493 390583426 384177595 380615801 380344391 382788867 387256563
579.3 387256563 393433720 400889069 408801675 416161895 421900928 425417751 426931202 427337408 427544236
597.6 427544236 427753806 427628964 427120060 426599532 426592082 427465588 428958148 430606306 432368010 434703261
618 434703261 438112736 442488790 447107196 451069087 454106718 456703871 459377795 462105364 464397997
636.4 464397997 465863317 466730922 467638791 469013453 470754504 472371936 473552197 474476993 475549281
654.7 475549281 477041781 478834510 480402857 481378198 481890142 482668668 484703928 486936599 488564581
673.1 488564581 489871323 491190761 492848635 494827569 496714264 498028934 498607337 498719424 498730004
691.4 498730004 498548537 497579008 495215684 491668195 487969577 485046506 483149588 482106388 481898159
709.8 481898159 482900292 485546440 489918619 495494276 501472235 507382929 513308287 519587338
726.1 519587338 526122093 532193899 537057817 540590703 543381035 546048820 548521578 549956918
742.4 549956918 549571872 547412336 544153452 540357292 536133170 531226933 525585234 519876301 515167117
760.8 515167117 512199461 511034966 511502445 513785958 518301487 525218248 534257233 544507980
777.1 544507980 554528356 563323319 571048856 578303099 585108936 591014504 595715582 599534273
793.4 599534273 603389680 608149946 613724709 618972600 622846484 625332117 627277970 629362404
809.7 629362404 631335378 632407725 632340848 631846666 631823659 632255495 632146001 630490422 627064228
828.1 627064228 622501791 617639959 612740993 607392013 601305604 594956577 589180648 584390283
844.4 584390283 580242038 575876653 570673585 564677894 558295250 551963627 546387553 543271601
860.7 543271601 544801772 551746428 563039660 577063501 592003345 605616271 616139174 623167455
877 623167455 627136588 628222942 626144648 620938599 613573074 605674326 598557889 592421591 586559474
895.4 586559474 580354631 573859096 567473412 561228693 554438412 546174645 536055505 524540246
911.7 524540246 512553096 500878274 490048081 480609298 473199785 468330592 465984702 465553910
928 465553910 466304868 467817694 470041305 473202288 477625936 483269870 489131510 493131578 493139237
946.4 493139237 488361359 479432583 467304707 452635586 436075479 418431014 400419056 382358581
962.7 382358581 364120901 345409840 326187342 306809604 287814975 269728333 252987832
977 252987832 237982824 225121707 214808807 207272202 202369854 199660838 198611870 198687777 199494913
995.3 199494913 200850070 202617407 204489976 206105500 207230359 207777515 207921088 208002836 208281010
1013.7 208281010 208876163 209893733 211471006 213712320 216620281 220066950 223747551 227318436
1030 227318436 230635390 233613029 236003399 237549156 238302171 238572150 238762438 239279926 240461022
1048.4 240461022 242598370 245928660 250533789 256365746 263422668 271734297 281166971 290831715
1064.7 290831715 298461527 300957918 296632379 287244022 277048528 269547254 265677989 264863014
1081 264863014 266371459 269555360 273777515 278616101 283953518 289660186 295332313 300290883 303812265
1099.4 303812265 305587232 306121677 306586772 308132738 311127663 315073937 319189698 322965831 326292098
1117.7 326292098 329142004 331417412 333184451 334949046 337566406 341637760 346731424 351347536
1134 351347536 353717268 352743477 348525703 342059612 334521890 326757669 319292456 312627971 307302326
1152.4 307302326 303639233 301606923 300949663 301464528 303268284 306769878 312421024 320375264 330371648
1170.7 330371648 341882586 354355425 367460340 381123990 395183861 409090042 422127396
1185 422127396 433784574 443886220 452420086 459324270 464486718 467974275 470252097 472116977
1201.3 472116977 474297106 477050424 480310261 484046668 488415748 493645549 499619365 505633175
1217.7 505633175 510664463 513972282 515546501 515905976 515549660 514633536 513053060 510836005 508397758
1236 508397758 506299675 504840255 504033983 503817260 504174232 505225241 507090628 509576797 512115717
1254.4 512115717 514101505 515319407 516066551 516913891 518346906 520475805 522974312 525364578 527371705
1272.7 527371705 528928041 529947579 530245900 529723048 528639853 527522683 526707172 526092529 525249004
1291.1 525249004 523758709 521581709 519076467 516669869 514516115 512438893 510141253 507585883
1307.4 507585883 505256236 503634810 502585888 501623333 500396490 498780102 496696681 493858606
1323.7 493858606 489833087 484503120 478347838 472208560 466874063 462808907 460065365 458400667
1340 458400667 457552284 457344979 457662374 458277911 458758563 458756089 458198577 457275659 456333816 455578864
1360.4 455578864 454925388 454307884 453751862 453343809 453407794 454210043 455562800 456813961 457684934
1378.8 457684934 458460242 459826231 462632984 467174351 472095549 475793809 478241175 479584515
1395.1 479584515 479808301 479053110 477628410 475776762 473522455 471227378 469057232 466824234 464614004
1413.5 464614004 462699622 461066514 459779292 459282577 459426939 459840119 460494876 461515933 462948471
1431.8 462948471 464694858 466754436 468794793 470385373 471905291 473435849 474609077 474896371
1448.1 474896371 474106580 472674817 471049726 468887329 466446131 465518028 466020733 467890590 471293181
1466.5 471293181 476017535 482782602 492815375 503596663 512771010 521139503 529432535 537646472
1482.8 537646472 545129120 552130520 559157670 565797210 571253657 576403618 581954122 586829305
1499.1 586829305 590721965 594231725 598343253 603433609 606978774 609291255 611640096 614299595
1515.4 614299595 617296696 620228827 623033524 625324130 627158284 629105031 631095767 633166671
1531.8 633166671 635170758 636738777 638249695 640115798 641417623 642007113 642392278 642664611 642843246
1550.1 642843246 643016815 643390238 643892884 643669486 641856790 640352547 639279187 638265193 636924922
1568.5 636924922 634906888 632979691 631144106 628669143 626195014 624037087 621648192 619029820
1584.8 619029820 616354585 613722324 611085296 608352005 605413914 602321625 599251688 596270263
1601.1 596270263 593332887 590322554 587099254 583501637 579806864 576398849 572701931 568160057
1617.4 568160057 564327538 561073124 557306707 553569973 550084293 546826005 544487357 542989552
1633.7 542989552 541603625 540537536 540195405 540439725 541160643 542385995 544009566 545684993 548140466
1652.1 548140466 551627398 554229259 556661665 559808671 563842416 568226814 572254896 576670706
1668.4 576670706 581723511 586359024 591364264 597001314 602163374 607076466 612711370 619705856
1684.7 619705856 625583470 630395651 635333359 639781237 644326448 649034739 653192997 657216847
1701.1 657216847 660191596 662445426 664625943 666648865 668788433 671162784 673650801 676097929
1717.4 676097929 678122759 679969668 682137668 684607267 687062740 689493775 691883683 694550574
1733.7 694550574 697223544 699475050 701856256 704350650 706842482 709603131 712763846 716289163
1750 716289163 719741225 722700894 725580275 728559911 731444120 734324574 736797690 738843560 740849733
1768.4 740849733 742881715 744910002 746684968 748092055 749358416 750637650 751947463 753319800
1784.7 753319800 754711986 756014526 757222474 758373022 759460688 760624409 761884511 763023138
1801 763023138 763918161 764760494 765780151 766973197 768113554 768957913 769610167 770318270 771209180
1819.4 771209180 772226810 773210943 774002731 774613798 775209904 775848150 776529729 777163446 777637541
1837.7 777637541 778007925 778436422 778990805 779533684 779900670 780091763 780211151 780420303 780812740 781309307
1858.1 781309307 781741679 781970382 782117546 782411814 782856345 783266902 783538401 783723354 783914626 784256577
1878.5 784256577 784807861 785435796 785949826 786312461 786623061 787010729 787522376 788015485 788316667 788425624
1898.9 788425624 788508713 788720548 789073348 789420307 789585888 789569855 789583087 789802730 790195525 790553987
1919.3 790553987 790684044 790642977 790663660 790888846 791236997 791518867 791603625 791553736 791597366 791861832
1939.7 791861832 792234182 792462409 792465806 792427540 792581379 792970121 793404341 793691099 793810070 793914020
1960.1 793914020 794154108 794521868 794869423 795074403 795132756 795173943 795349717 795648217 795907557 796007752
1980.5 796007752 796012878 796052158 796198249 796446025 796668231 796697557 796574652 796513200 796618044 796783626
2000.9 796783626 796799541 796603322 796334326 796134949 796005905 795854867 795571923 795130432 794620872 794151425
2021.3 794151425 793735564 793332994 792955458 792541862 792051256 791600108 791266799 790969551 790583849 790105402
2041.7 790105402 789669633 789394975 789233148 789070785 788847327 788610101 788485825 788530886 788673520 788788140
2062.1 788788140 788823962 788826168 788873553 789026916 789234161 789338291 789292455 789220333 789271355 789465845 789694846
2084.5 789694846 789852679 789893508 789903522 790046096 790346742 790638864 790802896 790891707 791014075 791250765
2104.9 791250765 791578472 791858971 791980743 791992307 792044878 792234957 792490482 792639256 792607546 792485476
2125.3 792485476 792428076 792535365 792757094 792911828 792889893 792770147 792747438 792918742 793168604 793285310
2145.7 793285310 793194652 793063581 793106735 793394506 793785393 794053376 794156194 794291139 794644415 795179129
2166.1 795179129 795731425 796204090 796597540 797001183 797581434 798361123 799130261 799676895 800001442 800320625
2186.5 800320625 800835192 801533341 802214146 802675068 802948296 803256869 803758740 804409981 805008888 805389166
2206.9 805389166 805592895 805881977 806460261 807197034 807800293 808132827 808307707 808573186 809074640 809686959
2227.3 809686959 810144067 810309529 810332775 810504079 810939729 811467648 811802864 811871827 811880589 812072754
2247.7 812072754 812492728 812954903 813198507 813163996 813110769 813321054 813798904 814268112 814466000 814422905
2268.1 814422905 814418912 814713895 815249979 815710366 815872848 815808535 815799832 816066206 816522062 816851497
2288.5 816851497 816826463 816569328 816437304 816619694 816974759 817193925 817095876 816777825 816507638 816490650
2308.9 816490650 816640735 816670299 816414475 815960824 815561056 815441608 815541446 815488756 815051675 814527035
2329.3 814527035 814322293 814329565 814224660 813895583 813338876 812799871 812738061 813242435 813716710 813598812
2349.7 813598812 812883437 811930478 811217070 810977638 810977638 810866714 810623646 810436308 810543418 811004460
2370.1 811004460 811479509 811610579 811457515 811371863 811582088 811964095 812205851 812092781 811683178 811267674
2390.4 811267674 811101198 811141312 811088562 810718417 810118973 809574604 809280992 809166968 808941424 808397055
2410.8 808397055 807627559 806935430 806518018 806245983 805808783 805041671 804090679 803276122 802777529 802410245
2431.2 802410245 801844299 800955474 799909472 799035549 798507333 798110366 797470272 796504796 795471013
2449.6 795471013 794659615 794132411 793693304 793059826 792147040 791186273 790458202 790001571 789583802 788943827
2470 788943827 788060725 787171543 786526501 786120832 785727024 785130441 784307539 783487916 782947481 782681584
2490.4 782681584 782416940 781914890 781188965 780480802 780094802 780025840 779883504 779394925 778689086 778110147
2510.8 778110147 777825713 777667344 777342677 776699007 775865912 775136948 774677217 774341881 773820341 772983551
2531.2 772983551 772017241 771192074 770603418 770106852 769431233 768453777 767372489 766495109 765897930
2549.5 765897930 765365064 764628112 763650298 762646258 761819720 761186540 760613739 759901106 758959472
2567.9 758959472 757977366 757214665 756679595 756129682 755350530 754394174 753511488 752873123 752411246 751918137
2588.3 751918137 751240611 750433028 749720812 749250174 748930335 748519361 747865140 747072101 746357560 745785415
2608.7 745785415 745205224 744440138 743443191 742282987 741128087 740122437 739208162 738165438 736855149
2627 736855149 735395312 734001219 732761145 731582403 730274320 728747845 727112949 725590944 724313319
2645.4 724313319 723155856 721862435 720364928 718836963 717457294 716272056 715150416 713884175
2661.7 713884175 712450445 711019397 709753394 708680034 707662106 706533909 705274701 704022288
2678 704022288 702931464 702026367 701161385 700137496 698932350 697717011 696629345 695639133 694599390
2696.4 694599390 693385482 692018688 690639257 689355671 688161016 686945260 685573876 684075534
2712.7 684075534 682659745 681486428 680494189 679469943 678290904 677028120 675862253 674923658 674128532
2731.1 674128532 673262000 672229111 671145797 670199990 669442892 668746054 667958856 667028487 666042745
2749.4 666042745 665180802 664504707 663899243 663217366 662398338 661554456 660874188 660350740 659771204 658990681
2769.8 658990681 658040285 657062232 656189024 655365586 654410005 653231323 651882052 650492489 649164200
2788.2 649164200 647879303 646501124 644907176 643116951 641278088 639526010 637815595 635956705
2804.5 635956705 633845270 631557167 629275560 627101183 624926150 622578800 620024323 617379069
2820.8 617379069 614751875 612147808 609498262 606714904 603736758 600595593 597418785 594258368
2837.1 594258368 590989888 587438047 583540559 579379141 575119078 570914745 566901028 563242495
2853.4 563242495 560008049 557104707 554344773 551424384 548032939 544054806 539514422 534507751
2869.7 534507751 529253185 523917377 518522024 513165236 508144319 503815293 500350058 497705698
2886.1 497705698 495757043 494348943 493338257 492618531 492061496 491493642 490772128 489815980 488580763
2904.4 488580763 487044424 485174745 482901484 480127484 476771295 472904474 468831092 464894593
2920.7 464894593 461308062 458240539 455909699 454508156 454169273 455040634 457218349 460605651 464941323
2939.1 464941323 469969451 475489497 481319368 487316877 493377358 499414563 505380332 511299849
2955.4 511299849 517245471 523152113 528763354 533894300 538563728 542880654 546960413 550880551
2971.7 550880551 554638445 558221877 561707735 565137804 568402886 571343899 573875964 576026320
2988 576026320 577908993 579601467 581051886 582180977 582938492 583319366 583386123 583190262 582747281
3006.4 582747281 582062423 581118166 579876125 578346133 576615334 574723780 572635412 570362985 567945838
3024.7 567945838 565434754 562929094 560433388 557845712 555091858 552226186 549423456 546711206
3041.1 546711206 543951988 541047215 537976027 534862280 531844139 528893352 525917888 522848666
3057.4 522848666 519716620 516660392 513757825 510932982 508028030 504970610 501853883 498839617
3073.7 498839617 496036679 493352741 490555763 487589985 484568596 481571764 478677899 475874186
3090 475874186 473005950 470055908 467156112 464388222 461699724 458952934 456164330 453482449 450867116
3108.4 450867116 448170215 445520759 443066299 440630794 438048005 435319692 432535529 429850399
3124.7 429850399 427333146 424903363 422430396 419908762 417500287 415290266 413107723 410741895
3141 410741895 408266544 405876011 403621942 401526034 399543107 397449136 395146459 392844200 390723377
3159.4 390723377 388751477 386784226 384756148 382739723 380794436 378915876 377070218 375231206
3175.7 375231206 373402745 371637315 369942665 368258774 366585374 364936620 363253981 361545682
3192 361545682 359925926 358397901 356887221 355361700 353825152 352349877 350969583 349595129 348211497
3210.3 348211497 346891463 345604509 344303906 343012393 341732264 340460807 339211822 337992191
3226.7 337992191 336815208 335733563 334754735 333703041 332503766 331309766 330202729 329202026
3243 329202026 328313142 327416122 326405734 325414956 324564934 323765904 322929233 322052568 321154267 320289433
3263.4 320289433 319533497 318907589 318373650 317763180 316951305 316059232 315241575 314543813 313901603 313217044
3283.8 313217044 312478781 311778069 311220497 310707659 310055256 309285492 308468908 307656795 306980371 306489915
3304.2 306489915 305953562 305101961 304030091 302992761 302094519 301293939 300476313 299591333 298719615
3322.5 298719615 297915578 297035366 296019286 295029640 294117004 293280780 292533070 291704744 290709049
3340.9 290709049 289678723 288675576 287731767 286896884 285994917 284864992 283717275 282749325 281869560
3359.2 281869560 280938148 279975414 279166251 278467059 277573556 276402473 275228560 274306148 273574263
3377.6 273574263 272837788 271984339 271145195 270508081 270092964 269845486 269520819 268866181 268121272 267720699
3398 267720699 267549336 267113864 266369820 265747249 265415430 265182197 264874041 264450312 264020056 263729274
3418.4 263729274 263518453 263317198 263261974 263412625 263627380 263737261 263876021 264181703 264363617 264235795
3438.8 264235795 264084548 264187396 264515758 264924318 265285492 265642852 266078562 266589403 267226309 267958552
3459.2 267958552 268543750 269058794 269906282 270967722 271705389 272028208 272408873 273113251 274018109
3477.5 274018109 274881840 275537878 276188344 277035773 277884275 278632700 279454410 280394733 281397969
3495.9 281397969 282382309 283345342 284289420 285076886 285774261 286586612 287561446 288708061 289812624
3514.2 289812624 290670991 291545182 292701870 294072509 295286953 296154410 296974123 298022866 299280733
3532.6 299280733 300644279 301914394 303037196 304356456 305942446 307464063 308743268 309982687
3548.9 309982687 311370224 312893420 314503074 316240251 318179250 320223391 322127730 323873490
3565.2 323873490 325997442 328615904 331148207 333536327 336057276 338755697 341668308 344852239
3581.5 344852239 348089397 351049036 353840560 356984228 360317647 363634199 367145509 370904118
3597.9 370904118 374695480 378452271 382159233 385717869 389387786 393303245 397253245 401305497
3614.2 401305497 405300647 409234047 413554102 417900622 421882093 425485581 429232866 433743447
3630.5 433743447 438155591 442270726 446322501 450309217 454414904 458705992 462853283 466656595
3646.8 466656595 470559686 474930346 479064137 482784092 486807257 491019517 494809240 498377562
3663.1 498377562 502047420 505519807 508790731 512398243 515668571 518452942 521663070 525000453
3679.4 525000453 528194070 531397104 534501016 537338018 539882123 542399526 544986248 547489762
3695.8 547489762 549800873 551887810 553943038 556256473 558686495 560859203 562515736 564088821
3712.1 564088821 566212237 568416655 570314229 571962118 573480666 574966550 576669574 578646719
3728.4 578646719 580469728 581990600 583313823 584795237 586683333 588407218 589277804 589909315 591427743
3746.7 591427743 592740595 593405724 594559193 596229792 597648561 598730445 600004196 601432741
3763.1 601432741 602692723 603786707 604692876 605692863 606989741 608318090 609449089 610355914 611273170
3781.4 611273170 612236798 613225937 614303648 615406632 616506875 617538214 618491411 619463623 620115638
3799.8 620115638 620620549 621601999 622425437 623114467 624235332 625487924 626388311 627075434 627983987
3818.1 627983987 628592610 629111528 630033553 630941927 631747305 632460415 633235574 634238124 634931326
3836.5 634931326 635153949 635618627 636331141 637142062 638165295 639242709 639786482 639294863 639319062
3854.8 639319062 640578151 641720951 642394841 642824352 643415451 644066632 644377410 644782782 645436764
3873.2 645436764 646159351 646926582 647410214 647842884 648397446 648819566 649339795 649806261 650103569 650687456
3893.6 650687456 651446998 651990771 652316034 652452409 652480960 652799249 653403759 654005051 654517591 654869914
3914 654869914 655031681 655221224 655650437 656095684 656329632 656563580 656909704 657182574 657447934 657862782 658290923
3936.4 658290923 658593476 658767641 658922017 659204960 659550071 659831822 660088122 660353482 660626054 660926104
3956.8 660926104 661246300 661525846 661747754 661958396 662182748 662453473 662716925 662890494 663084209 663400590
3977.2 663400590 663715839 663978040 664245784 664449394 664588094 664784431 665052116 665287793 665469527 665670872
3997.6 665670872
##END=$$ End of the data block
