##TITLE=$$ Begin of the data block
##JCAMP-DX=5.00 $$ ACD/SpecManager v 10.08
##SPECTROMETER/DATA SYSTEM=Alpha
##DATE=26 Dec 2014 10:25:20
##DATA TYPE=INFRARED SPECTRUM
##DATA CLASS=XYDATA
##ORIGIN=
##OWNER=
##NPOINTS=1765
##FIRSTX=399.76428223
##LASTX=3997.64306641
##MAXX=3997.64306641
##MINX=399.76428223
##MAXY=0.78806257
##MINY=0.14164031
##XFACTOR=1.0000000000
##YFACTOR=1.000000000000000e-9
##FIRSTY=0.43727782
##DELTAX=2.03961372
##XUNITS=1/CM
##YUNITS=ARBITRARY UNITS
##XYDATA=(X++(Y..Y))
399.8D37277824n097747l875256k709180j192242Q70973K803832K904207J290679l12775
$$ 437277824 432180077 428304821 425595641 424403399 425274372 428078204 430982411 432273090 431960315
418.1D31960315j087070j560837k579331l075898k988368l391445l558546k849847
$$ 431960315 430873245 429312408 426733077 423657179 420668811 417277366 413718820 410868973
434.4D10868973j650781k4199K053946M153103N478531N724758M836142K903998J099407
$$ 410868973 409218192 409193993 411247939 415401042 420879573 426604331 431440473 434344471 435443878
452.8D35443878M06653K21431p38442k273261l329188l405362l044814l113240l771901
$$ 435443878 435850531 436071962 435333520 433060259 429731071 426325709 423280895 420167655 416395754
471.2D16395754m327149l561973k209127j306385r31620r01968o37918j02610J64539
$$ 416395754 412068605 408506632 406297505 404991120 404059500 403157532 402519614 402417004 402581543
489.5D02581543j85520j237720k222061k295435j911223k127915k783239l328413l698975
$$ 402581543 402396023 401158303 398936242 396640807 394729584 392601669 389818430 386490017 382791042
507.9C82791042l703028l745705m109919m685193n196124m909098l603936k128988
$$ 382791042 379088014 375342309 371232390 366547197 361351073 356441975 352838039 350709051
524.2C50709051j289845q28921r1881J166731K763271M365862N687207O239474N690127
$$ 350709051 349419206 348590285 348498404 349665135 352428406 356794268 362481475 368720949 374411076
542.5C74411076M214287K265215L83079j090974k050042k576917l037989l804207m889548
$$ 374411076 378625363 380890578 381273657 380182683 378132641 375555724 372517735 368713528 363823980
560.9C63823980o048292o999612p520467p311135o037385l754079j037717J693934
$$ 363823980 357775688 350776076 343255609 335944474 329907089 326153010 325115293 326809227
577.2C26809227M334808O530970P806480Q005321P263154N793929M044652K358913
$$ 326809227 331144035 337675005 345481485 353486806 360749960 366543889 370588541 372947454
593.5C72947454R42559n2602m71413l51220j30087j8597J55300O16014J374632K193421
$$ 372947454 373890013 373837411 373365998 373014778 372884691 372866094 373021394 373637408 375012040 377205461
613.9C77205461K782494L139019L557652M145325M654526M654140M048675L253281
$$ 377205461 379987955 383126974 386684626 390829951 395484477 400138617 404187292 407440573
630.2D07440573K724797K471655K273500J994699J584173J183480J073718J299143
$$ 407440573 410165370 412637025 414910525 416905224 418489397 419672877 420746595 422045738
646.6D22045738J484930J310915J000821R60529J214713J392752J273096J038938Q40307
$$ 422045738 423530668 424841583 425842404 426802933 428017646 429410398 430683494 431722432 432562739
664.9D32562739J030385J870960J974255J692653J647472J676351J852751K015501
$$ 432562739 433593124 435464084 437438339 439130992 440778464 442454815 444307566 446323067
681.2D46323067J822412J297355P72565L53515J7941m77165j463979k725005l624112
$$ 446323067 448145479 449442834 450215399 450568914 450586855 450109690 448645711 445920706 442296594
699.6D42296594l821015l384978k611160j653403l61264J346648L177554M697531N694062
$$ 442296594 438475579 435090601 432479441 430826038 430464774 431811422 434988976 439686507 445380569
717.9D45380569O293237O714910P160425P503390P237345O263197N125552M313708
$$ 445380569 451673806 458388716 465549141 473052531 480289876 486553073 491678625 495992333
734.3D95992333L770172L143579K168715P14421r50336k371669l437936m423887n462646
$$ 495992333 499762505 502906084 505074799 505789220 504838884 502467215 499029279 494605392 489142746
752.6D89142746o267578o373197n687534m559458l225237j571059N77569L257245O188989
$$ 489142746 482875168 476501971 470814437 466254979 463029742 461458683 462036252 465293497 471482486
771D71482486Q650869J0167479J0808110J0729790J0120094R155452P878542O375730
$$ 471482486 480133355 490300834 501108944 511838734 521958828 531114280 538992822 545368552
787.3E45368552N077601M576027M911363N332053N373418N182684M921734M684627
$$ 545368552 550446153 555022180 559933543 565265596 570639014 575821698 580743432 585428059
803.6E85428059M300833L475368K335727J337946Q51392R08137Q46207L8981j298845
$$ 585428059 589728892 593204260 595539987 596877933 597729325 598637462 599483669 599522650 598223805
822E98223805k492964l248095l976524n136848o488383p347106p397950o868363o275892
$$ 598223805 595730841 592482746 588506222 583369374 576880991 569533885 562135935 555267572 548991680
840.3E48991680n941152n799830n525947n001009m686296n037784n874991o523610
$$ 548991680 543050528 537250698 531724751 526723742 522037446 516999662 511124671 504601061
856.6E04601061n885124k702147K810270Q393228J2175083J4333248J5371025J4750540
$$ 504601061 498715937 496013790 498824060 507217288 519392371 533725619 549096644 563847184
873E63847184J2000144P844388L548980k96891l529668n979776p680178q710563q920848
$$ 563847184 575847328 583691716 587240696 586943805 583414137 577434361 569754183 561043620 552122772
891.3E52122772q291543p397413o869793o850183p216930p762731q405834r331614
$$ 552122772 543831229 536433816 529564023 522713840 515496910 507734179 499328345 489996731
907.6D89996731j0618061j1914044j2745142j2798131j1824429r842455p237107m555046
$$ 489996731 479378670 467464626 454719484 441921353 430096924 420254469 413017362 408462316
923.9D08462316k267063n32597P77274J908213K930522L826350M775733N768448O051361
$$ 408462316 406195253 405662656 406439930 408348143 411278665 415105015 419880748 425649196 431700557
942.3D31700557M405529L87788m830242r540975j3028919j5437812j7043680j8050075
$$ 431700557 436106086 436493874 431663632 422122657 409093738 393655926 376612246 358562171
958.6C58562171j8585056j8858343j9066840j9219131j9243538j8984258j8294737
$$ 358562171 339977115 321118772 302051932 282832801 263589263 244605005 226310268
972.9B26310268j7224744j5823617j4028118j1818453r342998o878332m679978k889678
$$ 226310268 209085524 193261907 179233789 167415336 158072338 151194006 146514028 143624350
989.2A43624350j508876m75168K96145Q22708J107350J170993J025975O75499J98901
$$ 143624350 142115474 141640306 141936451 142759159 143866509 145037502 146063477 146738976 146937877
1007.6A46937877j80379l10585j80751J59815O65814J260474J862675K398864K813264
$$ 146937877 146757498 146446913 146266162 146425977 147091791 148352265 150214940 152613804 155427068
1025.9A55427068L060118L147974L088832K728582K034560J243293O67035M48034N37082
$$ 155427068 158487186 161635160 164723992 167452574 169487134 170730427 171397462 171845496 172382578
1044.3A72382578Q01683J208156J928076L095567M506797N784139O888226P960453
$$ 172382578 173184261 174392417 176320493 179416060 183922857 189706996 196595222 204555675
1060.6B04555675Q952231R306073P673964K890676l844678q980230r880662p225662
$$ 204555675 213507906 222813979 230487943 233378619 229533941 220553711 210673049 203447387
1076.9B03447387l590718o44416J388639K798155L845036M719109N462318N848870
$$ 203447387 199856669 199212253 200600892 203399047 207244083 211963192 217425510 223274380
1093.2B23274380N599648M638836L217190J814678R00284P85708J525730K688229L659085
$$ 223274380 228874028 233512864 236730054 238544732 239445016 240230724 241756454 244444683 248103768
1111.6B48103768M127204M047692L503412K703935K006084J763582K174586L104448
$$ 248103768 252230972 256278664 259782076 262486011 264492095 266255677 268430263 271534711
1127.9B71534711M084289M461199L694266J665056j227021m225373o572009p791221
$$ 271534711 275619000 280080199 283774465 285439521 284212500 279987127 273415118 265623897
1144.2B65623897p905483p230639o107033m790216l388688j933024m76435R41694K418429
$$ 265623897 257718414 250487775 244380742 239590526 236201838 234268814 233792379 234734073 237152502
1162.6B37152502M092380O023080Q105039J0115922J1772483J2881637J3522357J3955861
$$ 237152502 241244882 247267962 255373001 265488923 277261406 290143043 303665400 317621261
1178.9C17621261J4257431J4197230J3570935J2346029J0665238Q789480O912052N091548
$$ 317621261 331878692 346075922 359646857 371992886 382658124 391447604 398359656 403451204
1195.2D03451204L478855K371282J957595K137631K631605L232747L926337M793554
$$ 403451204 406930059 409301341 411258936 413396567 416028172 419260919 423187256 427980810
1211.5D27980810N687774O220400O027043M976600L386498J813143N49168m43638j293838
$$ 427980810 433668584 439888984 445916027 450892627 454279125 456092268 456641436 456197798 454903960
1229.9D54903960j990676k311051k156078j766265j375824r25243k41369P06792J708567
$$ 454903960 452913284 450602233 448446155 446679890 445304066 444378823 444137454 444844246 446552813
1248.2D46552813K433270K677113K490401K097547J709968J460701J391471J529008
$$ 446552813 448986083 451663196 454153597 456251144 457961112 459421813 460813284 462342292
1264.6D62342292J929015K462119K774477K557009J825869Q63403l1709n81354p00832
$$ 462342292 464271307 466733426 469507903 472064912 473890781 474754184 474722475 474141121 473440289
1282.9D73440289o39349o94334r55016j293003j584441j876443k237380k571463k716274
$$ 473440289 472800940 472106606 471151590 469858587 468274146 466397703 464160323 461588860 458872586
1301.3D58872586k640277k484321k383888k240032j985729j760721j574337j450390
$$ 458872586 456232309 453747988 451364100 449124068 447138339 445377618 443803281 442352891
1317.6D42352891j607031k213388l286362m598767n701929o254911o154359n478888
$$ 442352891 440745860 438532472 435246110 430647343 424945414 418690503 412536144 407057256
1333.9D07057256m396469l098607j752883n63055J74403M24772L28720N7965k12580
$$ 407057256 402660787 399562180 397809297 397246242 397420645 397845417 398174137 398232102 398019522
1352.3C98019522m94331q15689j068265j185595j196206r29237n74648l74108r24O25699
$$ 398019522 397525191 396709502 395641237 394455642 393259436 392330199 391755551 391381443 391380519 392006218
1372.7C92006218J208932J396060J304119J285255J749963K902597M423529M923552
$$ 392006218 393215150 394611210 395915329 397200584 398950547 401853144 406276673 411200225
1389D11200225L907353K678424J426101J65790p80850j247347j543254k065718k301573
$$ 411200225 415107578 417786002 419212103 419377893 418597043 417349696 415806442 413740724 411439151
1407.3D11439151k251715k289772k127230j666308j410663j274198n40733K08139O19590
$$ 411439151 409187436 406897664 404770434 403104126 401693463 400419265 399878532 400086671 400706261
1425.7D00706261R67592J334250J666665J916349K199740K248048J970977J940519
$$ 400706261 401673853 403008103 404674768 406591117 408790857 411038905 413009882 414950401
1442D14950401J783788J251519K96860o98298j186400j300753k029150k723962j058102
$$ 414950401 416734189 417985708 418282568 417584270 416397870 415097117 413067967 410344005 409285903
1460.4D09285903O26802K181650L824055N066991P068187J0574937J1577278J0057121
$$ 409285903 409912705 412094355 415918410 420985401 428053588 438628525 450205803 460262924
1476.7D60262924R206027Q942783Q675546P871091P588237P907808P417023N770565
$$ 460262924 469468951 478411734 487087280 494958371 502546608 510454416 517871439 523642004
1493E23642004N237400N721271N278587M396141L945351M354715N024970L515243K676427
$$ 523642004 528879404 534600675 539879262 544275403 548220754 552575469 557600439 561115682 563792109
1511.4E63792109K923131L171146L248871K995252K987028K659380K220511K134800
$$ 563792109 566715240 569886386 573135257 576130509 579117537 581776917 583997428 586132228
1527.7E86132228J941085K007306K070606J816451J859903K078593J088739L83258
$$ 586132228 588073313 590080619 592151225 593967676 595827579 597906172 598994911 599378169
1544E99378169M37975N22732M65572L08335L16739L84867l60846j997233j450896j090765
$$ 599378169 599816144 600338876 600804448 601112783 601429522 601814389 601453543 599456310 598005414 596914649
1564.4E96914649j171350j457572j990676j670719j528322k423048k507925j993358
$$ 596914649 595743299 594285727 592295051 590624332 589096010 586672962 584165037 582171679
1580.7E82171679k026558k115071k222061k333701k342582k283513k382517k528191
$$ 582171679 580145121 578030050 575807989 573474288 571131706 568848193 566465676 563937485
1597E63937485k578497k701699k835632k890408l026605l408968l554642l275752l624678
$$ 563937485 561358988 558657289 555821657 552931249 549904644 546495676 542941034 539665282 536040604
1615.4E36040604m626393l788173l126085l842831l881276l548562l341317k510369
$$ 536040604 531414211 527626038 524499953 520657122 516775846 513227284 509885967 507375598
1631.7E07375598j961887k445638k131999r85890k67685K86073Q13305J265228J496971
$$ 507375598 505413711 502968073 500836074 499850184 499582499 499868572 500681877 501947105 503444076
1650.1E03444076K284228L330946K700925K660752L437817M405975M690945M262149
$$ 503444076 505728304 509059250 511760175 514420927 517858744 522264719 526955664 531217813
1666.4E31217813M811943N663514N202770N581260O151736N481780N219161O123364
$$ 531217813 536029756 541693270 546896040 552477300 558629036 564110816 569329977 575453341
1682.7E75453341P678807O183684M880130N017400M648745N025267N349338M564584
$$ 575453341 583132148 589315832 594195962 599213362 603862107 608887374 614236712 618801296
1699F18801296M155218L088773K621531K731145K441287K294957K348900K514541K759636
$$ 618801296 622956514 626045287 628666818 631397963 633839250 636134207 638483107 640997648 643757284
1717.4F43757284K380728J938940J989185K104819K137721K283513K277494K328455
$$ 643757284 646138012 648076952 650066137 652170956 654308677 656592190 658869684 661198139
1733.7F61198139K080143J788616K199948K534508K562583K728581L041685L477573
$$ 661198139 663278282 665066898 667266846 669801354 672363937 675092518 678134203 681611776
1750F81611776L578008L165304L086806L095030K885819K934217K671898K332627K259195
$$ 681611776 685189784 688355088 691441894 694536924 697422743 700356960 703028858 705361485 707620680
1768.4G07620680K182603K061606J724124J460909J445294J416266J293957J277447
$$ 707620680 709803283 711864889 713589013 715049922 716495216 717911482 719205439 720482886
1784.7G20482886J350760J394332J431763J339316J057983J049757J226306J224935
$$ 720482886 721833646 723227978 724659741 725999057 727057040 728106797 729333103 730558038
1801G30558038J022398R21786J027644J142263J095176Q90434P99596Q30114Q63731
$$ 730558038 731580436 732502222 733529866 734672129 735767305 736657739 737457335 738287449 739151180
1819.4G39151180R10878R72927R22501P65443O68287N74410N58197N45204M68492M66049
$$ 739151180 740062058 741034985 741957486 742722929 743391216 743965626 744523823 745069027 745537519 746003568
1839.8G46003568N67615O29306M82023K75969J83225K02537L07679L99291L74675K82586
$$ 746003568 746571183 747200489 747682512 747958481 748141706 748344243 748651922 749051213 749425888 749708474
1860.2G49708474K21014L08096M72248M64976K31504R6261J97888L94642N50688N48660
$$ 749708474 749929488 750237584 750709832 751174808 751406312 751502573 751700461 752095103 752645791 753194451
1880.5G53194451M50492L82483M27783N34594N16236L58164K23815J98424K78473L90947
$$ 753194451 753644943 754027426 754455209 754989803 755506039 755864203 756088018 756286442 756564915 756955862
1900.9G56955862L46124J70231P4744J01686J74582K26497K39075J80363J07766J69217
$$ 756955862 757301986 757472217 757546961 757648647 757823229 758049726 758288801 758469164 758576930 758746147
1921.3G58746147K83778K38418J11819O6697J35064K42234K52664J54137Q1778J37389
$$ 758746147 759029925 759268343 759380162 759446859 759581923 759824157 760076821 760230958 760312736 760450125
1941.7G60450125K04622K23995K27213J88768J62839K20478L16620L48985K95580K13503
$$ 760450125 760654747 760878742 761105955 761294723 761457562 761678040 761994660 762343645 762639225 762852728
1962.1G62852728J95444K39789K57612K09212J49965J21951J57416K29776K37465J63257
$$ 762852728 763048172 763287961 763545573 763754785 763904750 764026701 764184117 764413893 764651358 764814615
1982.5G64814615O8844M7385J09852J70588J19686J1742j2278J2874M650m7505j13845
$$ 764814615 764883459 764930844 765040696 765211284 765330970 765342712 765330434 765343308 765347958 765300453 765186608
2005G65186608j95444k45929k47001k70426l30210m04179n06461o02961p32600p52688
$$ 765186608 764991164 764745235 764498234 764227808 763897598 763493419 762986958 762383997 761651397 760898709
2025.4G60898709m25815j91748l26872m47333m31597m29690m53830m47214m29153l97384
$$ 760898709 760472894 760281146 759954274 759506941 759075344 758645654 758191824 757744610 757315457 756918073
2045.8G56918073l15726k16067j62363j36077q6129j5617M4764Q5055R2745N6267M2737
$$ 756918073 756602347 756386280 756223917 756087840 756001711 755986094 756030858 756115913 756208658 756264925 756307662
2068.2G56307662Q3446J21951R5844L2127R716O3658J30951J25408R8229J06096J22070
$$ 756307662 756391108 756513059 756608903 756641030 756650746 756714404 756845355 756970763 757068992 757175088 757297158
2090.6G57297158J51515K04325K05874J59860J54615K07781K52068K20299J71244J54972
$$ 757297158 757448673 757652998 757858872 758018732 758173347 758381128 758633196 758853495 759024739 759179711
2111G59179711J49906J26481Q5712O9260O0380J4305r656K3484O3539O2227N424r000
$$ 759179711 759329617 759456098 759541810 759611070 759671450 759685755 759676099 759699583 759763122 759825349 759830773 759821773
2135.5G59821773L8802O7353N2214K3604J5199J8239N0962J18673J74701K14577K48432
$$ 759821773 759860575 759927928 759980142 760003746 760018945 760037184 760088146 760206819 760381520 760596097 760844529
2157.9G60844529K59161L02612L83556M09723M12941N07652O24061O23226N94318O21081
$$ 760844529 761103690 761406302 761789858 762199581 762612522 763120174 763744235 764367461 764961779 765582860
2178.3G65582860O27994N96285N80907N85675N99086N88358N05864M24922M45545N31017
$$ 765582860 766210854 766807139 767388046 767973721 768572807 769161165 769667029 770091951 770537496 771068513
2198.7G71068513N58377M97460M37319M46678M99248N39541N33104M78506M30346M38094
$$ 771068513 771626890 772124350 772561669 773008347 773507595 774047136 774580240 775058746 775489092 775927186
2219.1G75927186M99189N13017M16994K97368K74539L53038M16279L69906K52426J99914
$$ 775927186 776426375 776939392 777356386 777653754 777928293 778281331 778697610 779067516 779319942 779519856
2239.5G79519856K66194L70920L50773K04742J31131K07543L23415L24726K30491J75416
$$ 779519856 779786050 780156970 780507743 780712485 780843616 781051159 781374574 781699300 781929791 782105207
2259.9G82105207J98663K65419L23594L19540K62201K08259K12729K64764K73287K26855
$$ 782105207 782303870 782569289 782892883 783212423 783474624 783682883 783895612 784160376 784433663 784660518
2280.3G84660518J52588J14501K36511L99649L05176M6432l1173Q1598J86563K14457
$$ 784660518 784813106 784927607 785164118 785563767 785868943 785915375 785884202 785965800 786152363 786366820
2300.7G86366820J83881J03354L9280J00910K57671K69234P4685k3365R2864K47061
$$ 786366820 786550701 786654055 786693335 786794245 787051916 787321150 787395835 787372470 787465334 787712395
2321.1G87712395K70128Q0049j26719o3062R1791O4016o3121j86086k18451j90139
$$ 787712395 787982523 788062572 787935853 787872791 787964582 788028598 787965477 787779391 787560940 787370801
2341.5G87370801k50638m73976n99205m03881k1577K84552L13402K40564J06215j77145
$$ 787370801 787120163 786646187 786046982 785643101 785621524 785906076 786219478 786460042 786566257 786389112
2361.9G86389112m62591n85318n81205n97238o62029o44028n28932m58240m64738m60744
$$ 786389112 785926521 785341203 784759998 784162760 783500731 782856703 782327771 781869531 781404793 780944049
2382.3G80944049l93211l31641l07619k76625k54631k57791k92539l54171l67701l46601
$$ 780944049 780550838 780219197 779911578 779634953 779380322 779122531 778829992 778475821 778108120 777761519
2402.7G77761519l84748m46737m91142n21422n23388n29230n84304o51061o73891o73234
$$ 777761519 777376771 776930034 776438892 775917470 775394082 774864852 774280548 773629487 772955596 772282362
2423.1G72282362o70075o86467p35462p74503p62462p27356p32124q00073q67068q55089
$$ 772282362 771612287 770925820 770190358 769415855 768653393 767926037 767193913 766393840 765526772 764671683
2443.5G64671683q00311p59661p65861q08000q21352p69377o91831o75559p29382p80642
$$ 764671683 763871372 763111711 762345850 761537850 760716498 759947121 759255290 758579731 757850349 757069707
2463.9G57069707p86007p34269o52313o55353p21336p18772o68884o38246o40869o52850
$$ 757069707 756283700 755549431 754897118 754241765 753520429 752801657 752132773 751494527 750853658 750200808
2484.3G50200808o24835n65827n26965n06341m99249m95076m81546m62473m29332m13418
$$ 750200808 749575973 749010146 748483181 747976840 747477591 746982515 746500969 746038496 745609164 745195746
2504.7G45195746m17888m14133m07994m20987m57764n08070n64933n91099n89848o12258
$$ 745195746 744777858 744363725 743955731 743534744 743076980 742568910 742003977 741412878 740823030 740210772
2525.1G40210772o62804p00951o99997p27653q23915q84712q64208q31127q33750q54730
$$ 740210772 739547968 738847017 738147020 737419367 736595452 735710740 734846532 734015405 733181655 732326925
2545.5G32326925q58009q36432q02934p93457q21233q68440q89897q34644p70867p53522
$$ 732326925 731468916 730632484 729829550 729036093 728214860 727346420 726456523 725621879 724851012 724097490
2565.8G24097490p65085q05974q26299q19683q13723p84993p63655p68423p44402o84381
$$ 724097490 723332405 722526431 721700132 720880449 720066726 719281733 718518078 717749655 717005253 716320872
2586.2G16320872o54697o81996o94275o39677n49376m86792n26726o49154p28071p10666
$$ 716320872 715666175 714984179 714289904 713650227 713100851 712614059 712087333 711438179 710710108 709999442
2606.6G09999442o89149p86960r37641j014709j040161j061678j127779j256406j370669
$$ 709999442 709310293 708523333 707585692 706570983 705530822 704469144 703341365 702084959 700714290
2625G00714290j404822j369297j341999j402020j515389j558482j499296j434743j442552
$$ 700714290 699309468 697940171 696598172 695196152 693680763 692122281 690622985 689188242 687745690
2643.4F87745690j517951j581133j543164j450300j395881j407802j443863j446963
$$ 687745690 686227739 684646606 683103442 681653142 680257261 678849459 677405596 675958633
2659.7F75958633j411378j339436j297414j324296j346171j312613j244605j199066
$$ 675958633 674547255 673207819 671910405 670586109 669239938 667927325 666682720 665483654
2676F65483654j193881j187087j133501j081348j086473j133800j198768j223982j220345
$$ 665483654 664289773 663102686 661969185 660887837 659801364 658667564 657468796 656244814 655024469
2694.3F55024469j240552j267314j321136j431168j487135j416863j353740j387656
$$ 655024469 653783917 652516603 651195467 649764299 648277164 646860301 645506561 644118905
2710.7F44118905j441657j432777j363516j291275j259804j268208j246929j131296
$$ 644118905 642677248 641244471 639880955 638589680 637329876 636061668 634814739 633683443
2727F33683443j025975j028835j059294j033902r74119r28223r15468r52125j001894
$$ 633683443 632657468 631628633 630569339 629535437 628561318 627633095 626717627 625765502 624763608
2745.3F24763608r86516r07541q26001p93934q09252q07881p71761p35462p13408p33554
$$ 624763608 623777092 622869551 622043550 621249616 620440364 619632483 618860722 618125260 617411852 616678298
2765.7F16678298q05080q76964r13858r40025r70244j022816j118064j194060j227081
$$ 616678298 615873218 614996254 614082396 613142371 612172127 611149311 610031247 608837187 607610106
2784.1F07610106j297950j438499j551330j588046j653374j778066j859784j886308
$$ 607610106 606312156 604873657 603322327 601734281 600080907 598302841 596443057 594556749
2800.4E94556749j958490k099752k215266k262056k322912k434135k521336k564013
$$ 594556749 592598259 590498507 588283241 586021185 583698273 581264138 578742802 576178789
2816.7E76178789k629280k732634k844453k936900k992690l053367l181696l335178
$$ 576178789 573549509 570816875 567972422 565035522 562042832 558989465 555807769 552472591
2833E52472591l445506l553688l696025l907799m189790m448294m653275m719496m509389
$$ 552472591 549027085 545473397 541777372 537869573 533679783 529231489 524578214 519858718 515349329
2851.4E15349329m080058l607928l284634l238797l475636l929615m502952n125761
$$ 515349329 511269271 507661343 504376709 501137912 497662276 493732661 489229709 484103948
2867.7D84103948n667120n955547o061733o106079n975902n534261m801870l931880
$$ 484103948 478436828 472481281 466419548 460313469 454337567 448803306 444001436 440069556
2884D40069556l076970k300799j652122j173168q57353p10547p18683q38578j051396
$$ 440069556 436992586 434691787 433039665 431866497 431009144 430298597 429579914 428741336 427689940
2902.4D27689940j312733j627505k034932k497137l006100l582687m074871m274160
$$ 427689940 426377207 424749702 422714770 420217633 417211533 413628846 409553975 405279815
2918.7D05279815m181117l856033l283232k470881j454025k93553R44018K224177L436864
$$ 405279815 401098698 397242665 393959433 391488552 390034527 389740974 390684992 392909169 396346033
2937C96346033M472762N282462N828499O188989O447166O607294O678462O659925O573081
$$ 396346033 400818795 406101257 411929756 418118745 424565911 431173205 437851667 444511592 451084673
2955.4D51084673O487787O395072O176203N798459N376697N018771M726350M504919
$$ 451084673 457572460 463967532 470143735 475942194 481318891 486337662 491064012 495568931
2971.7D95568931M393131M298001M162550M029334L826558L529430L177881K793014
$$ 495568931 499962062 504260063 508422613 512451947 516278505 519807935 522985816 525778830
2988E25778830K445817K117097J780212J498103J179696P66933L83615K4557l22819
$$ 525778830 528224647 530341744 532121956 533620059 534799755 535566688 535950303 535974860 535652041
3006.4E35652041n99503q71718j211524j553535j786352j936078k110898k297700k465307
$$ 535652041 535052538 534180820 532969296 531415761 529629409 527693331 525582433 523284733 520819426
3024.7E20819426k621115k673208k654076k715528k875030l006339k995551k960205
$$ 520819426 518198311 515525103 512871027 510155499 507280469 504274130 501278579 498318374
3041.1D98318374l017932l134638l250599l260791l194005l183007l215194l284543
$$ 498318374 495300442 492165804 488915205 485654414 482460409 479277402 476062208 472777665
3057.4D72777665l363192l309757l180116l137499l214598l333032l344447l205269
$$ 472777665 469414473 466104716 462924600 459787101 456572503 453239471 449895024 446689755
3073.7D46689755l026992k995193l163040l286243l229349l141255l097921l113061
$$ 446689755 443662763 440667570 437504530 434218287 430988938 427847683 424749762 421636701
3090D21636701l191501l214449l113896k984881k977192l072858l058076k884299k779841
$$ 421636701 418445200 415230751 412116855 409131974 406154782 403081924 400023848 397139549 394359708
3108.4C94359708k870947k905697k752662k655118k728522k888978k993971k937287
$$ 394359708 391488761 388583064 385830402 383175284 380446762 377557784 374563813 371626526
3124.7C71626526k789557k660185k643198k709508k641886k452165k407700k547800
$$ 371626526 368836969 366176784 363533586 360824078 358182192 355730027 353322327 350774527
3141C50774527k621472k530515k438874k356529k222478k216399k372980k427280k322912
$$ 350774527 348153055 345622540 343183666 340827137 338604659 336388260 334015280 331588000 329265088
3159.4C29265088k223790k179861k124160k065093k067834k083272k026081j919806
$$ 329265088 327041298 324861437 322737277 320672184 318604350 316521078 314494997 312575191
3175.7C12575191j881510j908779j910537j862049j797200j750201j742094j746059
$$ 312575191 310693681 308784902 306874365 305012316 303215116 301464915 299722821 297976762
3192B97976762j706839j680761j667053j604348j533449j505047j509368j485288j417548
$$ 297976762 296269923 294589162 292922109 291317761 289784312 288279265 286769897 285284609 283867061
3210.3B83867061j375556j382440j393616j381815j325726j273692j284838j295000
$$ 283867061 282491505 281109065 279715449 278333634 277007908 275734216 274449378 273154378
3226.7B73154378j201987j038671r75579j098782j231044j217962j142591j037031
$$ 273154378 271952391 270913720 269938141 268839359 267608315 266390353 265247762 264210731
3243B64210731r19402r32246j052648j058608r27598q57681r09269r46253q86589p85500
$$ 264210731 263291329 262359083 261306435 260247827 259320229 258462548 257553279 256607026 255720437 254934937
3263.4B54934937p30068p02470o35475o60598p81835q15302p84799p52568p32348p21961
$$ 254934937 254204869 253502399 252866924 252206326 251424491 250609189 249824390 249071822 248339474 247617513
3283.8B47617513o72266o01307n48720n49376o05956o51225o92204p09906o07446m53248
$$ 247617513 246945247 246343940 245795220 245245844 244639888 243988663 243296459 242586553 241979107 241525859
3304.2B41525859m73932p24286r46745r37015q07076p43032p31066o81251o13943o10754
$$ 241525859 241051927 240327641 239380896 238443881 237636805 236893773 236162707 235481456 234867513 234256759
3324.6B34256759p36296q58769q22156p42898o64711n67317o12646p39023p81477q27089
$$ 234256759 233520463 232661694 231839538 231096640 230431929 229864612 229251966 228512943 227731466 226904377
3345B26904377p75516n85690o14464q33139q72791p29963o06552o16938o61358n43192
$$ 226904377 226128861 225543171 224928707 224095568 223222777 222492814 221886262 221269324 220607966 220064774
3365.4B20064774m52489o33403q91432q86694o43819n10872n45084n96941n74008m46662
$$ 220064774 219612285 218978882 218087450 217200756 216556937 216046065 215500981 214904040 214330032 213883370
3385.7B13883370k26840l9339j67296m94688n24179k09733j6958k62752o09368n04345
$$ 213883370 213656530 213617191 213449895 212955207 212431028 212221295 212204337 211941585 211332217 210827872
3406.1B10827872j76355p8335j32084k20120k79218j99914r8944o4835M4137K14055
$$ 210827872 210651517 210573182 210441098 210220978 209941760 209741846 209642902 209578067 209622204 209836259
3426.5B09836259K84553J96084K14994L51087J86860j22458j10521J61528L75539L87028
$$ 209836259 210120812 210316896 210531890 210882977 211069837 210947379 210836858 210998386 211373925 211760953
3446.9B11760953K96205L12478M14595M68656N38692O76051O23002N38081P70271R30712
$$ 211760953 212057158 212369636 212784231 213252887 213791579 214467630 215090632 215628713 216398984 217329696
3467.3B17329696O50927K68609K83837N77703Q46177Q56668N75841N35771P86543P93948
$$ 217329696 217980623 218249232 218533069 219110772 219956949 220813617 221389458 221925229 222711772 223505720
3487.7B23505720O88687P88674Q80361Q50722Q04380Q87423R66207P91162O39498P68095
$$ 223505720 224194407 224983081 225863442 226714164 227518544 228405967 229372174 230163336 230802834 231570929
3508.1B31570929R86174J105651J002327P84069P83891J030370J251772J107753P92160
$$ 231570929 232557103 233662754 234665081 235449150 236233041 237263411 238515183 239622936 240415096
3526.5B40415096P55191R79334J226068J356855J246452J084805J290098J540750J408547
$$ 240415096 241170287 242149621 243375689 244732544 245978996 247063801 248353899 249894649 251303196
3544.8B51303196J155734J220197J385241J406968J493603J713365J905084J988172
$$ 251303196 252458930 253679127 255064368 256471336 257964939 259678304 261583388 263571560
3561.1B63571560J937122J791298J931608K323746K429277K347976K397567K574712
$$ 263571560 265508682 267299980 269231588 271555334 273984611 276332587 278730154 281304866
3577.5B81304866K834886L081739L096938K881557K731264L011137L238261L259957
$$ 281304866 284139752 287221491 290318429 293199986 295931250 298942387 302180648 305440605
3593.8C05440605L401130L593713L589481L561080L575980L490359L568590L797888
$$ 305440605 308841735 312435448 316024929 319586009 323161989 326652348 330220938 334018826
3610.1C34018826L931821M004985L907829L872544M182786M214197L972322L717422
$$ 334018826 337950647 341955632 345863461 349736005 353918791 358132988 362105310 365822732
3626.4C65822732L788501M315436M233390M060746M116624M126817M127741M154831
$$ 365822732 369611233 373926669 378160059 382220805 386337429 390464246 394591987 398746818
3642.7C98746818M103661M034221M209966M359960M051775L860146M158020M246086
$$ 398746818 402850479 406884700 411094666 415454626 419506401 423366547 427524567 431770653
3659D31770653L893107L649354L637165L553092L517509L787517L569543L110528L183276
$$ 431770653 435663760 439313114 442950279 446503371 450020880 453808397 457377940 460488468 463671744
3677.4D63671744L248691L153414L137499L166318L136665K774894K476454K514362
$$ 463671744 466920435 470073849 473211348 476377666 479514331 482289225 484765679 487280041
3693.7D87280041K504855K421290K302140K216041K238602K245515K172351J952767
$$ 487280041 489784896 492206186 494508326 496724367 498962969 501208484 503380835 505333602
3710E05333602J790941K072454K171099J979053J793682J668096J538277J523196J733602
$$ 505333602 507124543 509196997 511368096 513347149 515140831 516808927 518347204 519870400 521604002
3728.4E21604002J816093J719654J507759J417637J590788J542509J076698R76384
$$ 521604002 523420095 525139749 526647508 528065145 529655933 531198442 532275140 533251524
3744.7E33251524J612306J465082R30547J191617J566708J431822J240671J277864
$$ 533251524 534863830 536328912 537259459 538451076 540017784 541449606 542690277 543968141
3761E43968141J258195J176536J192987J121819J116991J232862J249910J245558J132548
$$ 543968141 545226336 546402872 547595859 548717678 549834669 551067531 552317441 553562999 554695547
3779.4E54695547R52184Q61645R12964J017988J017034J045584J100719J060129R89735
$$ 554695547 555647731 556509376 557422340 558440328 559457362 560502946 561603665 562663794 563653529
3797.7E63653529P86841P14063R95457R03666P79033R68039J043916R04977Q71420
$$ 563653529 564440370 565154433 566149890 567053556 567832589 568800628 569844544 570749521 571620941
3816.1E71620941J007080P11739N49853P80225Q00312P88569P84814Q21472R50813
$$ 571620941 572628021 573339760 573889613 574669838 575470150 576258719 577043533 577865005 578815818
3834.4E78815818P77006M25220N30421P61509Q53658Q65459P78139N17189M1783L49641
$$ 578815818 579592824 580018044 580548465 581309974 582163632 583029091 583807230 584324419 584366202 584715843
3854.8E84715843R79126Q77380O78659N02407M83155O42836N82934N13077M96864N68509
$$ 584715843 585694969 586572349 587251008 587753415 588236570 588879406 589462340 589975417 590472281 591040790
3875.2E91040790O72519N62609N92410O71208M95851M10914L88742L87788N23984N39601
$$ 591040790 591713309 592275918 592868328 593539536 594035387 594446301 594835043 595222831 595746815 596286416
3895.6E96286416M15802L50595L31461K99454L69131M19855M04180M08172L96252L05593
$$ 596286416 596702218 597052813 597384274 597683728 598052859 598472714 598876894 599285066 599681318 599986911
3916E99986911J91986K64705L91125L41475K85685L28303K85923K16663K64287K79367
$$ 599986911 600178897 600443602 600834727 601176202 601461887 601790190 602076113 602292776 602557063 602836430
3936.4F02836430K90692L52323L50058L48270L22282K20716J95384K35260K62320K78234
$$ 602836430 603127122 603479445 603829503 604177773 604500055 604720771 604916155 605151415 605413735 605691969
3956.8F05691969K91706K88188K81930K60532J45674P8857K01702L27348L34740K57731
$$ 605691969 605983675 606271863 606553793 606814325 606959999 607038856 607240558 607567906 607902646 608160377
3977.2F08160377J42574J69158K50339J86503J54555K11060K16782K13623K54572K54750
$$ 608160377 608302951 608472109 608722448 608908951 609063506 609274566 609491348 609704971 609959543 610214293
3997.6F10214293
$$ 610214293
##END=$$ End of the data block
