##TITLE=$$ Begin of the data block
##JCAMP-DX=5.00 $$ ACD/SpecManager v 10.08
##SPECTROMETER/DATA SYSTEM=Alpha
##DATE=26 Dec 2014 10:25:20
##DATA TYPE=INFRARED SPECTRUM
##DATA CLASS=XYDATA
##ORIGIN=
##OWNER=
##NPOINTS=1765
##FIRSTX=399.76428223
##LASTX=3997.64306641
##MAXX=3997.64306641
##MINX=399.76428223
##MAXY=0.78995019
##MINY=0.14195269
##XFACTOR=1.0000000000
##YFACTOR=1.000000000000000e-9
##FIRSTY=0.44185400
##DELTAX=2.03961372
##XUNITS=1/CM
##YUNITS=ARBITRARY UNITS
##XYDATA=(X++(Y..Y))
$$ plain form
399.8 441854000 435768843 431528240 428574800 427279443 428211838 430997193 434107780 435831010 435637295
418.1 435637295 434050530 431999505 429356605 426076889 422508180 418877065 415606797 413098305
434.4 413098305 411623806 411631554 413681656 417865694 423391223 428994715 433449209 436135948 437380195
452.8 437380195 437851667 437764853 436718255 434679598 431911975 428781420 425551057 422152311 418130875
471.2 418130875 413598239 410023808 407790482 406276315 405299991 404703796 404258311 404158920 404407024
489.5 404407024 404126376 402588814 400231004 397960424 396081626 394018352 391285002 387919307 384162515
507.9 384162515 380437434 376744747 372769326 368186265 363004655 358115703 354443341 352109104
524.2 352109104 350742817 349981457 349834114 350806057 353393316 357698351 363538176 370054245 375840098
$$ packed form
399.8D41854000o085157m240603k953440j295357R32395K785355L110587J723230j93715
418.1D35637295j586765k051025k642900l279716l568709l631115l270268k508492
434.4D13098305j474499P748K050102M184038N525529N603492M454494K686739J244247
452.8D37380195M71472q6814j046598k038657k767623l130555l230363l398746m021436
471.2D18130875m532636l574431k233326j514167r76324n96195m45485r9391K48104
489.5D04407024k80648j537562k357810k270580j878798k063274k733350l365695l756792
507.9C84162515l725081l692687l975421m583061n181610m888952l672362k334237
524.2C52109104j366287p61360j47343R71943K587259M305035N839825O516069N785853
$$ plain form
542.5 375840098 379981726 382167906 382530212 381587178 379716992 377075911 373786986 369791538 364895046
560.9 364895046 359022111 352189302 344687134 337294966 331083566 327182591 326168597 327950746
577.2 327950746 332277298 338768810 346599251 354601681 361812890 367630959 371822715 374227762
593.5 374227762 375008643 374889195 374490440 374110252 373952568 374031037 374293417 374971688 376306206 378364921
613.9 378364921 381078035 384265244 387875676 391937494 396454304 401154518 405362189 408669472
630.2 408669472 411334187 413773626 416125566 418163240 419680119 420837402 421947777 423220903
646.6 423220903 424660087 425999224 427068770 428074360 429268777 430660307 432004720 433051497
662.9 433051497 433805197 434847742 436818928 438733906 440353483 441959590 443620443 445490956 447508752
$$ packed form
542.5C75840098M141628K186180L62306r43034j870186k641081l288925l995448m896492
560.9C64895046n872935o832809p502168p392168o211400l900975j013994J782149
577.2C27950746M326552O491512P830441Q002430P211209N818069M191756K405047
593.5C74227762P80881j19448l98755l80188j57684P8469K62380O78271J334518K058715
613.9C78364921K713114L187209L610432M061818M516810M700214M207671L307283
630.2D08669472K664715K439439K351940K037674J516879J157283J110375J273126
646.6D23220903J439184J339137J069546J005590J194417J391530J344413J046777
662.9D33051497P53700J042545J971186J914978J619577J606107J660853J870513K017796
$$ plain form
681.2 447508752 449362725 450722069 451507807 451797873 451702476 451167762 449775994 447134852 443494856
699.6 443494856 439622015 436217904 433626980 431980550 431565255 432854146 436052829 440852761 446651727
717.9 446651727 453018218 459768862 466881037 474262446 481442273 487832963 493095547 497356474
734.3 497356474 501036644 504237473 506480098 507124305 506076276 503709197 500310361 495847762 490298152
752.6 490298152 483997226 477630585 471933842 467394829 464221239 462598324 463077009 466348797 472602785
771 472602785 481335729 491625756 502469599 513130724 523213983 532407701 540326238 546634555
787.3 546634555 551604569 556140423 561032891 566423953 571944475 577180386 582081854 586781144
803.6 586781144 591080308 594559312 596917927 598247409 599092245 600012839 600839674 600776732 599343240
$$ packed form
681.2D47508752J853973J359344P85738K90066r5397n34714j391768k641142l639996
699.6D43494856l872841l404111k590924j646430m15295J288891L198683M799932N798966
717.9D46651727O366491O750644P112175P381409P179827O390690N262584M260927
734.3D97356474L680170L200829K242625O44207j048029k367079l398836m462599n549610
752.6D90298152o300926o366641n696743m539013l173590j622915M78685L271788O253988
771D72602785Q732944J0290027J0843843J0661125J0083259R193718P918537O308317
787.3E46634555M970014M535854M892468N391062N520522N235911M901468M699290
803.6E86781144M299164L479004K358615J329482Q44836R20594Q26835o2942j433492
$$ plain form
822 599343240 596804917 593580723 589570463 584346235 577796161 570413053 562985599 556099772 549796283
840.3 549796283 543810010 537979364 532416940 527369678 522664189 517596066 511668205 505161047
856.6 505161047 499389291 496797293 499623805 507993519 520142138 534399927 549697578 564414740
873 564414740 576459348 584379911 587852120 587376416 583724320 577713013 570048749 561326444 552393436
891.3 552393436 544117630 536696613 529758394 522851229 515625179 507927895 499566197 490151912
907.6 490151912 479447812 467534065 454805732 442038745 430286646 420537144 413371295 408825547
923.9 408825547 406510562 405928701 406720132 408665597 411596417 415435314 420216978 425910294 431868404
942.3 431868404 436237246 436633259 431821406 422269166 409211367 393739998 376665086 358614236
$$ packed form
822E99343240k538323l224194m010260n224228o550074p383108p427454o885827o303489
840.3E49796283n986273n830646n562424n047262m705489n068123n927861o507158
856.6E05161047n771756k591998K826512Q369714J2148619J4257789J5297651J4717162
873E64414740J2044608P920563L472209m75704l652096o011307p664264q722305q933008
891.3E52393436q275806p421017o938219o907165p226050p697284q361698r414285
907.6D90151912j0704100j1913747j2728333j2766987j1752099r749502p165849m545748
923.9D08825547k314985n81861P91431J945465K930820L838897M781664N693316N958110
942.3D31868404M368842L96013m811853r552240j3057799j5471369j7074912j8050850
$$ plain form
958.6 358614236 340009719 321104437 302013785 282779843 263548404 244612560 226333499
972.9 226333499 209074616 193230018 179260105 167564601 158317029 151461557 146760449 143859148
989.2 143859148 142389134 141952693 142230287 143028334 144138902 145314634 146340951 147026196 147240520
1007.6 147240520 147046655 146689221 146471083 146627337 147308260 148569599 150424048 152836815 155678943
1025.9 155678943 158772573 161927223 164965481 167644039 169676960 170959935 171673149 172111943 172604352
1044.3 172604352 173394173 174628392 176597416 179709688 184209853 189992383 196839392 204729840
1060.6 204729840 213667199 222991616 230671152 233564839 229699433 220716149 210901529 203724146
1076.9 203724146 200121015 199444041 200822800 203660145 207534820 212218955 217622906 223472252
$$ packed form
958.6C58614236j8604517j8905282j9090652j9233942j9231439j8935844j8279061
972.9B26333499j7258883j5844598j3969913j1695504r247572o855472m701108k901301
989.2A43859148j470014m36441K77594P98047J110568J175732J026317O85245K14324
1007.6A47240520j93865l57434k18138J56254O80923J261339J854449K412767K842128
1025.9A55678943L093630L154650L038258K678558K032921J282975P13214M38794M92409
1044.3A72604352P89821J234219J969024L112272M500165N782530O847009P890448
1060.6B04729840Q937359R324417P679536K893687l865406q983284r814620p177383
1076.9B03724146l603131o76974J378759K837345L874675M684135N403951N849346
$$ plain form
1093.2 223472252 229132593 233822301 237046242 238850042 239778221 240610585 242144123 244806662 248439327
1111.6 248439327 252558470 256599754 260080308 262744039 264705896 266458690 268668950 271829903
1127.9 271829903 275975287 280480593 284169614 285805881 284576982 280348599 273729324 265888482
1144.2 265888482 257979006 250770986 244690046 239936903 236568421 234606072 234098613 235068515 237557918
1162.6 237557918 241686285 247681499 255759895 265901864 277714342 290593505 304094166 318036288
1178.9 318036288 332266361 346446216 360020071 372349501 382991850 391776592 398696810 403796613
1195.2 403796613 407264799 409617990 411573857 413720727 416357249 419601023 423555970 428386003
1211.5 428386003 434114933 440346062 446311772 451206803 454551458 456341416 456862390 456404656 455137938
$$ packed form
1093.2B23472252N660341M689708L223941J803800R28179Q32364J533538K662539L632665
1111.6B48439327M119143M041284L480554K663731J961857J752794K210260L160953
1127.9B71829903M145384M505306L689021J636267j228899m228383o619275p840842
1144.2B65888482p909476p208020o080940m753143l368482j962349n07459R69902K489403
1162.6B37557918M128367N995214Q078396J0141969J1812478J2879163J3500661J3942122
1178.9C18036288J4230073J4179855J3573855J2329430J0642349Q784742O920218N099803
1195.2D03796613L468186K353191J955867K146870K636522L243774L954947M830033
1211.5D28386003N728930O231129N965710M895031L344655J789958N20974m57734j266718
$$ plain form
1229.9 455137938 453211159 450941056 448762119 446973562 445640475 444778860 444555312 445230812 446890742
1248.2 446890742 449281693 451940656 454439104 456550688 458283752 459781438 461186051 462703884
1264.6 462703884 464630842 467095286 469871908 472452313 474312663 475170165 475101620 474508375 473826110
1282.9 473826110 473210484 472521037 471551776 470242977 468661398 466821730 464617997 462036133 459300131
1301.3 459300131 456659913 454176217 451792777 449560255 447581351 445831418 444266886 442812055
1317.6 442812055 441198647 438976228 435675025 431073874 425385714 419158608 413020521 407531977
1333.9 407531977 403132111 400026321 398249447 397680670 397860259 398288339 398632735 398723006 398553967
1352.3 398553967 398074895 397229612 396153361 395002544 393811673 392837197 392235994 391875178 391883105
$$ packed form
1229.9D55137938j926779k270103k178937j788557j333087q61615k23548O75500J659930
1248.2D46890742K390951K658963K498448K111584J733064J497686J404613J517833
1264.6D62703884J926958K464444K776622K580405J860350Q57502o8545n93245o82265
1282.9D73826110o15626o89447r69261j308799j581579j839668k203733k581864k736002
1301.3D59300131k640218k483696k383440k232522j978904j749933j564532j454831
1317.6D42812055j613408k222419l301203m601151n688160o227106o138087n488544
1333.9D07531977m399866l105790j776874n68777J79589M28080L44396R0271j69039
1352.3C98553967m79072q45283j076251j150817j190871r74476o01203l60816P927
$$ plain form
1370.6 391883105 392486453 393661112 395026982 396325052 397638053 399405956 402303517 406714052
1386.9 406714052 411624283 415541619 418221235 419607431 419751287 418962896 417683691 416124910 414070815
1405.3 414070815 411775887 409534395 407298952 405242920 403592825 402157515 400878459 400347233
1421.6 400347233 400563091 401195198 402188420 403551519 405202180 407081276 409284830 411557913 413533151
1440 413533151 415468633 417239130 418473721 418780804 418125868 416991144 415713042 413635194 410860121
1458.3 410860121 409822792 410473436 412649095 416451693 421518326 428600818 439177305 450749904
1474.7 450749904 460811019 470016330 478936434 487585455 495450228 503039598 510957897 518393695
1491 518393695 524157524 529366791 535087585 540410399 544844389 548798025 553134322 558150887 561694324
$$ packed form
1370.6C91883105O03348J174659J365870J298070J313001J767903K897561M410535
1386.9D06714052M910231L917336K679616J386196J43856p88391j279205j558781k054095
1405.3D14070815k294928k241492k235443k056032j650095j435310j279056n31226
1421.6D00347233K15858O32107R93222J363099J650661J879096K203554K273083J975238
1440D13533151J935482J770497J234591L07083o54936j134724j278102k077848k775073
1458.3D10860121j037329O50644K175659L802598N066633P082492J0576487J1572599
1474.7D50749904J0061115R205311Q920104Q649021P864773P589370P918299P435798
1491E18393695N763829N209267N720794N322814M433990L953636M336297N016565L543437
$$ plain form
1509.3 561694324 564387500 567329228 570535719 573800921 576781452 579750240 582407534 584626794
1525.6 584626794 586746693 588672101 590671301 592776000 594648957 596518934 598600209 599755824
1542 599755824 600199938 600663304 601175547 601616621 601912141 602206051 602576435 602243185 600271761 598846436
1562.4 598846436 597775757 596582711 595083654 593074918 591394961 589847386 587411880 584899008
1578.7 584899008 582910478 580921471 578842163 576617241 574263275 571893394 569583952 567211270
1595 567211270 564737260 562214315 559521019 556638300 553695738 550670922 547302246 543771565 540506601
1613.4 540506601 536882937 532243311 528444946 525304019 521459877 517598987 514079452 510773242
1629.7 510773242 508266866 506271601 503838062 501786411 500854194 500613511 500885069 501649797 502940297
$$ packed form
1509.3E61694324K693176K941728L206491L265202K980531K968788K657294K219260
1525.6E84626794K119899J925408J999200K104699J872957J869977K081275J155615
1542E99755824M44114M63366N12243M41074K95520K93910L70384l33250j971424j425325
1562.4E98846436j070679j193046j499057k008736j679957j547575k435506k512872
1578.7E84899008j988530j989007k079308k224922k353966k369881k309442k372682
1595E67211270k474010k522945k693296k882719k942562l024816l368676l530681l264964
1613.4E40506601l623664m639626l798365l140927l844142l860890l519535l306210
1629.7E10773242k506376j995265k433539k051651r32217k40683K71558P64728J290500
$$ plain form
1648 502940297 504509807 506833851 510159791 512856245 515541136 519017398 523452878 528165042 532437503
1666.4 532437503 537232697 542895317 548132241 553716004 559853554 565327108 570504963 576567054
1682.7 576567054 584240437 590487003 595431924 600462198 605062544 610038519 615396082 619988739
1699 619988739 624121606 627182126 629815519 632561922 634997308 637271106 639581084 642052412 644817770
1717.4 644817770 647266388 649237573 651200533 653267682 655382335 657669783 659978032 662303805
1733.7 662303805 664327264 666061938 668218672 670744181 673336208 676098645 679165721 682642221
1750 682642221 686211467 689402878 692507088 695587933 698485136 701465428 704145074 706440926 708656788
1768.4 708656788 710806191 712872088 714618802 716083109 717535734 718976676 720296144 721588910
$$ packed form
1648E02940297J569510K324044L325940K696454K684891L476262M435480M712164M272461
1666.4E32437503M795194N662620N236924N583763O137550N473554N177855O062091
1682.7E76567054P673383O246566M944921N030274M600346M975975N357563M592657
1699F19988739M132867L060520K633393K746403K435386K273798K309978K471328K765358
1717.4F44817770K448618J971185J962960K067149K114653K287448K308249K325773
1733.7F62303805K023459J734674K156734K525509K592027K762437L067076L476500
1750F82642221L569246L191411L104210L080845K897203K980292K679646K295852K215862
1768.4G08656788K149403K065897J746714J464307J452625J440942J319468J292766
$$ plain form
1784.7 721588910 722946644 724326372 725709081 727010667 728090286 729167759 730373740 731567502
1801 731567502 732604325 733559847 734600365 735734463 736833036 737741888 738547087 739371657 740241528
1819.4 740241528 741154253 742095292 742981315 743720829 744369864 744971037 745582700 746190071 746715486 747167170
1839.8 747167170 747663736 748244464 748734236 749035776 749232590 749422073 749689281 750078797 750488579 750805497
1860.2 750805497 751056015 751386940 751856506 752311647 752559543 752677321 752870023 753229856 753740907 754274905
1880.5 754274905 754748464 755172372 755636513 756196439 756704688 757054090 757293582 757492721 757761061 758133113
1900.9 758133113 758454442 758640170 758750081 758858800 759036541 759280384 759517372 759668529 759746313 759897828
1921.3 759897828 760203302 760504842 760649443 760684371 760779262 761007011 761256576 761435509 761546969 761665106
$$ packed form
1784.7G21588910J357734J379728J382709J301586J079619J077473J205981J193762
1801G31567502J036823R55522J040518J134098J098573R08852Q05199Q24570Q69871
1819.4G40241528R12725R41039Q86023P39514O49035O01173O11663O07371N25415M51684
1839.8G47167170M96566N80728M89772L01540J96814J89483K67208L89516M09782L16918
1860.2G50805497K50518L30925M69566M55141K47896J17778J92702L59833N11051N33998
1880.5G54274905M73559M23908M64141N59926N08249L49402K39492J99139K68340L72052
1900.9G58133113L21329J85728J09911J08719J77741K43843K36988J51157P7784J51515
1921.3G59897828L05474L01540J44601L4928R4891K27749K49565J78933J11460J18137
$$ plain form
1941.7 761665106 761841953 762083828 762346566 762558699 762724400 762940824 763272166 763639092 763923168 764098465
1962.1 764098465 764267385 764521897 764820397 765052736 765193522 765311003 765486836 765727460 765941024 766073346
1982.5 766073346 766150773 766238451 766376615 766545892 766656637 766663194 766640007 766654253 766688645 766679406 766579807
2005 766579807 766372621 766126931 765902519 765647888 765301049 764857650 764332116 763719916 762975097 762233078
2025.4 762233078 761822104 761635542 761319935 760881543 760438919 759990215 759535491 759085000 758642137 758253634
2045.8 758253634 757967174 757787526 757651031 757507265 757408261 757408679 757479191 757571280 757647872 757676482 757707894
2068.2 757707894 757808805 757954538 758065999 758122087 758159041 758215964 758319676 758445621 758553505 758647323
2088.6 758647323 758783400 758987904 759220779 759428918 759591639 759723425 759873748 760083735 760309935 760493755
$$ packed form
1941.7G61665106J76847K41875K62738K12133J65701K16424L31342L66926K84076J75297
1962.1G64098465J68920K54512K98500K32339J40786J17481J75833K40624K13564J32322
1982.5G66073346P7427Q7678J38164J69277J10745O557k3187J4246L4392r239r9599
2005G66579807k07186k45690k24412k54631l46839m43399n25534o12200p44819p42019
2025.4G62233078m10974j86562l15607m38392m42624m48704m54724m50491m42863l88503
2045.8G58253634k86460j79648j36495j43766r9004M18P0512R2089P6592K8610L1412
2068.2G57707894J00911J45733J11461N6088L6954N6923J03712J25945J07884R3818
2088.6G58647323J36077K04504K32875K08139J62721J31786J50323K09987K26200J83820
$$ plain form
2109 760493755 760638595 760785580 760919809 761021256 761125147 761217117 761239231 761208057 761203647 761269391 761362493
2131.4 761362493 761398673 761387706 761398077 761442542 761504948 761575341 761624098 761650085 761712134 761832595 761981606
2153.9 761981606 762147009 762357771 762626290 762943566 763318062 763731837 764161646 764666617 765280008 765913010
2174.3 765913010 766527116 767149866 767760932 768346727 768938839 769542336 770126164 770673335 771159828 771592677
2194.6 771592677 772069871 772625625 773176551 773681164 774146378 774605274 775109708 775667548 776217520 776692629
2215 776692629 777122557 777579486 778069675 778540313 778930545 779225528 779509425 779873550 780293465 780671120
2235.4 780671120 780943215 781158090 781420588 781759799 782093585 782332420 782501221 782714486 783020496 783341169
2255.8 783341169 783572972 783719718 783888519 784158945 784515381 784860075 785117686 785297334 785488784 785775363
$$ packed form
2109G60493755J44840J46985J34229J01447J03891R1970K2114l1174m410O5744R3102
2131.4G61362493L6180j0967J0371M4465O2406P0393M8757K5987O2049J20461J49011
2153.9G61981606J65403K10762K68519L17276L74496M13775M29809N04971O13391O33002
2174.3G65913010O14106O22750O11066N85795N92112O03497N83828N47171M86493M32849
2194.6G71592677M77194N55754N50926N04613M65214M58896N04434N57840N49972M75109
2215G76692629M29928M56929M90189M70638L90232K94983K83897L64125M19915L77655
2235.4G80671120K72095K14875K62498L39211L33786K38835J68801K13265L06010L20673
2255.8G83341169K31803J46746J68801K70426L56436L44694K57611J79648J91450K86579
$$ plain form
2276.2 785775363 786094844 786346793 786528528 786674559 786856174 787137032 787412703 787558556 787635028 787771583
2296.6 787771583 787985504 788194001 788326025 788359523 788387001 788545609 788831651 789065182 789114654 789112449
2317 789112449 789252043 789551437 789852500 789950192 789862275 789817452 789850712 789841712 789741635 789547086 789351165
2339.5 789351165 789192080 788995385 788602948 788024187 787573576 787521422 787877977 788367391 788727582 788762033
2359.9 788762033 788407564 787895381 787440360 786900282 786180258 785414398 784730554 784191728 783749640 783301353
2380.2 783301353 782821357 782380164 782016873 781715333 781472147 781249762 780990064 780683100 780331314 779952466
2400.6 779952466 779571593 779170036 778719842 778215647 777684152 777151644 776613772 776046515 775432825 774774194
2421 774774194 774093628 773434639 772760570 771992862 771191418 770447791 769728482 768996060 768232346 767405152
$$ packed form
2276.2G85775363L19481K51949J81735J46031J81615K80858K75671J45853P6472J36555
2296.6G87771583K13921K08497J32024L3498K7478J58608K86042K33531M9472k205
2317G89112449J39594K99394L01063R7692q7917m4823L3260r000j00077j94549j95921
2339.5G89351165j59085j96695l92437n78761m50611n2154L56555M89414L60191L4451
2359.9G88762033l54469n12183m55021n40078p20024p65860o83844n38826m42088m48287
2380.2G83301353m79996m41193l63291l01540k43186k22385k59698l06964l51786l78848
2400.6G79952466l80873m01557m50194n04195n31495n32508n37872n67257o13690o58631
2421G74774194o80566o58989o74069p67708q01444p43627p19309p32422p63714q27194
$$ plain form
2441.4 767405152 766554475 765739560 764966309 764198542 763399899 762579858 761787057 761046231 760335088 759607613
2461.8 759607613 758823156 758022308 757300436 756664634 756028295 755353689 754658937 753957093 753271103 752619088
2482.2 752619088 751994312 751397312 750832677 750284731 749765396 749279141 748802066 748336375 747898281 747500658
2502.6 747500658 747106194 746666133 746212363 745788157 745366812 744912684 744431734 743921518 743369937 742774248
2523 742774248 742138386 741471231 740769267 740045488 739289165 738464594 737606108 736763239 735943913 735130012
2543.4 735130012 734287083 733426690 732605636 731823921 731014550 730163693 729316831 728455245 727581620 726764143
2563.8 726764143 726005733 725244582 724440873 723621488 722822309 722040594 721254408 720452666 719656646 718908250
2584.2 718908250 718225121 717557132 716869116 716216803 715655208 715137303 714594245 714012861 713373959 712682664
$$ packed form
2441.4G67405152q50677q14915p73251p67767p98643q20041p92801p40826p11143p27475
2461.8G59607613p84457q00848p21872o35802o36339o74606o94752p01844o85990o52015
2482.2G52619088o24776n97000n64635n47946n19335m86255m77075m65691m38094l97623
2502.6G47500658l94464m40061m53770m24206m21345m54128m80950n10216n51581n95689
2523G42774248o35862o67155p01964p23779p56323q24571q58486q42869q19326q13901
2543.4G35130012q42929q60393q21054p81715q09371q50857q46862q61586q73625q17477
2563.8G26764143p58410p61151q03709q19385p99179p81715p86186q01742p96020p48396
2584.2G18908250o83129o67989o88016o52313n61595n17905n43058n81384o38902o91295
$$ plain form
2604.6 712682664 711993873 711303413 710523069 709598780 708575726 707530677 706484795 705366611 704108238
2623 704108238 702769458 701421738 700054228 698661685 697219610 695694149 694136500 692642868 691217363
2641.3 691217363 689762473 688250005 686723590 685199022 683689237 682223380 680807710 679405630
2657.6 679405630 677973568 676533222 675168097 673866153 672536016 671200931 669941187 668744385
2673.9 668744385 667565644 666389287 665207982 664052844 662947953 661857903 660736263 659550250
2690.3 659550250 658301651 657024264 655761957 654507101 653197229 651808381 650359333 648903728
2706.6 648903728 647501767 646128595 644724429 643302560 641916990 640608668 639358997 638088644
2722.9 638088644 636820972 635668695 634628594 633626401 632626057 631617665 630618632 629646003 628710926
$$ packed form
2604.6G12682664o88791o90460p80344r24289j023054j045049j045882j118184j258373
2623G04108238j338780j347720j367510j392543j442075j525461j557649j493632j425505
2641.3F91217363j454890j512468j526415j524568j509785j465857j415670j402080
2657.6F79405630j432062j440346j365125j301944j330137j335085j259744j196802
2673.9F68744385j178741j176357j181305j155138j104891j090050j121640j186013
2690.3F59550250j248599j277387j262307j254856j309872j388848j449048j455605
2706.6F48903728j401961j373172j404166j421869j385570j308322j249671j270353
2722.9F38088644j267672j152277j040101j002193j000344j008392r99033r72629r35077
$$ plain form
2741.2 628710926 627783716 626818061 625850260 624929249 624058366 623220980 622401774 621616304 620858312 620118797
2761.6 620118797 619400501 618670642 617890298 617043674 616148651 615220726 614253998 613222361 612086833
2780 612086833 610864699 609609067 608311474 606916964 605412900 603822529 602147639 600385010 598555863
2798.4 598555863 596650064 594639719 592530191 590327322 588043034 585696459 583279312 580781996
2814.7 580781996 578204513 575531423 572774827 569954216 567048728 564059556 560978055 557757497
2831 557757497 554414451 550984442 547421634 543681979 539745688 535563707 531125665 526490331 521770656
2849.3 521770656 517197549 513051569 509427547 506151974 502916813 499424577 495467067 490927428
2865.7 490927428 485755503 480041146 474031061 467919201 461767972 455742836 450183630 445372194
$$ packed form
2741.2F28710926r27210r65655r67801r21011q70883q37386q19206p85470p57992p39515
2761.6F20118797p18296p29859p80344q46624q95023r27925r66728j031637j135528
2780F12086833j222134j255632j297593j394510j504064j590371j674890j762629j829147
2798.4E98555863j905799k010345k109528k202869k284288k346575k417147k497316
2814.7E80781996k577483k673090k756596k820611k905488k989172l081501l220558
2831E57757497l343046l430009l562808l739655l936291m181981m438042m635334m719675
2849.3E21770656m573107m145980l624022l275573l235161l492236l957510m539639
2865.7D90927428n171925n714357o010085o111860o151229o025136n559206m811436
$$ plain form
2882 445372194 441416204 438335270 436057836 434408337 433228552 432380199 431676716 430926502 430018991
2900.3 430018991 428928018 427606285 425971568 423962593 421485752 418438613 414824039 410763681
2916.6 410763681 406488657 402282178 398417890 395154446 392703325 391233772 390908182 391864061 394123822
2935 394123822 397576392 402056724 407340765 413191289 419402182 425802320 432358116 439056545 445772290
2953.4 445772290 452415049 458977699 465428293 471650362 477511793 482963204 488018304 492742091
2969.7 492742091 497280836 501722693 506025076 510214090 514332235 518238127 521778226 524945915
2986 524945915 527771354 530271471 532443106 534285545 535846531 537064970 537827969 538177073 538186967
3004.4 538186967 537888646 537320435 536507845 535392344 533906460 532135963 530213475 528111875 525777340
$$ packed form
2882D45372194l955990l080934k277434j649499j179785q48353p03483p50214r07511
2900.3D30018991j090973j321733j634717k008975k476841l047139l614574m060358
2916.6D10763681m275024m206479l864288l263444k451121j469553l25590R55879K259761
2935C94123822L452570M480332N284041N850524O210893O400138O555796O698429O715745
2953.4D45772290O642759O562650O450594O222069N861431N451411N055100M723787
2969.7D92742091M538745M441857M302383M189014M118145L905892L540099L167689
2986E24945915K825439K500117K171635J842439J560986J218439P62999L49104R894
3004.4E38186967k98321n68211q12590j115501j485884j770497j922488k101600k334535
$$ plain form
3022.7 525777340 523271918 520644605 517972350 515348077 512705922 509868801 506812215 503752410
3039 503752410 500785291 497764349 494599730 491332412 488059103 484842718 481642187 478408605 475106776
3057.4 475106776 471723020 468354642 465143204 462052822 458866358 455512911 452152401 448931813
3073.7 448931813 445875943 442859054 439682841 436379939 433129996 429950714 426813602 423688114
3090 423688114 420477897 417225480 414130449 411219478 408242047 405089051 402002662 399120748 396254927
3108.4 396254927 393268257 390343904 387623489 384947449 382194936 379339099 376357377 373366684
3124.7 373366684 370523274 367849112 365201443 362461746 359745592 357222110 354800403 352261901
3141 352261901 349657029 347118109 344617546 342231154 340002298 337732166 335310966 332875431 330525964
$$ packed form
3022.7E25777340k505422k627313k672255k624273k642155k837121l056586l059805
3039E03752410k967119l020942l164619l267318l273309l216385l200531l233582l301829
3057.4D75106776l383756l368378l211438l090382l186464l353447l360510l220588
3073.7D48931813l055870l016889l176213l302902l249943l179282l137112l125488
3090D23688114l210217l252417l095031k910971k977431l152996l086389k881914k865821
3108.4C96254927k986670k924353k720415k676040k752513k855837k981722k990693
3124.7C73366684k843410k674162k647669k739697k716154k523482k421707k538502
3141C52261901k604872k538920k500563k386392k228856k270132k421200k435535k349467
$$ plain form
3159.4 330525964 328256458 326055616 323897600 321781695 319710225 317657232 315650105 313729107
3175.7 313729107 311808556 309838116 307901919 306039333 304240733 302502900 300795376 299078524
3192 299078524 297348619 295640975 294008374 292453915 290933698 289415658 287883759 286366194 284931809
3210.3 284931809 283572495 282213092 280841351 279484302 278141737 276820838 275529057 274278820
3226.7 274278820 273123056 272068679 271025836 269835562 268521726 267312199 266243309 265254736
3243 265254736 264337540 263377666 262293756 261214644 260290653 259485811 258645505 257715911 256778419 255905926
3263.4 255905926 255138069 254472494 253841460 253133416 252306610 251425296 250572741 249830768 249167427 248468414
3283.8 248468414 247745052 247099847 246592924 246145859 245588541 244866252 244070381 243324339 242712066 242232263
$$ packed form
3159.4C30525964k269506k200842k158016k115905k071470k052993k007127j920998
3175.7C13729107j920551j970440j936197j862586j798600j737833j707524j716852
3192B99078524j729905j707644j632601j554459j520217j518040j531899j517565j434385
3210.3B84931809j359314j359403j371741j357049j342565j320899j291781j250237
3226.7B74278820j155764j054377j042843j190274j313836j209527j068890r88573
3243B65254736r17196r59874j083910j079112r23991q04842q40306r29594r37492q72493
3263.4B55905926p67857o65575o31034p08044q26806q81314q52555p41973o63341o99013
3283.8B48468414p23362o45205n06923m47065n57318p22289p95871p46042o12273m79803
$$ plain form
3304.2 242232263 241733313 241024971 240100548 239145264 238321617 237599149 236881509 236167893 235530809 234917179
3324.6 234917179 234149009 233273238 232477665 231789753 231175795 230598420 229953364 229196489 228395939 227575377
3345 227575377 226796016 226169229 225541294 224711180 223813727 223047465 222405344 221783981 221157953 220637277
3365.4 220637277 220187545 219557434 218686119 217817739 217138082 216588661 216053843 215463161 214877591 214438125
3385.7 214438125 214202523 214105293 213893950 213429868 212971956 212811470 212817654 212551698 211984470 211529702
3406.1 211529702 211290777 211139545 210996851 210743353 210443929 210305512 210273176 210224405 210230783 210360885
3426.5 210360885 210589558 210797161 211034402 211383119 211578384 211479321 211399853 211600870 211980969 212305367
3446.9 212305367 212521583 212819189 213256344 213748768 214330673 215013459 215594292 216107264 216861993 217779100
$$ packed form
3304.2B42232263m98950p08342r24423r55284q23647p22468p17640p13616o37084o13630
3324.6B34917179p68170q75771p95573o87912o13958n77375o45056p56875q00550q20562
3345B27575377p79361o26787o27935q30114q97453p66262o42121o21363o26028n20676
3365.4B20637277m49732o30111q71315q68380o79657n49421n34818n90682n85570m39466
3385.7B14438125k35602r7230k11343m64082m57912j60486O184k65956n67228m54768
3406.1B11529702k38925j51232j42694k53498k99424j38417l2336m8771O378J30102
3426.5B10360885K28673K07603K37241L48717J95265r9063p9468K01017L80099L24398
3446.9B12305367K16216K97606M37155M92424N81905O82786N80833N12972P54729R17107
$$ plain form
3467.3 217779100 218442664 218754530 219093367 219689235 220521882 221391171 222000510 222540632 223328784 224152163
3487.7 224152163 224850208 225628346 226528957 227432787 228271887 229137957 230034843 230753958 231351748 232072294
3508.1 232072294 233021900 234181106 235287711 236139908 236955538 237989470 239199772 240294352 241165012
3526.5 241165012 241989911 242949903 244117245 245431080 246707097 247873634 249182388 250696898 252087533
3544.8 252087533 253198177 254377633 255764067 257217228 258801073 260603905 262537658 264475763
3561.1 264475763 266356617 268163204 270161778 272544175 274986804 277342618 279794037 282403231
3577.5 282403231 285233676 288361251 291559815 294468880 297126353 300131351 303431600 306706011
3593.8 306706011 310038418 313620925 317328453 320989430 324602097 328096360 331601501 335310876
$$ packed form
3467.3B17779100O63564L11866L38837N95868Q32647Q69289O09339N40122P88152Q23379
3487.7B24152163O98045P78138R00611R03830Q39100Q66070Q96886P19115N97790P20546
3508.1B32072294R49606J159206J106605Q52197Q15630J033932J210302J094580Q70660
3526.5B41165012Q24899R59992J167342J313835J276017J166537J308754J514510J390635
3544.8B52087533J110644J179456J386434J453161J583845J802832J933753J938105
3561.1B64475763J880854J806587J998574K382397K442629K355814K451419K609194
3577.5B82403231K830445L127575L198564K909065K657473L004998L300249L274411
3593.8C06706011L332407L582507L707528L660977L612667L494263L505141L709375
$$ plain form
3610.1 335310876 339219034 343276411 347284049 351242781 355435103 359614670 363556951 367302537
3626.4 367302537 371192008 375580966 379861504 383928180 387966365 392028362 396153897 400323480
3642.7 400323480 404475719 408599406 412874788 417274743 421352684 425187528 429286122 433487773
3659 433487773 437364340 441033989 444709897 448243886 451656878 455342889 458876967 462043285 465337634
3677.4 465337634 468643188 471836865 475045592 478261024 481394321 484167516 486651957 489170730
3693.7 489170730 491699398 494146109 496432990 498611569 500883520 503205717 505376756 507281780
3710 507281780 509049535 511047602 513144791 515122294 516918242 518551409 520132124 521791518 523613632
3728.4 523613632 525430202 527109921 528642654 530150533 531730533 533215582 534306645 535318136
$$ packed form
3610.1C35310876L908158M057377M007638L958732M192322M179567L942281L745586
3626.4C67302537L889471M388958M280538M066676M038185M061997M125535M169583
3642.7D00323480M152239M123687M275382M399955M077941L834844M098594M201651
3659D33487773L876567L669649L675908L533989L412992L686011L534078L166318L294349
3677.4D65337634L305554L193677L208727L215432L133297K773195K484441K518773
3693.7D89170730K528668K446711K286881K178579K271951K322197K171039J905024
3710E07281780J767755J998067K097189J977503J795948J633167J580715J659394J822114
3728.4E23613632J816570J679719J532733J507879J580000J485049J091063J011491
$$ plain form
3744.7 535318136 536870062 538270593 539247274 540461540 541948974 543351710 544645727 545992017
3761 545992017 547332466 548562586 549736023 550843000 551985323 553242862 554487705 555671334 556744158
3779.4 556744158 557733536 558674395 559623241 560673356 561757445 562820256 563848555 564853966 565901458
3797.7 565901458 566734314 567381263 568350792 569300294 570102990 571065664 572112501 573040128 573936641
3816.1 573936641 574946046 575640738 576233506 577081561 577887714 578624010 579306901 580059767 581067502
3834.4 581067502 581994593 582513332 582985103 583649695 584410071 585209906 585989058 586528897 586665273 587154388
3854.8 587154388 588084102 588810444 589381278 589888453 590417504 591071427 591687083 592223525 592734098 593327224
3875.2 593327224 593993664 594536781 595108628 595765531 596272826 596723914 597135961 597514331 598030269 598576009
$$ packed form
3744.7E35318136J551926J400531R76681J214266J487434J402736J294017J346290
3761E45992017J340449J230120J173437J106977J142323J257539J244843J183629J072824
3779.4E56744158R89378R40859R48846J050115J084089J062811J028299J005411J047492
3797.7E65901458Q32856O46949R69529R49502Q02696R62674J046837R27627Q96513
3816.1E73936641J009405O94692N92768Q48055Q06153P36296O82891P52866J007735
3834.4E81067502R27091N18739M71771O64592P60376P99835P79152N39839J36376M89115
3854.8E87154388R29714P26342N70834N07175N29051O53923O15656N36442N10573N93126
3875.2E93327224O66440N43117N71847O56903N07295M51088M12047L78370N15938N45740
$$ plain form
3895.6 598576009 599029183 599429369 599767089 600026309 600371242 600795984 601177871 601534009 601883948 602231324
3916 602231324 602583826 602921128 603182018 603371680 603634655 603978097 604271054 604543686 604883671 605240643
3936.4 605240643 605546415 605804741 606056571 606370986 606753647 607110381 607365489 607521117 607690156 607977867
3956.8 607977867 608337998 608655751 608899415 609104335 609309316 609530568 609746873 609959424 610194564 610441923
3977.2 610441923 610645592 610838592 611094892 611346722 611517489 611682355 611895919 612086117 612269759 612504721
3997.6 612504721
$$ packed form
3895.6E98576009M53174M00186L37720K59220L44933M24742L81887L56138L49939L47376
3916F02231324L52502L37302K60890J89662K62975L43442K92957K72632L39985L56972
3936.4F05240643L05772K58326K51830L14415L82661L56734K55108J55628J69039K87711
3956.8F07977867L60131L17753K43664K04920K04981K21252K16305K12551K35140K47359
3977.2F10441923K03669J93000K56300K51830J70767J64866K13564J90198J83642K34962
3997.6F12504721
##END=$$ End of the data block
