##TITLE=$$ Begin of the data block
##JCAMP-DX=5.00 $$ ACD/SpecManager v 10.08
##SPECTROMETER/DATA SYSTEM=Alpha
##DATE=26 Dec 2014 10:25:20
##DATA TYPE=INFRARED SPECTRUM
##DATA CLASS=XYDATA
##ORIGIN=
##OWNER=
##NPOINTS=1765
##FIRSTX=399.76428223
##LASTX=3997.64306641
##MAXX=3997.64306641
##MINX=399.76428223
##MAXY=0.79160607
##MINY=0.14163099
##XFACTOR=1.0000000000
##YFACTOR=1.000000000000000e-9
##FIRSTY=0.43652961
##DELTAX=2.03961372
##XUNITS=1/CM
##YUNITS=ARBITRARY UNITS
##XYDATA=(X++(Y..Y))
399.8D36529607m434050l315836k518356j257628N61416K496094L041535J618803m31359
418.1D32290226j780569j838893j962423k482444l182084l780305l750175k968878
434.4D10544455j522571J64181K143204M612655O079376N717903M283667K385854J024843
452.8D35433567P30991M68343r35018k521842l167123l035307k948373l314972l955663
471.2D16754603m311382l553808k374917j413554q02726o44237n59538j42813J43707
489.5D03095335l90023j415849k050847k008021j790434k108603k837003l382623l604263
507.9C83507669l544509l665716m134327m678011n079865m811943l703624k377421
524.2C51512253j409560p37637m9115J017273K688438M515528N876035O370067N683303
$$ plain form
399.8 436529607 432095557 428779721 426261365 425003737 425565153 428061247 431102782 432721585 432290226
418.1 432290226 430509657 428670764 426708341 424225897 421043813 417263508 413513333 410544455
434.4 410544455 409021884 409186065 411329269 415941924 422021300 427739203 432022870 434408724 435433567
452.8 435433567 436164558 436632901 435697883 433176041 430008918 426973611 424025238 420710266 416754603
471.2 416754603 412443221 408889413 406514496 405100942 404298216 403653979 403094441 402951628 403095335
489.5 403095335 402705312 401289463 399238616 397230595 395440161 393331558 390494555 387111932 383507669
507.9 383507669 379963160 376297444 372163117 367485106 362405241 357593298 353889674 351512253
524.2 351512253 350102693 349365056 349315941 350333214 353021652 357537180 363413215 369783282 375466585
542.5C75466585M096925K173037K97338j082391k028614k761782l182888l769338m921585
560.9C64287287o094038o838769p348508p304907o064444l836364j174986J639366
577.2C27264637M279852O444633P829308Q113653P356703N894929M201055K360969
593.5C73745739P29502p6324k52545k62797j58578N0515K77966O83278J333654K067357
613.9C78137767K673924L136397L672629M266680M697442M702776M147440L285468
630.2D08720523K619475K386213K356618K114564J571417J069635J051099J371324
646.6D23260868J496285J320988J070559R97215J195103J391381J329094J116842Q80242
664.9D34058577J058817J835286J862198J697928J738578J701206J780480J982123
$$ plain form
542.5 375466585 379563510 381736547 382033885 380951494 378922880 376161098 372978210 369208872 364287287
560.9 364287287 358193249 351354480 344005972 336701065 330636621 326800257 325625271 327264637
577.2 327264637 331544489 337989122 345818430 353932083 361288786 367183715 371384770 373745739
593.5 373745739 374475241 374398917 374146372 373883575 373724997 373775512 374053478 374736756 376070410 378137767
613.9 378137767 380811691 383948088 387620717 391887397 396584839 401287615 405435055 408720523
630.2 408720523 411339998 413726211 416082829 418197393 419768810 420838445 421889544 423260868
646.6 423260868 424757153 426078141 427148700 428145915 429341018 430732399 432061493 433178335 434058577
664.9 434058577 435117394 436952680 438814878 440512806 442251384 443952590 445733070 447715193
681.2D47715193J995236J529336P72476J89096r7603m84973j366168k658517l704398
699.6D43889678l929168l429562k635122j667708l58075J370728L243417M792392N799353
717.9D47075933O453127O846815P121325P407009P225842O317347N161762M286945
734.3D97896105L755778L212571K230704O34253j103163k451360l458857m488767n572885
752.6D90654379o347149o440402n753934m555196l173798j570970N53370L292501O272316
771D72931117Q743435J0242373J0836571J0756433J0172486R159089P812559O298781
787.3E46952844N090534M669190M959225N376876N444109N198241M934609M701256
803.6E87326884M252494L395259K266526J375020R94503R40323P11501j37210j425028
$$ plain form
681.2 447715193 449710429 451239765 452012241 452201337 452103734 451618761 450252593 447594076 443889678
699.6 443889678 439960510 436530948 433895826 432228118 431870043 433240771 436484188 441276580 447075933
717.9 447075933 453529060 460375875 467497200 474904209 482130051 488447398 493609160 497896105
734.3 497896105 501651883 504864454 507095158 507729411 506626248 504174888 500716031 496227264 490654379
752.6 490654379 484307230 477866828 472112894 467557698 464383900 462812930 463366300 466658801 472931117
771 472931117 481674552 491916925 502753496 513509929 523682415 532841504 540654063 546952844
787.3 546952844 552043378 556712568 561671793 567048669 572492778 577691019 582625628 587326884
803.6 587326884 591579378 594974637 597241163 598616183 599610686 600551009 601262510 601125300 599700272
822E99700272k511322l250897m101813n309224o585956p410228p538915p025659o313980
840.3E49652278n921781n802035n569458n094349m782081n074024n840957o446124
856.6E05121469n740135k556056K866477Q428961J2190282J4266789J5258193J4624476
873E64460456J1932433P805765L359079n58674l665149o012142p721067q798659q971929
891.3E51830113q273304p390976o876826o882250p318020p824719q399874r366184
907.6D89497960j0667712j1931360j2710333j2727320j1794150r795546p132590m468024
923.9D08270925k238303n67973P38323J924366K969980L838003M750251N728990N995631
942.3D31410193M324228L28392m841894r555608j3081908j5502036j7078370j8068999
$$ plain form
822 599700272 597188950 593938053 589836240 584527016 577941060 570530832 562991917 555966258 549652278
840.3 549652278 543730497 537928462 532359004 527264655 522482574 517408550 511567593 505121469
856.6 505121469 499381334 496825278 499691755 508120716 520310998 534577787 549835980 564460456
873 564460456 576392889 584198654 587557733 586999059 583333910 577321768 569600701 560802042 551830113
891.3 551830113 543556809 536165833 529289007 522406757 515088737 507264018 498864144 489497960
907.6 489497960 478830248 466898888 454188555 441461235 429667085 419871539 412738949 408270925
923.9 408270925 406032622 405464649 406202972 408127338 411097318 414935321 419685572 425414562 431410193
942.3 431410193 435734421 436062813 431220919 421665311 408583403 393081367 376002997 357933998
958.6C57933998j8602073j8859565j9093186j9265562j9219309j8896118j8236205
972.9B25761980j7210096j5789271j3945937j1705503r243741o839157m649057k819777
989.2A43559441j450539m77910K47643P97227J112491J174345J031235O92159K28509
1007.6A46914601j79827l80024k88904J13309P27221J325786J885727K430514K828046
1025.9A55376449L053606L130018L031970K697795K082542J302331O88136M33534M82604
1044.3A72278985P47592J220703J999154L175512M576013N809754O814793P834911
1060.6B04457417Q898586R306073P633523K842664l852993q916467r722859p100493
1076.9B03545451l613502p38188J375407K876922L904030M721314N419060N786509
$$ plain form
958.6 357933998 339331925 320472360 301379174 282113612 262894303 243998185 225761980
972.9 225761980 208551884 192762613 178816676 167111173 157867432 151028275 146379218 143559441
989.2 143559441 142108902 141630992 141878635 142675862 143788353 144962698 145993933 146686092 146914601
1007.6 146914601 146734774 146354750 146065846 146179155 146906376 148232162 150117889 152548403 155376449
1025.9 155376449 158430055 161560073 164592043 167289838 169372380 170674711 171362847 171796381 172278985
1044.3 172278985 173026577 174247280 176246434 179421946 183997959 189807713 196622506 204457417
1060.6 204457417 213356003 222662076 230295599 233138263 229285270 220368803 210645944 203545451
1076.9 203545451 199931949 199193761 200569168 203446090 207350120 212071434 217490494 223277003
1093.2B23277003N581915M676938L254533J803100Q81612Q18461J547471K632320L606260
1111.6B48079613M162714M109025L501564K648860J954317J744479K192796L162801
1127.9B71556169M145026M463971L654986J644135j248449m279882o605953p755518
1144.2B65574485p824421p178157o100089m775509l368139j910478m34712R68158K429799
1162.6B37380937M126921O053343Q102343J0096162J1736304J2854964J3532191J3966084
1178.9C17849249J4257133J4204859J3561637J2307912J0632038Q771121O895542N095840
1195.2D03575331L508329K379328J940579K144157K648384L236800L958881M846662
1211.5D28238451N706341O195813N972326M917025L354073J799881N21869m78268j287937
$$ plain form
1093.2 223277003 228858918 233535856 236790389 238593489 239475101 240293562 241841033 244473353 248079613
1111.6 248079613 252242327 256351352 259852916 262501776 264456093 266200572 268393368 271556169
1127.9 271556169 275701195 280165166 283820152 285464287 284215838 279935956 273330003 265574485
1144.2 265574485 257750064 250571907 244471818 239696309 236328170 234417692 233982980 234951138 237380937
1162.6 237380937 241507858 247561201 255663544 265759706 277496010 290350974 303883165 317849249
1178.9 317849249 332106382 346311241 359872878 372180790 382812828 391583949 398479491 403575331
1195.2 403575331 407083660 409462988 411403567 413547724 416196108 419432908 423391789 428238451
1211.5 428238451 433944792 440140605 446112931 451029956 454384029 456183910 456705779 456227511 454939574
1229.9D54939574j929045k254188k147257j760066j331240q59081j93626P07984J671135
1248.2D46844190K385587K660751K516955K124280J712263J463502J410544J541198
1264.6D62659270J923292K463222K797902K597600J855612Q55296o2495o11216p05182
1282.9D73773301o10501o58899r37075j305282j590908j836359k180338k547443k731740
1301.3D59374756k660394k484977k359659k201199j970530j772374j589447j468659
1317.6D42867517j616567k218097l289402m584640n690485o238461o117523n441665
1333.9D07670677m379303l128379j796097n72949J68800M20570L43472R0540j61946
1352.3C98655385m65334q40097j120359j237482j218110r22501n64218l66598k0772
$$ plain form
1229.9 454939574 453010529 450756341 448609084 446849018 445517778 444658697 444465071 445173055 446844190
1248.2 446844190 449229777 451890528 454407483 456531763 458244026 459707528 461118072 462659270
1264.6 462659270 464582562 467045784 469843686 472441286 474296898 475152194 475089699 474478483 473773301
1282.9 473773301 473162800 472503901 471566826 470261544 468670636 466834277 464653939 462106496 459374756
1301.3 459374756 456714362 454229385 451869726 449668527 447697997 445925623 444336176 442867517
1317.6 442867517 441250950 439032853 435743451 431158811 425468326 419229865 413112342 407670677
1333.9 407670677 403291374 400162995 398366898 397793949 397962749 398383319 398726791 398817331 398655385
1352.3 398655385 398190051 397349954 396229595 394992113 393774003 392851502 392287284 391920686 391899914
1370.6C91899914N95301J210868J399905J313895J327276J746356K824396M343450
1386.9D06661361M876823L878325K630383J352101J30147p69377j223832j533836k076775
1405.3D13925320k289027k192319k195894k053380j665861j444339j249224m68105
1421.6D00367171K41816O08205R54241J351893J695126J900614K178937K311051K042144
1440D13651198J954258J765579J219302K86937o56277j137555j310169k117873k770424
1458.3D10884976j018196O57380K201050L845811N046696O982117J0496468J1594057
1474.7D50690359J0122716R253115Q951545Q689016P883787P543534P857382P454932
1491E18446386N818069N225599N720317N373716M494071L920615M185140M944623L692746
$$ plain form
1370.6 391899914 392495215 393706083 395105988 396419883 397747159 399493515 402317911 406661361
1386.9 406661361 411538184 415416509 418046892 419398993 419529140 418759763 417535931 416002095 413925320
1405.3 413925320 411636293 409443974 407248080 405194700 403528839 402084500 400835276 400367171
1421.6 400367171 400608987 401217192 402171433 403523326 405218452 407119066 409298003 411609054 413651198
1440 413651198 415605456 417371035 418590337 418877274 418220997 417083442 415773273 413655400 410884976
1458.3 410884976 409866780 410524160 412725210 416571021 421617717 428599834 439096302 450690359
1474.7 450690359 460813075 470066190 479017735 487706751 495590538 503134072 510991454 518446386
1491 518446386 524264455 529490054 535210371 540584087 545078158 548998773 553183913 558128536 561821282
1509.3E61821282K816975K953172L109097L148258K909243K948105K745629K350926
1525.6E84802687K221346J970232J986444K100825J884639J791537J907349J087010
1542E99752069N23924O08802O24418M61936K47717K01106J96100n21720j788378j190423
1562.4E99115551r98497j189530j527250j995027j630307j579999k486885k442420
1578.7E85265636j906871j979471k112329k249240k350748k346397k279460k368629
1595E67672491k505064k544522k683223k852737k895832k994597l362358l496647l244340
1613.4E41093171l662765m650295l744781l109753l841579l843248l478348l245831
1629.7E11516571k455890k000570k500594k046466q47995j80066K90930P64311J310467
$$ plain form
1509.3 561821282 564638257 567591429 570700526 573848784 576758027 579706132 582451761 584802687
1525.6 584802687 587024033 588994265 590980709 593081534 594966173 596757710 598665059 599752069
1542 599752069 600275993 600884795 601509213 601971149 602218866 602419972 602616072 602094352 600305974 599115551
1562.4 599115551 598117054 596927524 595400274 593405247 591774940 590194941 587708056 585265636
1578.7 585265636 583358765 581379294 579266965 577017725 574666977 572320580 570041120 567672491
1595 567672491 565167427 562622905 559939682 557086945 554191113 551196516 547834158 544337511 541093171
1613.4 541093171 537430406 532780111 529035330 525925577 522083998 518240750 514762402 511516571
1629.7 511516571 509060681 507060111 504559517 502513051 501665056 501484990 501775920 502540231 503850698
1648E03850698J576663K263605L365755K858937K782345L496170M424453M725337M280448
1666.4E33624411M767596N620003N209327N599201O191372N521954N196392O023765
1682.7E77754021P643163O274283M933178N007565M568160M871666N242169M528165
1699F20822370M121125L074825K621352K772868K504766K309680K283812K381622K685190
1717.4F45577610K495944K047062J982987K067983K109289K251685K236545K249539
1733.7F63018644K032339J776338K190292K552152K562224K687335L015280L505171
1750F83339775L630101L192127L089011L094911K876819K944767K715468K357722K237975
1768.4G09478676K108217K034902J788557J501083J472831J470327J348377J314282
$$ plain form
1648 503850698 505427361 507690966 511056721 513915658 516698003 520194173 524618626 529343963 533624411
1666.4 533624411 538392007 544012010 549221337 554820538 561011910 566533864 571730256 577754021
1682.7 577754021 585397184 591671467 596604645 601612210 606180370 611052036 616294205 620822370
1699 620822370 624943495 628018320 630639672 633412540 635917306 638226986 640510798 642892420 645577610
1717.4 645577610 648073554 650120616 652103603 654171586 656280875 658532560 660769105 663018644
1733.7 663018644 665050983 666827321 669017613 671569765 674131989 676819324 679834604 683339775
1750 683339775 686969876 690162003 693251014 696345925 699222744 702167511 704882979 707240701 709478676
1768.4 709478676 711586893 713621795 715410352 716911435 718384266 719854593 721202970 722517252
1784.7G22517252J385570J395940J352668J273275J101732J097917J210153J217187
1801G32551694J070321R54926J007497J103461J110851R54211Q27670Q23140Q90792
1819.4G41294563R43601R15706Q14617O99281O71268O54340O17385N64456N13732M96686
1839.8G48185635N42342N92947M84348K90930J91510K18153L14831M07517L89695K83480
1860.2G51901388K26855L14713M55499M57823K62558J33872K13862L81231N32449N53667
1880.5G55433917M74334M10139M34816N13494N04375L82066K48432K07007K96175M01914
1900.9G59306669L46959J79648O5208R2089J97649K44915K16544J41084J00494J57833
1921.3G61049092K58863K69234J72675P0810R7036K32399K77221J96993J02520J15514
$$ plain form
1784.7 722517252 723902822 725298762 726651430 727924705 729026437 730124354 731334507 732551694
1801 732551694 733622015 734576941 735584438 736687899 737798750 738752961 739580631 740403771 741294563
1819.4 741294563 742238164 743153870 743968487 744667768 745339036 745993376 746610761 747175217 747688949 748185635
1839.8 748185635 748727977 749320924 749805272 750096202 750287712 750505865 750820696 751228213 751617908 751901388
1860.2 751901388 752128243 752442956 752898455 753356278 753618836 753752708 753966570 754347801 754880250 755433917
1880.5 755433917 755908251 756318390 756753206 757266700 757771075 758153141 758401573 758608580 758904755 759306669
1900.9 759306669 759653628 759833276 759898484 759990573 760188222 760433137 760649681 760790765 760891259 761049092
1921.3 761049092 761307955 761577189 761749864 761820674 761917710 762150109 762427330 762624323 762726843 762842357
1941.7G62842357J95563K43366K44617K03192J75775K22921L21746L87788L38375J90616
1962.1G65366316J53780K75969L31581K30730J27732J04130J64270K60592K51233J46806
1982.5G67413139O0320N2691J24037J95801J37329j0073n5313J3471N8770P987j00374
2005G67897785k02775k31803k30431k60413l22998m26113n41449o15895p18057p40885
2025.4G63606966m35770j80781k93314m34161m33564m34041m58419m45962m13358l69132
2045.8G59708464l04639k20716j50800j12832o6518L218N5433O9439N3167L3200P1347
2068.2G59138763J50144J70410R5188K3306J5378O1989J22189J49250J31548Q9645
2088.6G60147810J16289J89006K15888J87635J55330J63853K14219K60890K31624J67787
$$ plain form
1941.7 762842357 763037920 763281286 763525903 763729095 763904870 764127791 764449537 764837325 765175700 765366316
1962.1 765366316 765520096 765796065 766127646 766358376 766486108 766590238 766754508 767015100 767266333 767413139
1982.5 767413139 767473459 767526150 767650187 767845988 767983317 767973244 767917931 767931402 767990172 767998159 767897785
2005 767897785 767695010 767463207 767232776 766972363 766649365 766223252 765681803 765065908 764347851 763606966
2025.4 763606966 763171196 762990415 762697101 762262940 761829376 761395335 760936916 760490954 760077596 759708464
2045.8 759708464 759403825 759183109 759032309 758919477 758852959 758856177 758911610 758981049 759034216 759067416 759138763
2068.2 759138763 759288907 759459317 759554505 759577811 759593189 759655178 759777367 759926617 760058165 760147810
2088.6 760147810 760264099 760453105 760668993 760856628 761011958 761175811 761390030 761650920 761882544 762050331
2109G62050331J43885J52171J45316J36793J15335M1008j3590P450M0353M6968L6121
2131.4G62902141P629K1756P2837R3460O9618L0637R536J2637N3465J28865J89901
2153.9G63592482J97827K11716K68996L44694M14490M34697M26650M80413N79894O22928
2174.3G67574787O15060O21379O27935O04749O09874O38247O10649N46098M92990M58539
2194.6G73400307M72128N37455N61536N09679M59850M59611M92931N45799N71847N21541
2215G78532684M58538M52161M82261M67837L85225L12567L10123L55899L99470L76463
2235.4G82533228K73467K10464K63810L51309L38376K19941J50860K32934L49999L41058
2255.8G85265446K39968J55926J58310K54810L38554L22580K64585K26200K21431K61843
$$ plain form
2109 762050331 762194216 762346387 762491703 762628496 762743831 762784839 762771249 762778699 762819052 762866020 762902141
2131.4 762902141 762909770 762931526 763004363 763097823 763167441 763198078 763207614 763220251 763273716 763402581 763592482
2153.9 763592482 763790309 764002025 764271021 764615715 765030205 765464902 765891552 766371965 766951859 767574787
2174.3 767574787 768189847 768811226 769439161 770043910 770653784 771292031 771902680 772448778 772941768 773400307
2194.6 773400307 773872435 774409890 774971426 775481105 775940955 776400566 776893497 777439296 778011143 778532684
2215 778532684 778991222 779443383 779925644 780393481 780778706 781091273 781401396 781757295 782156765 782533228
2235.4 782533228 782806695 783017159 783280969 783632278 783970654 784190595 784341455 784574389 784924388 785265446
2255.8 785265446 785505414 785661340 785819650 786074460 786413014 786735594 787000179 787226379 787447810 787709653
2276.2G87709653K96951K59340J83522J48952J92166K89678K80738J43826O9916R7812
2296.6G89672554J78337K45034J94848P2539J7643P5578J98782K19464Q2314M4406
2317G91001499J69038K29002J67846L0518q9646o377J00791L398j34051k22743k63274
2339.5G90986001j82926j13428l18825n28991m22001j07110J97947K92361K08259O079
2359.9G90017366j99556l28243m22835n17249o21319o74427o14345n02705m33803m38690
2380.2G85264194m58300m32551l63469k57552j90198k17140k87890l57092l96371l79324
2400.6G81924307l51488l87728m53771m85777m93825n02706n13494n56170o35505o90937
2421G76852906o97494o76751o82175p25508p46608p40409p48693p54714p72894q27193
$$ plain form
2276.2 787709653 788006604 788265944 788449466 788598418 788790584 789080262 789361000 789504826 789574742 789672554
2296.6 789672554 789850891 790095925 790290773 790363312 790380955 790456533 790655315 790874779 790957093 791001499
2317 791001499 791170537 791399539 791567385 791597903 791508257 791501880 791602671 791606069 791472018 791249275 790986001
2339.5 790986001 790803075 790689647 790370822 789841831 789419830 789312720 789510667 789803028 790011287 790017366
2359.9 790017366 789817810 789489567 789066732 788549483 787928164 787253737 786639392 786136687 785702884 785264194
2380.2 785264194 784805894 784373343 784009874 783752322 783562124 783344984 783057094 782700002 782303631 781924307
2400.6 781924307 781572819 781185091 780731320 780245543 779751718 779249012 778735518 778179348 777543843 776852906
2421 776852906 776155412 775478661 774796486 774070978 773324370 772583961 771835268 771080554 770307660 769480467
2441.4G69480467q39830p88033p68303p97153q10027q05378p59780o95289p01010p58052
2461.8G61757612p89046p79510p37369o68466o41882o63638o84083o86109o44684n88774
2482.2G54874051o15836o64651n94497n00083m85718n04792m96208m46320m08828m18842
2502.6G49738276m37796m36843m34756m24087m33802m93169n17726n04971n45621n95093
2523G44914412o08325o34789o69181o84321p38561q41439q79944q41498q12232q32200
2543.4G37371922q66533q62360q24511p95066q05378q13544q35895q98064q92222q10504
2563.8G28967845p43448p30276p86961q32617p96854p56324p76350q27193q28028p50959
2584.2G21138835o60956o51240p08044o90102n82815n06997n18918n73218o16073o69718
$$ plain form
2441.4 769480467 768640637 767852604 767084301 766287148 765477121 764671743 763911963 763216674 762515664 761757612
2461.8 761757612 760968566 760189056 759451687 758783221 758141339 757477701 756793618 756107509 755462825 754874051
2482.2 754874051 754258215 753593564 752999067 752498984 752013266 751508474 751012266 750565946 750157118 749738276
2502.6 749738276 749300480 748863637 748428881 748004794 747570992 747077823 746560097 746055126 745509505 744914412
2523 744914412 744306087 743671298 743002117 742317796 741579235 740737796 739857852 739016354 738204122 737371922
2543.4 737371922 736505389 735643029 734818518 734023452 733218074 732404530 731568635 730670571 729778349 728967845
2563.8 728967845 728224397 727494121 726707160 725874543 725077689 724321365 723545015 722717822 721889794 721138835
2584.2 721138835 720477879 719826639 719118595 718428493 717845678 717338681 716819763 716246545 715630472 714960754
2604.6G14960754p23422p27832p69317r08494j016438j035631j039803j110136j244545
2623G06385136j352907j399934j386642j364112j437664j546681j548410j482427j437902
2641.3F93428457j448393j502335j542747j543522j490951j407444j387537j447022
2657.6F81658506j474559j424789j343787j295269j319229j356542j305700j192748
2673.9F70945883j153231j186252j204073j169085j097382j063883j104176j178861
2690.3F61788940j228869j233816j233697j275658j355052j449287j479387j394093
2706.6F51139081j332224j395941j461446j429081j367628j321257j266479j218319
2722.9F40346706j198471j156985j079023j033247j015901j003504r96232r72390r35018
$$ plain form
2604.6 714960754 714237332 713509500 712740183 711831689 710815251 709779620 708739817 707629681 706385136
2623 706385136 705032229 703632295 702245653 700881541 699443877 697897196 696348786 694866359 693428457
2641.3 693428457 691980064 690477729 688934982 687391460 685900509 684493065 683105528 681658506
2657.6 681658506 680183947 678759158 677415371 676120102 674800873 673444331 672138631 670945883
2673.9 670945883 669792652 668606400 667402327 666233242 665135860 664071977 662967801 661788940
2690.3 661788940 660560071 659326255 658092558 656816900 655461848 654012561 652533174 651139081
2706.6 651139081 649806857 648410916 646949470 645520389 644152761 642831504 641565025 640346706
2722.9 640346706 639148235 637991250 636912227 635878980 634863079 633859575 632863343 631890953 630955935
2741.2F30955935r36568r64642r46402r00686q61287q17299p92206p89642p69853p44522
2761.6F22432828p47979p59065p85053q46505q97169r08852r19520j006127j150727
2780F14411831j239479j266479j310170j414358j514972j566708j644671j763880j862586
2798.4F00828528j928269j993657k081215k189040k284944k372325k472222k527058
2814.7E82979798k548575k627790k756298k882361k968252l005862l080130l215015
2831E59895515l344118l469587l581881l693581l909588m237294m532516m694879m719198
2849.3E23712873m567086m187227l687381l317416l239512l489674l993809m601061
2865.7D92629707n213827n729407o035596o174535o222188o069303n583763m835159
$$ plain form
2741.2 630955935 630019367 629054725 628108323 627207637 626346350 625529051 624736845 623947203 623177350 622432828
2761.6 622432828 621684849 620925784 620140731 619294226 618397057 617488205 616568685 615562558 614411831
2780 614411831 613172352 611905873 610595703 609181345 607666373 606099665 604454994 602691114 600828528
2798.4 600828528 598900259 596906602 594825387 592636347 590351403 587979078 585506856 582979798
2814.7 582979798 580431223 577803433 575047135 572164774 569196522 566190660 563110530 559895515
2831 559895515 556551397 553081810 549499929 545806348 541896760 537659466 533126950 528432071 523712873
2849.3 523712873 519145787 514958560 511271179 507953763 504714251 501224577 497230768 492629707
2865.7 492629707 487415880 481686473 475650877 469476342 463254154 457184851 451601088 446765929
2882D46765929l993839l126233k314508j683832j205653q60512p06434p22140q52406
2900.3D31300372j068235j340180j653493k033054k515406l073662l640414m109800
2916.6D11866128m303097m201114l873408l289223k458960j459598l29823R29118K222478
2935C95102501L447145M543781N379022N902677O211788O412983O582856O710321O745636
2953.4D47038710O693900O595582O473809O254494N899579N500644N108654M765451
2969.7D94330823M583449M536002M440785M295409M168450L942490L577888L205240
2986E27080536K863169K540767K234578J899421J573324J218140P88332M01854O4850
3004.4E40664971k59340n40614q06391j130581j495481j741588j867235k070486k320886
$$ plain form
2882 446765929 442772090 439645857 437331349 435647517 434441864 433581352 432874918 432152778 431300372
2900.3 431300372 430232137 428891957 427238464 425205410 422690004 419616342 415975928 411866128
2916.6 411866128 407563031 403361917 399488509 396199286 393740326 392280728 391950905 392880023 395102501
2935 395102501 398549646 403093427 408472449 414375126 420586914 426999897 433582753 440293074 447038710
2953.4 447038710 453732610 460328192 466802001 473056495 478956074 484456718 489565372 494330823
2969.7 494330823 498914272 503450274 507891059 512186468 516354918 520297408 523875296 527080536
2986 527080536 529943705 532484472 534719050 536618471 538191795 539409935 540198267 540600121 540664971
3004.4 540664971 540405631 539865017 539058626 537928045 536432564 534690976 532823741 530753255 528432369
3022.7E28432369k499044k644002k699256k663314k683104k856671l051997l031253
3039E06303728k945364l024042l187924l298521l286660l216952l199756l240049l332973
3057.4D77571487l397136l318549l184408l140956l250569l414273l419012l257543
3073.7D51189041l081083l016532l159850l347338l321528l207356l160000l144592
3090D25750762l186166l203422l093809k960473k995223l143936l130794k944350k843380
3108.4C98249209k956927k997666k804757k688348k772987k926498l022045k960146
3124.7C75119835k812803k717822k726287k757698k643794k458275k449423k587974
3141C53965759k624064k557874k517432k399951k237827k283841k470911k471536k311826
$$ plain form
3022.7 528432369 525933325 523289323 520590067 517926753 515243649 512386978 509334981 506303728
3039 506303728 503358364 500334322 497146398 493847877 490561217 487344265 484144509 480904460 477571487
3057.4 477571487 474174351 470855802 467671394 464530438 461279869 457865596 454446584 451189041
3073.7 451189041 448107958 445091426 441931576 438584238 435262710 432055354 428895354 425750762
3090 425750762 422564596 419361174 416267365 413306892 410311669 407167733 404036939 401092589 398249209
3108.4 398249209 395292282 392294616 389489859 386801511 384028524 381102026 378079981 375119835
3124.7 375119835 372307032 369589210 366862923 364105225 361461431 359003156 356553733 353965759
3141 353965759 351341695 348783821 346266389 343866438 341628611 339344770 336873859 334402323 332090497
3159.4C32090497k219647k195746k176910k156973k141059k099812k020746j976133
3175.7C15103471j997351k004803j977831j927346j813948j678675j655013j755863
3192C00292641j801878j732379j670927j649291j590401j533448j533777j512825j445681
3210.3B85822034j428932j458824j429230j395911j390963j333744j294076j302094
3226.7B74788260j251637j129151j045167j127988j242042j191318j104981j054853
3243B65641123r71973r67771j084208j084149r08881p98613q75771r98885r93103q76605
3263.4B56081164p60883o61344n72264o16818p98971r26673q80331p36594p02486p36847
3283.8B48687953o70016n79953n04524m68299n62563p08312p99432p73609o24642m68626
$$ plain form
3159.4 332090497 329870850 327675104 325498194 323341221 321200162 319100350 317079604 315103471
3175.7 315103471 313106120 311101317 309123486 307196140 305382192 303703517 302048504 300292641
3192 300292641 298490763 296758384 295087457 293438166 291847765 290314317 288780540 287267715 285822034
3210.3 285822034 284393102 282934278 281505048 280109137 278718174 277384430 276090354 274788260
3226.7 274788260 273536623 272407472 271362305 270234317 268992275 267800957 266695976 265641123
3243 265641123 264669150 263701379 262617171 261533022 260624141 259825528 258949757 257950872 256957769 256081164
3263.4 256081164 255320281 254658937 254086673 253469855 252670884 251744211 250863880 250127286 249424800 248687953
3283.8 248687953 248017937 247437984 246933460 246465161 245902598 245194286 244394854 243621245 242996603 242527977
3304.2B42527977m86598p23928r51126r59799q52212p93860p42539o75843o34223o29514
3324.6B35078335p33391q33571p92652p49961p10606o19531o40467p31855p34002p45132
3345B27787167p30336o19724o92874r24930r27940p22006n94467o42598o88031n25356
3365.4B20718905m17918o34014r17465q91909o02752m67568n76139o90088o45190m84079
3385.7B14391783k53454k9221j23933m44561m88282j81555n81l08306o65590m76032
3406.1B11420268j01403p2434k07394k63766k52470j73524r4638n4270M3929J91346
3426.5B10435644K79456K24143J97709K54527J33574q4102r2090J31160L81724M27618
3446.9B12289363L30314L50788M04939M13359N19052O63519O19337N95420Q25525R54553
$$ plain form
3304.2 242527977 242041379 241317451 240366325 239406526 238554314 237760454 237017915 236342072 235707849 235078335
3324.6 235078335 234344944 233511373 232718721 231968760 231258154 230638623 229998156 229266301 228532299 227787167
3345 227787167 227056831 226437107 225744233 224819303 223891363 223169357 222574890 221932292 221244261 220718905
3365.4 220718905 220300987 219666973 218749508 217857599 217254847 216787279 216211140 215521052 214875862 214391783
3385.7 214391783 214138329 214109108 213985175 213540614 213052332 212870777 212870196 212561890 211896300 211420268
3406.1 211420268 211318865 211246431 211039037 210775271 210522801 210349277 210254639 210200369 210244298 210435644
3426.5 210435644 210715100 210939243 211136952 211391479 211525053 211440951 211348861 211480021 211861745 212289363
3446.9 212289363 212619677 212970465 213375404 213788763 214307815 214971334 215590671 216186091 217011616 217966169
3467.3B17966169O70374K68116K72662N68345Q14155Q17611N69255N41254P84263P85068
3487.7B24057272O92099Q45194R34229Q73744Q77306R48742R19536P39142O55070P42793
3508.1B32285127R09463J106053J069531Q52138Q27655J012221J207233J118183Q58321
3526.5B41245925Q07390J011223J285940J438811J324386J156077J323491J532033
3542.8B51125276J390725J102806J174032J401782J462907J557618J755774J951993
3559.1B62922913K016067J889944J749456J998455K459436K529383K413094K471745
3575.4B80450493K639383K858132L124714L206581K937049K689600L019362L323794
3591.7C04249108L347963L412515L584564L655105L688425L724993L572642L532946
$$ plain form
3467.3 217966169 218636543 218904659 219177321 219745666 220559821 221377432 221946687 222487941 223272204 224057272
3487.7 224057272 224749371 225594565 226528794 227402538 228279844 229228586 230148122 230887264 231542334 232285127
3508.1 232285127 233194590 234300643 235370174 236222312 237049967 238062188 239269421 240387604 241245925
3526.5 241245925 242053315 243064538 244350478 245789289 247113675 248269752 249593243 251125276
3542.8 251125276 252516001 253618807 254792839 256194621 257657528 259215146 260970920 262922913
3559.1 262922913 264938980 266828924 268578380 270576835 273036271 275565654 277978748 280450493
3575.4 280450493 283089876 285948008 289072722 292279303 295216352 297905952 300925314 304249108
3591.7 304249108 307597071 311009586 314594150 318249255 321937680 325662673 329235315 332768261
3608.1C32768261L756255L947765M046261L984809L947228M263521M316628M012704
3624.4C65043432L702431L778518M367977M387707M220813M139155M061073M108161
3640.7C97809267M163683M092156M018337M234075M465223M140198L863066M166335
3657D30952340M298687L913701L676355L717422L580481L402233L653407L494561L124952
3675.4D63814139L367931L419280L252566L225714L171384L013402K706469K540171
3691.7D88511056K593964K579480K426237K220303K179474K321064K321601K148867
3708E07302046J924872J860202K118110K120853J896023J730025J666725J628518J656234
3726.4E23903608J811207J778125J574398J423537J593352J770377J527071J011908
$$ plain form
3608.1 332768261 336524516 340472281 344518542 348503351 352450579 356714100 361030728 365043432
3624.4 365043432 368745863 372524381 376892358 381280065 385500878 389640033 393701106 397809267
3640.7 397809267 401972950 406065106 410083443 414317518 418782741 422922939 426786005 430952340
3657 430952340 435251027 439164728 442841083 446558505 450138986 453541219 457194626 460689187 463814139
3675.4 463814139 467182070 470601350 473853916 477079630 480251014 483264416 485970885 488511056
3691.7 488511056 491105020 493684500 496110737 498331040 500510514 502831578 505153179 507302046
3708 507302046 509226918 511087120 513205230 515326083 517222106 518952131 520618856 522247374 523903608
3726.4 523903608 525714815 527492940 529067338 530490875 532084227 533854604 535381675 536393583
3742.7E36393583R51946J543104J383245J002610J367450J612961J366496J202166
3759E46823561J377404J425207J262784J163363J068354J096129J236796J287163J266956
3777.3E58007717J123250R94026R12905R16958J019180J043260J045346J016319R64761
3795.7E67043722J006484Q50022P58230J028657Q46684P14064J003563J091123Q90910
3814.1E75233459Q10624R40382O10769N58615R72032R61185Q00967O89983P48992R60768
3834.4E83287776Q35895M83275N05924P04407Q33631Q45730P32899M11034o4791M52698
3854.8E89028478J133203R38595O96659N85436N93663N86271M47988N36561O29306
3873.2E95176160O41346O72877N14150N25176O33598M91321M66585M53591L69132M64558
$$ plain form
3742.7 536393583 537345529 538888633 540271878 541274488 542641938 544254899 545621395 546823561
3759 546823561 548200965 549626172 550888956 552052319 553120673 554216802 555453598 556740761 558007717
3777.3 558007717 559130967 560124993 561037898 561954856 562974036 564017296 565062642 566078961 567043722
3795.7 567043722 568050206 568900228 569658458 570687115 571533799 572247863 573251426 574342549 575233459
3814.1 575233459 576044083 576984465 577595234 578153849 579125881 580087066 580888033 581578016 582327008 583287776
3834.4 583287776 584123671 584606946 585112870 585817277 586650908 587496638 588229537 588640571 588575780 589028478
3854.8 589028478 590161681 591100276 591796935 592382371 592976034 593562305 594010293 594546854 595176160
3873.2 595176160 595817506 596490383 597004533 597529709 598163307 598654628 599121213 599574804 599943936 600408494
3893.6F00408494N44072M62949L75807L58880L50177M34101M74214L89338L52800L94523
3914F04545355L89397L37601L48270L07262J97112K21789L27587L13044L14891L86059
3934.4F07688367L17932K28703K62379L16739L54588L69728L16679K52486K08914K14577
3954.8F10531092K93076L39269K92480K57433K48372J81198J54973K24471K83003K73823
3975.2F13079190K14100J59323J96755K60890K21848J75298J85370K02417K21432K39431
3995.6F15156054K16425
3997.6F15372479
$$ plain form
3893.6 600408494 600952566 601415515 601791322 602150202 602500379 602934480 603408694 603798032 604150832 604545355
3914 604545355 604934752 605272353 605620623 605927885 606124997 606346786 606674373 606987417 607302308 607688367
3934.4 607688367 608006299 608235002 608497381 608814120 609168708 609538436 609855115 610107601 610316515 610531092
3954.8 610531092 610824168 611163437 611455917 611713350 611961722 612142920 612297893 612522364 612805367 613079190
3975.2 613079190 613293290 613452613 613649368 613910258 614132106 614307404 614492774 614695191 614916623 615156054
3995.6 615156054 615372479
3997.6 615372479
##END=$$ End of the data block
