##TITLE=$$ Begin of the data block
##JCAMP-DX=5.00 $$ ACD/SpecManager v 10.08
##SPECTROMETER/DATA SYSTEM=Alpha
##DATE=29 Dec 2014 11:22:02
##DATA TYPE=INFRARED SPECTRUM
##DATA CLASS=XYDATA
##ORIGIN=
##OWNER=
##NPOINTS=1765
##FIRSTX=399.76428223
##LASTX=3997.64306641
##MAXX=3997.64306641
##MINX=399.76428223
##MAXY=0.83693922
##MINY=0.23230797
##XFACTOR=1.0000000000
##YFACTOR=1.000000000000000e-9
##FIRSTY=0.57274616
##DELTAX=2.03961372
##XUNITS=1/CM
##YUNITS=ARBITRARY UNITS
##XYDATA=(X++(Y..Y))
399.8E72746158o438196m902065l128171j379967r834J188159K188801K551973J618803
418.1E64435661j202583l115476l159463k754390k456546k684176l750265m576683
434.4E40736079l293752j64927K943755M916012M790425L519178L036618L102064K577901
452.8E62163353J112580q40485k243697k169371j787424j970172k891123m059494m402161
471.2E42912006l587901k137542j370728j850665k432346j741528j46151R61900N73873
489.5E31180918j091420k456069k524078j666367r76682j739681l361702m110455l875852
507.9E09378612l207922k897561l610193n090058o021142n080789l122330j870841
524.2D78477776j671314j706541j107961N26727K829939M653662N316675N188286M881859
$$ plain form
399.8 572746158 566307962 561405897 558277726 556897759 556887925 558076084 560264885 562816858 564435661
418.1 564435661 563233078 560117602 556958139 554203749 551747203 549063027 545312762 540736079
434.4 540736079 537442327 537277400 540221155 545137167 549927592 553446770 556483388 559585452 562163353
452.8 562163353 563275933 562435448 560191751 558022380 556234956 554264784 551373661 547314167 542912006
471.2 542912006 539324105 537186563 535815835 533965170 531532824 529791296 529645145 530607045 531180918
489.5 531180918 530089498 527633429 525109351 523442984 522466302 520726621 517364919 513254464 509378612
507.9 509378612 506170690 503273129 499662936 494572878 488551736 483470947 480348617 478477776
524.2 478477776 476806462 475099921 473991960 474518687 477348626 482002288 487318963 492507249 497389108
542.5D97389108M483074L513753J515806j061857k875387k978951k236515k477855
558.9D95271176m177272o275982p626384p868141p112414n844116m379749k339483
575.2D49647635N63830M070223P222295Q643239Q010775O365597M736752L705263K908766
593.5D95874375J627356l0190j293093j370728l00437Q95351J017541J58757j82510
611.9D96396422P94799K400249L734052M076064L468155L001690L351272M028558M087866
630.2E25339127L082275J496673O57260J182318K082765K166271J329362L62576J82867
648.6E37881494J019060J963616K098500J364947M47392K44379R44078J353383R63867
667E48280716J087069J441062J320541J791358K448916K254725J387954O69479O48856
$$ plain form
542.5 497389108 501872182 505385935 506901741 505839884 502964497 499985546 497749031 495271176
558.9 495271176 491093904 484817922 477191538 469323397 462210983 456366867 451987118 449647635
575.2 449647635 450211465 454281688 461503983 470147222 478157997 484523594 489260346 492965609 495874375
593.5 495874375 497501731 497471541 496178448 494807720 494507283 495402634 496420175 496578932 496396422
611.9 496396422 497191221 499591470 503325522 507401586 510869741 513871431 517222703 521251261 525339127
630.2 525339127 528421402 529918075 530575335 531757653 533840418 536006689 537336051 537698627 537881494
648.6 537881494 538900554 540864170 542962670 544327617 544775009 545019388 545963466 547316849 548280716
667 548280716 549367785 550808847 552129388 553920746 556369662 558624387 560012341 560681820 561330676
685.3E61330676J165748J404583P01189p30276k004266k570808k574801k500117k704441
703.7E51517487k871156k275884o62208J503110L321946M271209M576385M927576N667924
722E69976389O435693O781399O294847N059599L884375L392935L420830L252149K347171
740.4F10845387P61151q19623j791597k249002k810597l863931n058587n655527n276143
758.7E84081531m133404k683758j369715j46926J568735M053652O783247Q884132R711147
777.1F06748641R151279P938982P172763P036865O697237N538583L927410L052890
793.4F57264650L642440N005598N647957M743576L056407J999080K137125K675235
809.7F86172068K401233J131177j47701m47213K45452R57548N53966j250088l344059
$$ plain form
685.3 561330676 562496424 563901007 564602196 563871920 561867654 559296846 556722045 554221928 551517487
703.7 551517487 548646331 546370447 545708239 547211349 550533295 554804504 559380889 564308465 569976389
722 569976389 576412082 583193481 589488328 594547927 598432302 601825237 605246067 608498216 610845387
740.4 610845387 611606538 610786915 608995318 606746316 603935719 600071788 595013201 589357674 584081531
758.7 584081531 579948127 577264369 575894654 575747728 577316463 581370115 588153362 597037494 606748641
777.1 606748641 615899920 623838902 631011665 638048530 644745767 650284350 654211760 657264650
793.4 657264650 660907090 665912688 671560645 676304221 679360628 681359708 683496833 686172068
809.7 686172068 688573301 689704478 689556777 689109564 689355016 690312564 690866530 689616442 686272383
828.1F86272383m287064l959656l536999m087985n316973o029069n485535m116535
844.4F49452567l195524l612280m963636o091535o279767n769908m902721k917290
860.7F11719906R59397N731404R883523J2974858J4480531J3467193J0323822O879926
877F86420560M407227K469957k5511l206730n948722p014096o271005m914522m375577
895.4F61541581n030393n973876o130397n606234n529940o741763q938789j0979533
911.7F06610656j1822403j1426091j0527134r432137p857561n651176l101289p47025
928E46045840R93013K000690K548217L239930M548669O258309P223964N951047K183616
946.4E80993295k475858o404281r398937j1997878j4481545j6540527j7753184j8273533
$$ plain form
828.1 686272383 681985319 678025663 674488664 670400679 665083706 659054637 653569102 649452567
844.4 649452567 646257043 642644763 637681127 631589592 625309825 619539917 614637196 611719906
860.7 611719906 612679303 618410707 628294230 641269088 655749619 669216812 679540634 686420560
877 686420560 690827787 693297744 693272233 690065503 684116781 677102685 670831680 665917158 661541581
895.4 661541581 656511188 650537312 644406915 638800681 633270741 626528978 617590189 606610656
911.7 606610656 594788253 583362162 572835028 563402891 555545330 549894154 546792865 546045840
928 546045840 547038853 549039543 551587760 554827690 559376359 565634668 572858632 578809679 580993295
946.4 580993295 578517437 572113156 562714219 550716341 536234796 519694269 501941085 483667552
962.7D83667552j8772929j9821585k1284133k2495240k3046702k2940427k2272080
977C33034456k1117181j9379705j6911894j3845533j0592103p622287n195171l324180
993.3B35046402j867995o68213L03462R20579J010418N21883k49445q61540j056731
1011.6B33098820p43032m7817P92011J614735K474144L402278M257693M802555M880712
1030B54532099M586935L971338L031939J901389R05275L35127K91646O86317J452595
1048.4B71694660K802402M694015O553679Q019031R305983J0688275J2037158J2266309
1064.7C38061512R475559K675980o146759j2502640j3280690r609163m826516q89063
1081C02958220K039999M235685N798846O848604P518768P697433P199407N937725M046977
$$ plain form
962.7 483667552 464894623 445073038 423788905 401293665 378246963 355306536 333034456
977 333034456 311917275 292537570 275625676 261780143 251188040 243565753 238370582 235046402
993.3 235046402 233178407 232510194 232813656 233734235 234744653 235266536 235017091 234155551 233098820
1011.6 233098820 232355788 232307971 233099982 234714717 237188861 240591139 244848832 249651387 254532099
1030 254532099 259119034 263090372 266122311 268023700 268928975 269264102 269555748 270242065 271694660
1048.4 271694660 274497062 279191077 285744756 293763787 303069770 313758045 325795203 338061512
1064.7 338061512 347537071 350213051 344066292 331563652 318282962 308673799 303847283 302958220
1081 302958220 304998219 309233904 315032750 321881354 329400122 337097555 344296962 350234687 354281664
1099.4C54281664K012730O44624O56008K003283L776282M993349N297452M864097M008979
1117.7C82538468L026425K202303J818001K168715L285438M685879N403041M529238
1134D09657508J927197j735836n391598q123428r531646r697766q924782p528275n751103
1152.4C54900271l816456j857251J24991K139479M287392O690413R251028J1694580
1168.7C83414447J3771802J5240372J5985280J6073823J5704542J5115410J4373571
1183D89679247J3388544J1975706J0021150P718504N528748L857195K798379K139866
1199.3E47107339J652539J408815J658917K486825L657639M710793N275428N264700
1215.6E73222995M803419M065573L058016J681090O3836j323938k059519k161503j995802
$$ plain form
1099.4 354281664 356294394 356939018 357595026 359598309 363374591 368367940 373665392 378529489 382538468
1117.7 382538468 385564893 387767196 389585197 391753912 395039350 399725229 405128270 409657508
1134 409657508 411584705 409848869 404457271 396333843 386802197 377104431 368179649 360651374 354900271
1152.4 354900271 351083815 349226564 349351555 351491034 355778426 362468839 371719867 383414447
1168.7 383414447 397186249 412426621 428411901 444485724 460190266 475305676 489679247
1183 489679247 503067791 515043497 525064647 532783151 538311899 542169094 544967473 547107339
1199.3 547107339 548759878 550168693 551827610 554314435 557972074 562682867 567958295 573222995
1215.6 573222995 578026414 582091987 585150003 586831093 586894929 585570991 583511472 581349969 579354167
1234E79354167j952708k094269k069711j484812l26216R60231J790285J984179J876176
1252.3E78037322J851081J904667J736641J223385O73056O68883J463175K536833K991498
1270.7E93086541K374828J112282K0921m82380n40674n40435p87735j243472j532197
1289E91467679j464308j366138j649440k340316k977312l035664k534628k049566k021968
1307.4E72028339k168357k067924j726031j265288r51707j195848k158880l558159
1323.7E56936145m887879n711436n937517n764961n315662m497289l221989j645863
1340E19953549k72453M49419N60224L07918L9696j3470p0870l87550p98523j015723
1360.4E18752217r49204m99606O139J89245K98679O66738J176118J457274J454294
$$ plain form
1234 579354167 577401459 575307190 573237479 571752667 571426451 572386682 574176967 576161146 578037322
1252.3 578037322 579888403 581793070 583529711 584753096 585426152 586095035 587558210 590095043 593086541
1270.7 593086541 595461369 596573651 596594572 596112192 595571518 595031083 594243348 592999876 591467679
1289 591467679 590003371 588637233 586987793 584647477 581670165 578634501 576099873 574050307 572028339
1307.4 572028339 569859982 567792058 566066027 564800739 563849032 562653184 560494304 556936145
1323.7 556936145 552048266 546336830 540399313 534634352 529318690 524821401 521599412 519953549
1340 519953549 519681096 520130515 520690739 520998657 521038353 521024883 520954013 520566463 519767940 518752217
1360.4 518752217 517803013 517303407 517309546 517498791 517797470 518464208 519640326 521097600 522551894
1378.8E22551894J285911J476526K691209M609943N409539M430949K982140J265228
1395.1E46703339l24548j200199j375317j418114j940429k470136k652943k580643
1411.4E32741010k075434j372873j152754j320124p75277J66475R11475J449585J659274
1429.8E30231357J569986J596749K014518K320766K053499J812756J417518P66993
1446.1E43784142n9128p48277j036346j210988k159774k804577q27074J195371K942383
1464.5E39075732M320085N173445P042527J0388196J1210859R536027Q385957P737994
1480.8F02870822P312477O819665O839037P010698O152630M534006M120648M708767
1497.1F50368750M532278L802955L344357L594637L897607K565444K046585K390682
$$ plain form
1378.8 522551894 523837805 525314331 528005540 532615483 538025022 542455971 545438111 546703339
1395.1 546703339 546378791 545178592 543803275 542385161 540444732 537974596 535321653 532741010
1411.4 532741010 530665576 529292703 528139949 526819825 526044548 526211023 527122498 528572083 530231357
1429.8 530231357 531801343 533398092 535412610 537733376 539786875 541599631 543017149 543784142
1446.1 543784142 543725014 542976737 541940391 540729403 538569629 535765052 534937978 536133349 539075732
1464.5 539075732 543395817 548569262 555611789 565999985 577210844 586746871 595132828 602870822
1480.8 602870822 610183299 617002964 623842001 630852699 637005329 641539335 645659983 650368750
1497.1 650368750 654901028 658703983 662048340 665642977 669540584 672106028 674152613 676543295
1513.4F76543295K521634K358556K111554K308131K239823J901507J717508J400233
1529.7F93102241J437544J691044J698792J843750K010167Q32677M5359K45809N78344
1548.1G03485727P11739M75407K12133J74880k35558j412928j329362j309693j588643
1566.4F99183702j950383k300441j815796j763999l025234l474057k956927k724528
1582.8F79172337k533257k590656k907872l201545l150403k850771k574325k554774
1599.1F56808734k867401l180623l150999k934456k947927l074526l111542l722548
1615.4F31818712m637301l541112k639949l257692l646911l677666l368199k092599
1631.7F04957283j072765j248717j404822p56264N4717R12607J688838J973152J721978
$$ plain form
1513.4 676543295 679064929 681423485 683535039 685843170 688082993 689984500 691702008 693102241
1529.7 693102241 694539785 696230829 697929621 699773371 701783538 702616215 702661574 702907383 703485727
1548.1 703485727 704197466 704672873 704885006 705059886 704824328 703411400 702082038 700772345 699183702
1566.4 699183702 697233319 694932878 693117082 691353083 688327849 684853792 681896865 679172337
1582.8 679172337 676639080 674048424 671140552 667939007 664788604 661937833 659363508 656808734
1599.1 656808734 653941333 650760710 647609711 644675255 641727328 638652802 635541260 631818712
1615.4 631818712 627181411 623640299 621000350 617742658 614095747 610418081 607049882 604957283
1631.7 604957283 603884518 602635801 601230979 600474715 600529432 601442039 603130877 605104029 606826007
1650.1F06826007K211035L138303K717734K815127L447712L913223L930867L759563
1666.4F32759571M524946N352080M667580M566849M900455M619777M712284N532443
1682.7F71635985O541491N035996L893435M162610M046380M390061M507602L551840
1699G07765400L039241K346695K106785K225578J914859J732290J816511K028167K231062
1717.4G27206588J865923J439452J430035J572430J748085K071262K242028K374649
1733.7G41950452J987577J435935J695395K136350K397775K613604K658606K623379
1750G59499073K553403K466143K741217K870083K413452K053857J790523J830936K126216
1768.4G80344903K063454J567304R15170P41541J131058J491427J319349Q67844O27696
$$ plain form
1650.1 606826007 609037042 612175345 614893079 617708206 621155918 625069141 629000008 632759571
1666.4 632759571 637284517 642636597 647304177 651871026 656771481 661391258 666103542 671635985
1682.7 671635985 678177476 683213472 687106907 691269517 695315897 699705958 704213560 707765400
1699 707765400 710804641 713151336 715258121 717483699 719398558 721130848 722947359 724975526 727206588
1717.4 727206588 729072511 730511963 731941998 733514428 735262513 737333775 739575803 741950452
1733.7 741950452 743938029 745373964 747069359 749205709 751603484 754217088 756875694 759499073
1750 759499073 762052476 764518619 767259836 770129919 772543371 774597228 776387751 778218687 780344903
1768.4 780344903 782408357 783975661 784890831 785632372 786763430 788254857 789574206 790442050 791069746
1786.7G91069746P83920J233340J519918J077890N88596M90487O45935R20952J118302
1805.1G99449086J012981O12617L17096M34637Q43168J073360Q53777M49717L04878
1823.4H05351317N41985Q85010R81331N47528J6272o4790K80738P07387Q31187N32508
1843.8H10610473k8729k51890M0234M64677N72741K77639j07527j41203K16841O40214
1864.2H12293470P33435K92957k93255l14414J50680N99325O54518L03924k1338N1677
1884.6H14450979M23849P21216O00517J42574j65880r0420K48790N46753M52400L5584
1905H17366362k40624j29223K20775M59850L63052J7464k18689r2328K47658M35352
1925.4H18429649K89798l3200k07603l4928K76029M16696K69294l4273k06590l9637
$$ plain form
1786.7 791069746 791853666 793087006 794606924 795684814 796273410 796763897 797409832 798330784 799449086
1805.1 799449086 800462067 801074684 801391780 801826417 802669585 803742945 804596722 805046439 805351317
1823.4 805351317 805893302 806778312 807759643 808307171 808323443 808258653 808539391 809246778 810077965 810610473
1843.8 810610473 810581744 810329854 810370088 810834765 811407506 811685145 811577618 811436415 811653256 812293470
1864.2 812293470 813026905 813319862 813026607 812712193 812862873 813462198 814116716 814420640 814399302 814450979
1884.6 814450979 814874828 815596044 816196561 816339135 816173255 816082835 816331625 816878378 817330778 817366362
1905 817366362 817125738 816996515 817217290 817677140 818040192 818057656 817838967 817746639 817994297 818429649
1925.4 818429649 818719447 818686247 818478644 818443716 818719745 819136441 819405735 819371462 819164872 819125235
1945.8H19125235K65241M00543K88308M0769r9361M0591L30150M41969K69234o557
1966.2H21096122j21653M7267L13103L50892J25885q1420r8407P6473K67923K67327
1986.6H22243512P7903j08481j33275J788J55925J51396j8537j81496k15411j28448
2007H21844876l5525r2923k52903l66747l95835l66926l49939m30882n24103m20749
2027.4H18608344k67983k48074k40505k33710l17454m15564m22478l44276k23935j51574
2047.8H15742791j73390k13742j67072o3658K8372R4115Q7023J4723m9949l0220P1586
2070.2H15340579J72555J43528j2517q5831j013J27256K01344J63019M1425j6987N1022
2092.7H16124380J92940K77638K07722P7546L2008J02937K22743K73525J84417L0577
$$ plain form
1945.8 819125235 819390476 819791019 820079327 820120096 820020735 820061326 820391476 820833445 821102679 821096122
1966.2 821096122 820974469 821021736 821334839 821685731 821811616 821730196 821631789 821708262 821976185 822243512
1986.6 822243512 822321415 822212934 822079659 822081447 822237372 822388768 822370231 822188735 821973324 821844876
2007 821844876 821809351 821716428 821463525 821096778 820700943 820334017 819984078 819553196 819029093 818608344
2027.4 818608344 818340361 818092287 817851782 817618072 817300618 816885054 816462576 816118300 815894365 815742791
2047.8 815742791 815569401 815355659 815188587 815124929 815153301 815247416 815334439 815349162 815299213 815268993 815340579
2070.2 815340579 815513134 815656662 815644145 815558314 815557301 815684557 815885901 816048920 816090345 816073358 816124380
2092.7 816124380 816317320 816594958 816802680 816880226 816912234 817015171 817237914 817511439 817695856 817726433
2113.1H17726433n4896J6392J78694K21730Q2373p2717j23561m9650J10209J93774
2133.5H18228781J10150n7578j19985o675J39355J93477J13845j8060n3168N7578K27273
2155.9H18814993L12209K44796J22607J20342K75016M49836N20766M46796L42608L67522
2176.3H22017491M67002N29886M91440L76344L11791L56913M57108M91083M28736L46899
2196.7H26274693K87175K80380L58165M42028M32730L57091L11077L16321L51131M18067
2217.1H29828858M41492L48687K13444J93477K85506L58224L61085K68519J54197J44542
2237.5H32598031J93178K20180K31504J99437J25945R7692J50263K27332K54989K01106
2257.9H34499657J28985J18076J33694J61349K07365K10226J67906J41859J65045K40147
$$ plain form
2113.1 817726433 817671537 817687929 817866623 818088353 818170726 818098009 817974448 817924798 818035007 818228781
2133.5 818228781 818338931 818281353 818161368 818154693 818294048 818487525 818601370 818583310 818530142 818587720 818814993
2155.9 818814993 819127202 819371998 819494605 819614947 819889963 820339799 820860565 821307361 821649969 822017491
2176.3 822017491 822484493 823014379 823505819 823882163 824193954 824550867 825007975 825499058 825927794 826274693
2196.7 826274693 826561868 826842248 827200413 827642441 828075171 828432262 828743339 829059660 829410791 829828858
2217.1 829828858 830270350 830619037 830832481 831025958 831311464 831669688 832030773 832299292 832453489 832598031
2237.5 832598031 832791209 833011389 833242893 833442330 833568275 833665967 833816230 834043562 834298551 834499657
2257.9 834499657 834628642 834746718 834880412 835041761 835249126 835459352 835627258 835769117 835934162 836174309
2278.3H36174309L07501K38597N2273m3273K7716J05620P6473l2425j63555k12968
2298.7H36530268j44839r8646j76430l37779m91560m89592k73943j15275l30151p19070
2319.1H33352983q60453o64830l68237l03805l98398l89933l85702m68135m14490k36273
2339.5H28862727j64569K9981P04587Q76784r8228j215697j603961j411080j134336
2357.8H24846208p13527l5167N93543Q04424Q15869R20951J060963J162290J143575
2376.2H30599129R87172P65860N35191M15384L67344J93059j09792l37839l55363k13444
2396.6H32846701p5161r9242k91348m68373m37558k51352j54972k56658m54187n98133
2417H29759717n53846l85702l11792l92914n61833o82235o43134m99725l99709m42386
$$ plain form
2278.3 836174309 836481810 836720407 836772680 836729407 836757123 836862743 836939216 836906791 836743236 836530268
2298.7 836530268 836385429 836286783 836110353 835772574 835281014 834791422 834517479 834402204 834072053 833352983
2319.1 833352983 832492530 831827700 831459463 831155658 830757260 830367327 829981625 829513490 829099000 828862727
2339.5 828862727 828698158 828728139 829432726 830309510 830211282 828995585 827391624 825980544 824846208
2357.8 824846208 824132681 824097514 824691057 825495481 826311350 827232301 828293264 829455554 830599129
2376.2 830599129 831586301 832352161 832887352 833302736 833670080 833863139 833753347 833415508 833060145 832846701
2396.6 832846701 832771540 832672298 832380950 831912577 831475019 831223667 831068695 830812037 830357850 829759717
2417 829759717 829205871 828820169 828508377 828115463 827553630 826871395 826228261 825728536 825328827 824886441
2437.4H24886441o00278p36654p22527n62072m23193m67897o45995p38978o18577m48942
2457.8H18921328m09306n08129o59824o90460n43594l77119l61025m83692o14106o48737
2478.1H13625336n65172m37438l78192m23371m99428m99665l99053k72334k17497k96355
2498.5H09636831m12285m32789l49582k39133k15650l17633m51446m60982l47197k66433
2518.9H06143701l21686m71473n78523n77449n02229m38929m78446o09398p26283p24792
2539.3H00714493o12974n27084n45204o54995p69198p35700n78225m95315n81443p23302
2559.7G94491053p55847o36518m71532m36902n66185o90579p14421o56546n41091m92692
2580.1G88528740n81383o87599o78659n32567l62874l07619l86536n06580n43773m39406
$$ plain form
2437.4 824886441 824286163 823549509 822826982 822264910 821841717 821373820 820727825 819988847 819370270 818921328
2457.8 818921328 818512022 818003893 817344069 816653609 816110015 815732896 815371871 814888179 814274073 813625336
2478.1 813625336 813060164 812622726 812244534 811821163 811321735 810822070 810423017 810150683 809933186 809636831
2498.5 809636831 809224546 808791757 808442175 808203042 807987392 807669759 807218313 806757331 806410134 806143701
2518.9 806143701 805822015 805350542 804772019 804194570 803692341 803253412 802774966 802165568 801439285 800714493
2539.3 800714493 800101519 799574435 799029231 798374236 797605038 796869338 796291113 795795798 795214355 794491053
2559.7 794491053 793735206 793098688 792627156 792190254 791624069 790933490 790219069 789562523 789021432 788528740
2580.1 788528740 787947357 787259758 786581099 786048532 785685658 785378039 784991503 784484923 783941150 783501744
2600.5G83501744l31223l89635n57781o85334p02381o36697o01887o96481q75711r91106
2620.9G77033508r90689r45330r22083r63867j103938j239300j228451j140178j083374
2639.3G67416298j102089j196921j233220j156629j081526j082003j147270j226902
2655.6G58189738j219452j106083j000464r65297j003444j074434j088679r95576q88169
2673.9G48848140q87394r39011r81093r79542q83878q08537q61048r46582r90450r86934
2694.3G39583671r53078r65476j045227j132489j186192j182973j131892j095772j090646
2712.7G29799926j091242j097142j091719j047134r87232r61006r39429r02593q48472
2731.1G20833957p45714o89923p51198q05258p93100p61211p27296p15315p24196p39277
$$ plain form
2600.5 783501744 783170521 782780886 782223105 781537771 780835390 780198693 779596806 778900325 778024614 777033508
2620.9 777033508 776042819 775097489 774175406 773211539 772107601 770868301 769639850 768499672 767416298
2639.3 767416298 766314209 765117288 763884068 762727439 761645913 760563910 759416640 758189738
2655.6 758189738 756970286 755864203 754863739 753898442 752894998 751820564 750731885 749736309 748848140
2673.9 748848140 747960746 747021735 746040642 745061100 744177222 743368685 742507637 741561055 740570605 739583671
2694.3 739583671 738630593 737665117 736619890 735487401 734301209 733118236 731986344 730890572 729799926
2712.7 729799926 728708684 727611542 726519823 725472689 724485457 723524451 722585022 721682429 720833957
2731.1 720833957 720088243 719398320 718647122 717841864 717048764 716287553 715560257 714844942 714120746 713381469
2751.4G13381469p52151p12394o24002n74707n75364n97835o45041o69122o37472o31928
2771.8G06961453p25031q57353r25839r01461q99017j012325j129389j168668j216173
2790.2F98126197j293302j367688j469552j572133j619637j661360j747012j824140
2806.5F85571373j871646j941442k027512k108932k178251k221883k280652k381444
2822.8F68559611k484560k564311k616406k656698k730906k854347k989710l133952
2839.1F46528721l329158l587782l838301l978550m011214l859580l439605k960146
2855.5F17524385k663493k619624k821326l233373l787160m377783m856526n171895
2871.8E87993205n444348n677641n650580n254924m589558l764689k924025k194047
$$ plain form
2751.4 713381469 712629318 711916924 711292922 710718215 710142851 709545016 708899975 708230853 707593381 706961453
2771.8 706961453 706236422 705379069 704453230 703551769 702652752 701640427 700511038 699342370 698126197
2790.2 698126197 696832895 695465207 693995655 692423522 690803885 689142525 687395513 685571373
2806.5 685571373 683699727 681758285 679730773 677621841 675443590 673221707 670941055 668559611
2822.8 668559611 666075051 663510740 660894334 658237636 655506730 652652383 649662673 646528721
2839.1 646528721 643199563 639611781 635773480 631794930 627783716 623924136 620484531 617524385
2855.5 617524385 614860892 612241268 609419942 606186569 602399409 598021626 593165100 587993205
2871.8 587993205 582548857 576871216 571220636 565965712 561376154 557611465 554687440 552493393
2888.1E52493393j567185j045167p21991o30021o80208q27194j074433j349509j614988
2906.5E42982697j918733k337277k929985l608465m155219m398703m349769m069507
2922.8E15215039l528356k739728j792311p00772O06000K061844L433704M528404N315661
2941.1E22399485N848885O152212O290675O355226O368994O298542O166399O054818
2957.4E71935236N921782N635440N191028M719377M324376M011750L796161L621339
2973.8F09156489L410876L279686L226876L030837K656579K301097K060354J868605
2990.1F30991399J626194J306712J020134P33852L85106J02222j15693l45647n70774
3008.4F35133505q27491j125455j416326j662910j839399j990676k127707k262116
$$ plain form
2888.1 552493393 550926208 549881041 549159050 548529029 547848821 547021627 545947194 544597685 542982697
2906.5 542982697 541063964 538726687 535796702 532188237 528033018 523634315 519284546 515215039
2922.8 515215039 511686683 508946955 507154644 506453872 507059872 509121716 512555420 517083824 522399485
2941.1 522399485 528248370 534400582 540691257 547046483 553415477 559714019 565880418 571935236
2957.4 571935236 577857018 583492458 588683486 593402863 597727239 601738989 605535150 609156489
2973.8 609156489 612567365 615847051 619073927 622104764 624761343 627062440 629122794 630991399
2990.1 630991399 632617593 633924305 634944439 635678291 636063397 636165619 636049926 635704279 635133505
3008.4 635133505 634306014 633180559 631764233 630101323 628261924 626271248 624143541 621881425
3024.7F21881425k359569k320289k280891k386868k611578k805888k785027k665222
3041.1F01666093k714574k916635l030359k976299k929628k956867k959072l009081
3057.4E78173578l105164l077328k947688k836406k888680l101468l185809l048479
3073.7E53982556k850056k740025k848029l040016l113508l137827l111780l026783
3090E30114532l038586l089308k992392k840877k883553l060639l035188k813756k766371
3108.4E03593862k913415k841473k602637k621174k820015l034234l181785l054529
3124.7D80524600k769590k647906k750129k847493k733558k493292k422989k655118
3141D59204525k856136k773285k558857k340734k230078k388090k648979k683073k550215
$$ plain form
3024.7 621881425 619521856 617201567 614920676 612533808 609922230 607116342 604331315 601666093
3041.1 601666093 598951519 596034884 593004525 590028226 587098598 584141731 581182659 578173578
3057.4 578173578 575068414 571991086 569043398 566206992 563318312 560216844 557031035 553982556
3073.7 553982556 551132500 548392475 545544446 542504430 539390922 536253095 533141315 530114532
3090 530114532 527075946 523986638 520994246 518153369 515269816 512209177 509173989 506360233 503593862
3108.4 503593862 500680447 497838974 495236337 492615163 489795148 486760914 483579129 480524600
3124.7 480524600 477755010 475107104 472356975 469509482 466775924 464282632 461859643 459204525
3141 459204525 456348389 453575104 451016247 448675513 446445435 444057345 441408366 438725293 436175078
3159.4D36175078k430081k342373k299428k303332k297938k241820k168835k132356
3175.7D17958915k164542k174437k122194k057701j999498j971215j954883j960367
3192D01554078j987934j976967j902819j804977j737655j734495j749873j737684j707345
3210.3C85214329j653940j617491j604319j569986j525640j485110j460075j462996
3226.7C72834772j436710j325071j236946j347393j505970j460851j305580j175493
3243C62040758j079351j094609j219958j237422j110614j060873j092911j052320j010567
3261.3C52082133j024216r83417q33482o54816p08759r56893j115531j118034r79841
3279.7C43707144q56101q41081q41141p81268o48379o18071p56591q86858r57310r19580
$$ plain form
3159.4 436175078 433744997 431402624 429103196 426799864 424501926 422260106 420091271 417958915
3175.7 417958915 415794373 413619936 411497742 409440041 407440543 405469328 403514445 401554078
3192 401554078 399566144 397589177 395686358 393881381 392143726 390409231 388659358 386921674 385214329
3210.3 385214329 383560389 381942898 380338579 378768593 377242953 375757843 374297768 372834772
3226.7 372834772 371398062 370072991 368836045 367488652 365982682 364521831 363216251 362040758
3243 362040758 360961407 359866798 358646840 357409418 356298804 355237931 354145020 353092700 352082133
3261.3 352082133 351057917 350074500 349241018 348586202 347877443 346920550 345805019 344686985 343707144
3279.7 343707144 342851043 342009962 341168821 340387553 339739174 339121103 338364512 337477654 336520344 335600764
3300.1C35600764p06375n34415o49393r63628j209587j223385j071185r34035q88407
3318.4C27420354q86977q35478q01593r66221j147032j083374r50664q57711p45088
3336.8C19146216p97629j013577j125277j118034r91344p95841q68291j155674j214564
3355.2C10065985r73195p62016q18222q85904o77526n40912q18402j211107j223117
3373.5C02155584r27329p46876p13825p41333p29799n87017l46094j15216k08020n83112
3393.9B96456963o51658k71529m1395l67105p47502n87225k69592k27242k52218k85923
3414.3B92755574l21716k13951j18405j02341J1504K01672L06070K34157K54869M10468
3434.7B93417901K67714p8320r8557K16097M68999M67181L80159M38749N40555N96106
$$ plain form
3300.1 335600764 334894389 334359974 333710581 332746953 331537366 330313981 329242796 328308761 327420354
3318.4 327420354 326533377 325697899 324896306 323930085 322783053 321699679 320749015 319891304 319146216
3336.8 319146216 318348587 317335010 316209733 315091699 314100355 313304514 312436223 311280549 310065985
3355.2 310065985 309092790 308330774 307512552 306626648 305949122 305408210 304589808 303378701 302155584
3373.5 302155584 301228255 300481379 299767554 299026221 298296422 297709405 297363311 297248095 297040075 296456963
3393.9 296456963 295805305 295533776 295492381 295125276 294377774 293790549 293520957 293293715 293041497 292755574
3414.3 292755574 292433858 292219907 292101502 291999161 292010665 292212337 292518407 292752564 293007433 293417901
3434.7 293417901 293685615 293607295 293508738 293724835 294193834 294661015 295041174 295479923 296020478 296616584
3455.1B96616584P28548Q52286P24435P04259J050025J202405Q52972M10587M15235
3473.4C03557336P54088J047969J021386P15047P13855J001686J007646R17375J056582
3491.8C11792970J186907J194596J120329J104236J115709R43423Q24243R41693J148314
3510.2C21372420J368016J336693J088143J064121J273543J476377J351625J005441
3526.5C31336379R63360J228303J477659J601606J470596J312732J576007J867503
3542.8C42834145J682162J302958J371711J651168J725644J828045K066642K277612
3559.1C56740087K375990K305508K119631K310425K775758K826095K730250K832294
3575.4C77016038K990663L227114L502429L536791L246933L072083L395706L530890
$$ plain form
3455.1 296616584 297345132 298197418 298921853 299626112 300676137 301878542 302731514 303142101 303557336
3473.4 303557336 304311424 305359393 306380779 307095826 307809681 308811367 309819013 310736388 311792970
3491.8 311792970 312979877 314174473 315294802 316399038 317514747 318458170 319282413 320224106 321372420
3510.2 321372420 322740436 324077129 325165272 326229393 327502936 328979313 330330938 331336379
3526.5 331336379 332299739 333528042 335005701 336607307 338077903 339390635 340966642 342834145
3542.8 342834145 344516307 345819265 347190976 348842144 350567788 352395833 354462475 356740087
3559.1 356740087 359116077 361421585 363541216 365851641 368627399 371453494 374183744 377016038
3575.4 377016038 380006701 383233815 386736244 390273035 393519968 396592051 399987757 403518647
3591.7D03518647L494501L713071L957689L951967L926814L930926L816545L890514
3608.1D34200674M137188M234195M225105M013896L968507M384935M334361L897339
3624.4D67396200L589481L976941M712492M378587M121185M134804M010170M000515
3640.7E00320375M093349L995717L861248M266500M567802L809751L408670M053831
3657E32377243M180193L583848L409207L451884L185868L237725L631830L072500K894461
3675.4E63024759L365994L034293K799035K834439K771437K874553K959371K522468
3691.7E86186349K132237K086640K079606K042591K170146K276957K083898J858592
3708F02917016J818120K066970K118111J733660J496196J460195J482069J486242J571178
$$ plain form
3591.7 403518647 407013148 410726219 414683908 418635875 422562689 426493615 430310160 434200674
3608.1 434200674 438337862 442572057 446797162 450811058 454779565 459164500 463498861 467396200
3624.4 467396200 470985681 474962622 479675114 484053701 488174886 492309690 496319860 500320375
3640.7 500320375 504413724 508409441 512270689 516537189 521104991 524914742 528323412 532377243
3657 532377243 536557436 540141284 543550491 547002375 550188243 553425968 557057798 560130298 563024759
3675.4 563024759 566390753 569425046 572224081 575058520 577829957 580704510 583663881 586186349
3691.7 586186349 588318586 590405226 592484832 594527423 596697569 598974526 601058424 602917016
3708 602917016 604735136 606802106 608920217 610653877 612150073 613610268 615092337 616578579 618149757
3726.4F18149757J645625J521528J511931J657427J853883J748919J067639M87148
3742.7F29643857J174450J793504J024187R84728J542270J299322R44555J063823J326323
3761F40797019J221359J094043R85146R10043J096309J107156J029014J094342J098275
3779.4F50432706R28104P42256Q18432R30846R32931R04024P84278R04739J055121
3797.7F58433437P16150P97808R64523O92784R78947J035690O09696M42684Q63254
3816.1F65534973J019597O68287Q99613P51853M73977N94079O18756P92622R00686
3834.4F72254443O44982N58198N99563N39004O67334P01487M37617j4484R6739J200318
3854.8F77685201J055658M01020K98619M24385O13749M65751L67761P49469P61151
$$ plain form
3726.4 618149757 619795382 621316910 622828841 624486268 626340151 628089070 629156709 629643857
3742.7 629643857 630818307 632611811 633635998 634620726 636162996 637462318 638406873 639470696 640797019
3761 640797019 642018378 643112421 644097567 645007610 646103919 647211075 648240089 649334431 650432706
3779.4 650432706 651360810 652103066 652921498 653852344 654785275 655689299 656473577 657378316 658433437
3797.7 658433437 659149587 659947395 660911918 661604702 662583649 663619339 664229035 664671719 665534973
3816.1 665534973 666554570 667222857 668122470 668874323 669348300 669942379 670561135 671353757 672254443
3834.4 672254443 672899425 673457623 674057186 674596190 675263524 675965011 676402628 676388144 676484883 677685201
3854.8 677685201 678740859 679141879 679440498 679864883 680478632 680944383 681312144 682061613 682822764
3873.2F82822764O33120L92735K67447O77049N91159M20928M76896J60039K85744O54042
3893.6F87381923M31955K19882L58522M49299M24743M36485K80321J81794K76565K71261
3914F90712750K26378L38018M12584L17454L10957L61324K30014J75893L48747L73364
3934.4F93807483K04086J41203J95742L32713L92676K87056K59637K80261K39909K22564
3954.8F96363330K24113K19107K20895K39074K59221K52843K28464K39790K49862K03252
3975.2F98699951J82271K06351K73169K91943J70887Q1002J38879K37644K43723K06709
3995.6G00732529J78993
3997.6G00911522
$$ plain form
3873.2 682822764 683455884 683848619 684116066 684793115 685384274 685805202 686282098 686442137 686727881 687381923
3893.6 687381923 687813878 688033760 688392282 688841581 689266324 689702809 689983130 690164924 690441489 690712750
3914 690712750 690939128 691277146 691689730 692007184 692318141 692679465 692909479 693085372 693434119 693807483
3934.4 693807483 694011569 694152772 694348514 694681227 695073903 695360959 695620596 695900857 696140766 696363330
3954.8 696363330 696587443 696806550 697027445 697266519 697525740 697778583 698007047 698246837 698496699 698699951
3975.2 698699951 698882222 699088573 699361742 699653685 699824572 699905574 700044453 700282097 700525820 700732529
3995.6 700732529 700911522
3997.6 700911522
##END=$$ End of the data block
