##TITLE=$$ Begin of the data block
##JCAMP-DX=5.00 $$ ACD/SpecManager v 10.08
##SPECTROMETER/DATA SYSTEM=Alpha
##DATE=29 Dec 2014 11:22:02
##DATA TYPE=INFRARED SPECTRUM
##DATA CLASS=XYDATA
##ORIGIN=
##OWNER=
##NPOINTS=1765
##FIRSTX=399.76428223
##LASTX=3997.64306641
##MAXX=3997.64306641
##MINX=399.76428223
##MAXY=0.83763844
##MINY=0.23217882
##XFACTOR=1.0000000000
##YFACTOR=1.000000000000000e-9
##FIRSTY=0.57244402
##DELTAX=2.03961372
##XUNITS=1/CM
##YUNITS=ARBITRARY UNITS
##XYDATA=(X++(Y..Y))
399.8E72444022o105006m147172k856612j420021k54453O63937J861512K368808J391709
418.1E63946724r64403k692342l198504l110886k559662k427399l353596m055440l112614
436.5E38471878m95553K728402M727721M263580L068090L105998L425658K613484P86960
454.8E62696218j116871k048612j732230j561165k028227l062010m151702m464149
471.2E42531252l643692k112567j414657j890361k338350j733601j62721J093686P04706
489.5E31033695j006365k471030k626538j734793j074910j785636l340781m185081
505.8E12808561l874182k992213k705097l738374n420506o129652m978925l055513
522.1D79914099j792491j605451j727163j066357O58661K895891M599065N213738N102664
$$ plain form
399.8 572444022 566339016 562191844 559335232 557915211 557660758 558324695 560186207 562555015 563946724
418.1 563946724 562982321 560289979 557091475 553980589 551420927 548993528 545639932 541584492 538471878
436.5 538471878 537976325 540704727 545432448 549696028 552764118 555870116 559295774 561909258 562696218
454.8 562696218 561579347 559530735 557798505 556237340 554209113 551147103 546995401 542531252
471.2 542531252 538887560 536774993 535360336 533469975 531131625 529398024 529235303 530328989 531033695
489.5 531033695 530027330 527556300 524929762 523194969 522120059 520334423 516993642 512808561
505.8 512808561 508934379 505942166 503237069 499498695 494078189 487948537 482969612 479914099
522.1 479914099 478121608 476516157 474788994 473722637 474381298 477277189 481876254 487089992 492192656
540.5D92192656M831105M501105L568947J505852r89557k645492k976567k520770k607047
558.9D94860232m056901o196469p625401p761866p007479n891651m431427k363115
575.2D49525923M02659L882229P203370Q768201Q132041O262243M529833L745646L173172
593.5D95625317J819223r1612j442969j389235k79486Q18997R48072K19613j58489
611.9D96069431P63893K498925L789246L950298L409624L141642L544450M199266M131079
630.2E25497854K912402J367927O75320J159549K024114K211690J430154M11153J87814
648.6E37877977R70662J884520K034783J307964M24922L31640J139224J520514R64642
667E48456848R12785J394510J436592J851737K383947K172053J272202N76496P10189
$$ plain form
540.5 492192656 497023761 501524866 505093813 506599665 505610108 502964616 499988049 497467279 494860232
558.9 494860232 490803331 484606862 476981461 469219595 462212116 456320465 451889038 449525923
575.2 449525923 449928582 453810811 461014181 469782382 477914423 484176666 488706499 492452145 495625317
593.5 495625317 497444540 497352928 495909959 494520724 494241238 495060235 496008307 496227920 496069431
611.9 496069431 496833324 499332249 503121495 507071793 510481417 513623059 517167509 521366775 525497854
630.2 525497854 528410256 529778183 530453503 531613052 533637166 535848856 537279010 537690163 537877977
648.6 537877977 538848639 540733159 542767942 544075906 544500828 544832468 545971692 547492206 548456848
667 548456848 549369633 550764143 552200735 554052472 556436419 558608472 559880674 560457170 561167359
685.3E61167359J303077J479626P07686p73728k108276k638400k538025k414107k590597
703.7E51594615k766967k234757o76393J476109L336251M280924M503310M851460N655349
722E70019901O438613O781995O304383N080164L892362L391266L488302L351629K335787
740.4F11084402O78837q57890j799345k257347k803922l892064n172789n771100n305171
758.7E83903611m074812k613962j377940k07007J554787M097939O843030Q925855R669304
777.1F06720805R065330P952929P261395P076621O701052N500436L874302L086150
793.4F57239020L672957M977823N656063M817963L118634J946509K013445K642333
809.7F86084747K514601J221240k27631n88357K23219J035810N84304j294255l393233
$$ plain form
685.3 561167359 562470436 563950062 564657748 563884020 561775744 559137344 556599319 554185212 551594615
703.7 551594615 548827648 546592891 545916498 547392607 550728858 555009782 559513092 564364552 570019901
722 570019901 576458514 583240509 589544892 594625056 598517418 601908684 605396986 608748615 611084402
740.4 611084402 611763239 610905349 609106004 606848657 604044735 600152671 594979882 589208782 583903611
758.7 583903611 579828799 577214837 575836897 575629890 577184677 581282616 588125646 597051501 606720805
777.1 606720805 615786135 623739064 631000459 638077080 644778132 650278568 654152870 657239020
793.4 657239020 660911977 665889800 671545863 676363826 679482460 681428969 683442414 686084747
809.7 686084747 688599348 689820588 689592957 689004600 689227819 690263629 690847933 689553678 686160445
828.1F86160445m329026l988266l536164m105985n345703o048917n522967m132211
844.4F49151206l176570l576100m913866o055057o259859n749166m889786k904117
860.7F11626685R82523N708038R843827J3014793J4550507J3452053J0207057O743551
877F86129034M305660K433598K5511l171027n975723p018208o251812m939199m476487
895.4F61061347n114019n929828o014109n528271n530775o798744q993745j0986328
911.7F06165528j1838257j1483908j0521352r331226p750631n609095l121853p91311
928E45717895R40263J960218K554477L267109M530728O220221P242143O017209K236068
946.4E80686331k511323o530463r470821j1948883j4431775j6567826j7798543j8281281
$$ plain form
828.1 686160445 681831419 677843153 674306989 670201004 664855301 658806384 653283417 649151206
844.4 649151206 645974636 642398536 637484670 631429613 625169754 619420588 614530802 611626685
860.7 611626685 612609208 618317246 628161073 641175866 655726373 669178426 679385483 686129034
877 686129034 690434694 692868292 692893803 689722776 683747053 676728845 670477033 665537834 661061347
895.4 661061347 655947328 650017500 644003391 638475120 632944345 626145601 617151856 606165528
911.7 606165528 594327271 582843363 572322011 562990785 555240154 549631059 546509206 545717895
928 545717895 546658158 548618376 551172853 554439962 558970690 565190911 572433054 578450263 580686331
946.4 580686331 578175008 571644545 562173724 550224841 535793066 519225240 501426697 483145416
962.7D83145416j8769503j9809633k1239162k2435933k3002446k2918433k2246033
977C32724273k1099061j9401758j6947568j3867825j0586947p581279n118787l225089
993.3B34895959j795694o73547K52560Q92654J004785N20125k69130q99836j060054
1011.6B32867822o89000J8165Q06629J565874K412155L387526M285142M840314M901871
1030B54396498M566610L954142L041953J892954Q75205L36915L08395O78152J478612
1048.4B71529436K846807M659415O497293Q028388R338648J0731726J2070269J2224287
1064.7C37926269R409517K638757o173968j2495906j3232112r553581m783213q80808
1081C02854955K029240M227698N771280O818473P521421P716536P207573N931139M010379
$$ plain form
962.7 483145416 464375913 444566280 423327118 400891185 377888739 354970306 332724273
977 332724273 311625212 292223454 275275886 261408061 250821114 243239835 238121048 234895959
993.3 234895959 233100265 232426718 232679278 233571932 234576717 235096842 234827712 233927876 232867822
1011.6 232867822 232178822 232196987 233003616 234569490 236981645 240369171 244654313 249494627 254396498
1030 254396498 258963108 262917250 265959203 267852157 268727362 269064277 269372672 270050824 271529436
1048.4 271529436 274376243 279035658 285532951 293561339 302899987 313631713 325701982 337926269
1064.7 337926269 347335786 349974543 343800575 331304669 318072557 308518976 303735763 302854955
1081 302854955 304884195 309111893 314883173 321701646 329223067 336939603 344147176 350078315 354088694
1099.4C54088694J983613O95943P28608K011925L748744M971713N278349M816473L954708
1117.7C82278770L030628K262145J891554K209812L283233M671007N376756M495681
1134D09499586J918047j695573n339921q110731r541691r721905q950382p538438n750716
1152.4C54768276l786981j829862J18285K145529M299491O670833R241909J1713862
1168.7C83341342J3769388J5232832J6005993J6082525J5696108J5128106J4407605
1183D89663899J3416827J1987090J0013342P701039N524814L853977K762437K099573
1199.3E47022998J667440J448453J665771K498448L701806M741966N256713N211949
1215.6E73215544M768491M066288L069580J693308Q1063j318991k088249k198577k004564
$$ plain form
1099.4 354088694 356072307 356768250 357496858 359508783 363257527 368229240 373507589 378324062 382278770
1117.7 382278770 385309398 387571543 389463097 391672909 394956142 399627149 405003905 409499586
1134 409499586 411417633 409722060 404382139 396271408 386729717 377007812 368057430 360518992 354768276
1152.4 354768276 350981295 349151433 349269718 351415247 355714738 362385571 371627480 383341342
1168.7 383341342 397110730 412343562 428349555 444432080 460128188 475256294 489663899
1183 489663899 503080726 515067816 525081158 532782197 538307011 542160988 544923425 547022998
1199.3 547022998 548690438 550138891 551804662 554303110 558004916 562746882 568003595 573215544
1215.6 573215544 577984035 582050323 585119903 586813211 586894274 585575283 583487034 581288457 579283893
1234E79283893j934051k073408k083301j514673l11375J003027J799166J959145J866698
1252.3E77995121J867176J913786J730322J221061O85811O83189J472592K540767K988637
1270.7E93098462K378881J124143J2338n13792n51521n37217p97689j244903j525104
1289E91443598j447081j336515j648367k353429k976954l042460k535403k042711k029240
1307.4E72031438k169251k050817j732707j301289r79483j205623k132356l508866
1323.7E56951046m864156n707562n930603n767047n330980m486024l205717j674294
1340E19984663k87652M62949N56171K97248M9591J1027o2883m00424q03053j000703
1360.4E18806934r31680n01871j6987J72913L20256P02858J190364J454055J434148
$$ plain form
1234 579283893 577349842 575276434 573193133 571678460 571367085 572370112 574169278 576128423 577995121
1252.3 577995121 579862297 581776083 583506405 584727466 585413277 586096466 587569058 590109825 593098462
1270.7 593098462 595477343 596601486 596613824 596100032 595548511 595011294 594213605 592968702 591443598
1289 591443598 589996517 588660002 587011635 584658206 581681252 578638792 576103389 574060678 572031438
1307.4 572031438 569862187 567811370 566078663 564777374 563797891 562592268 560459912 556951046
1323.7 556951046 552086890 546379328 540448725 534681678 529350698 524864674 521658957 519984663
1340 519984663 519697011 520159960 520716131 521013379 521062970 521073997 521011114 520610690 519807637 518806934
1360.4 518806934 517875254 517373383 517356396 517529309 517849565 518552423 519742787 521196842 522630990
1378.8E22630990J268923J490831K698839M579246N371094M391908K948702J272619
1395.1E46653152k95759j188993j367748j405895j928389k464711k661169k578318
1411.4E32762170k066851j393616j183391j308262p34985J89781R07481J424432J637399
1429.8E30234158J574874J620710K029478K315224K049505J823962J436889P74026
1446.1E43858826n9485p43628j049161j249015k174199k772033q22186J179814K935529
1464.5E39104462M334449N189956P018447J0339677J1202633R548068Q385539P744492
1480.8F02867723P354855O863296O835818O979406O144405M547298M117369M706383
1497.1F50416553M575670L843009L333569L543138L878832K636016K119600K401650
$$ plain form
1378.8 522630990 523899913 525390744 528089583 532668829 538039923 542431831 545380533 546653152
1395.1 546653152 546357393 545168400 543800652 542394757 540466368 538001657 535340488 532762170
1411.4 532762170 530695319 529301703 528118312 526810050 526075065 526264846 527172327 528596759 530234158
1429.8 530234158 531809032 533429742 535459220 537774444 539823949 541647911 543084800 543858826
1446.1 543858826 543799341 543055713 542006552 540757537 538583338 535811305 534989119 536168933 539104462
1464.5 539104462 543438911 548628867 555647314 565986991 577189624 586737692 595123231 602867723
1480.8 602867723 610222578 617085874 623921692 630901098 637045503 641592801 645710170 650416553
1497.1 650416553 654992223 658835232 662168801 665711939 669590771 672226787 674346387 676748037
1513.4F76748037K450884K290725K141715K370774K247751J876891J692712J380980
1529.7F93200469J426578J696944J678407J787126K020478R05216N5075K58565O09874
1548.1G03638732P17760M52816K09987K00570k42055j417994j295865j299858j615405
1566.4F99348688j978814k302170j822889j805544l044963l418386k897382k712607
1582.8F79365933k565324k630592k924680l195703l147901k859592k588749k574325
1599.1F56879067k878964l179729l154873k953768k964854l074050l116966l748059
1615.4F31807804m628539l510237k651512l274858l627599l646314l357708k126754
1631.7F04984283j130759j246095j337528p11858P1108R11534J712680K022683J722574
$$ plain form
1513.4 676748037 679198921 681489646 683631361 686002135 688249886 690126777 691819489 693200469
1529.7 693200469 694627047 696323991 698002398 699789524 701810002 702715218 702770293 703028858 703638732
1548.1 703638732 704356492 704809308 705019295 705219865 704977810 703559816 702263951 700964093 699348688
1566.4 699348688 697369874 695067704 693244815 691439271 688394308 684975922 682078540 679365933
1582.8 679365933 676800609 674170017 671245337 668049634 664901733 662042141 659453392 656879067
1599.1 656879067 654000103 650820374 647665501 644711733 641746879 638672829 635555863 631807804
1615.4 631807804 627179265 623669028 621017516 617742658 614115059 610468745 607111037 604984283
1631.7 604984283 603853524 602607429 601269901 600558043 600629151 601540685 603253365 605276048 606998622
1650.1F06998622K197862L225029K796530K804697L426373L972411M029274L784061
1666.4F33234859M495084N344510M678845M570306M930734M656494M702866N495429
1682.7F72109127O557524N070389L874957M131377M039705M409849M515529L538966
1699G08247423L053069K348423K089382K216517J897276J704752J813710K056658K250135
1717.4G27677345J861155J442135J438617J560450J713574K034604K218664K366781
1733.7G42313325J983822J434803J717746K172589K394379K568543K635896K652049
1750G59873152K588451K490282K747059K848565K391637K056241J810312J843095K123952
1768.4G80772746K040624J547277R37581P83026J158774J481653J295387Q76725O57737
$$ plain form
1650.1 606998622 609196484 612421513 615218043 618022740 621449113 625421524 629450798 633234859
1666.4 633234859 637729943 643074453 647753298 652323604 657254338 661910832 666613698 672109127
1682.7 672109127 678666651 683737040 687611997 691743374 695783079 700192928 704708457 708247423
1699 708247423 711300492 713648915 715738297 717954814 719852090 721556842 723370552 725427210 727677345
1717.4 727677345 729538500 730980635 732419252 733979702 735693276 737727880 739946544 742313325
1733.7 742313325 744297147 745731950 747449696 749622285 752016664 754585207 757221103 759873152
1750 759873152 762461603 764951885 767698944 770547509 772939146 774995387 776805699 778648794 780772746
1768.4 780772746 782813370 784360647 785298228 786081254 787240028 788721681 790017068 790893793 791551530
1786.7G91551530Q06094J238167J504660J068174N73933M48943O21557R33528J113713
1805.1G99860299J002371O43253L41237M32730Q60691J088977Q44717M19855K52664
1823.4H05746794N08427Q99971J017392N81860L4511n6863K86401P19011Q44895N11051
1843.8H11093450q0467k80142O3658N02289N70118K69711r1493j37687K08438O36100
1864.2H12753975P16687K70545k89917k94447J81318O36339O53147K52605p5817M1365
1884.6H14845800M53651P53463O16967J33574j85966r0838K63989N39124M17591K3603
1905H17770958k15769q2612K72453M66645L09586l8206k17319n4896K60830M23968
1925.4H18895638K77400m3452k12073m7803K68817M38392K80857n0723k28823n1975
$$ plain form
1786.7 791551530 792357624 793595791 795100451 796168625 796742558 797191501 797813058 798746586 799860299
1805.1 799860299 800862670 801505923 801847160 802279890 803140581 804229558 805074275 805494130 805746794
1823.4 805746794 806255221 807155192 808172584 808754444 808788955 808732092 809018493 809737504 810582399 811093450
1843.8 811093450 811012983 810732841 810796499 811298788 811868906 812138617 812047124 811909437 812117875 812753975
1864.2 812753975 813470662 813741207 813451290 813156843 813338161 813974500 814627647 814880252 814804435 814845800
1884.6 814845800 815299451 816052914 816669881 816803455 816617489 816526651 816790640 817329764 817747355 817770958
1905 817770958 817555189 817472577 817745030 818211675 818521261 818483055 818265736 818210840 818471670 818895638
1925.4 818895638 819173038 819129586 818917513 818869710 819138527 819576919 819857776 819807053 819578230 819526255
1945.8H19526255K82943M25280K62558j0133q8334J11938L76582M34756K46942k4199
1966.2H21544588j30833N2035L25799L76940J48594r2625j32501M8637K84493L25680
1986.6H22750807R7215j67489j91689J610J76251J55687k7061j77621k03967j37508
2007H22276235m8638p4506k29597l76045m01378l40760l27289m33683n35906m19199
2027.4H19089234k45631k23875k46048k58982l25620m15862m37856l56674k07424j21653
2047.8H16249609j49786j89007j58250o5982K4914N7578L1531q583l1829L815J01805
2070.2H15865815J68919J18196N663n3406k0862Q9705J93835J79112N1677k6643N4061
2092.7H16626072K11418K83241K17616R2626L8564R9540K05159K70009J99080L9637
$$ plain form
1945.8 819526255 819809198 820234478 820497036 820486903 820398569 820510507 820887089 821321845 821568787 821544588
1966.2 821544588 821413755 821465790 821791589 822168529 822317123 822224498 822091997 822140634 822425127 822750807
1986.6 822750807 822848022 822680533 822488844 822490454 822666705 822822392 822795331 822617710 822413743 822276235
2007 822276235 822227597 822153091 821923494 821547449 821146071 820805311 820478022 820044339 819508433 819089234
2027.4 819089234 818843603 818619728 818373680 818114698 817789078 817373216 816935360 816578686 816371262 816249609
2047.8 816249609 816099823 815910816 815752566 815686584 815711498 815769076 815800607 815792024 815760195 815764010 815865815
2070.2 815865815 816034734 816152930 816158593 816105187 816084325 816174030 816367865 816546977 816598654 816572011 816626072
2092.7 816626072 816837490 817120731 817338347 817430973 817469537 817569077 817774236 818044245 818243325 818282962
2113.1H18282962l2842M3153J67251J97589R1553n4776j06514j6332J29104J90496
2133.5H18891644R9004q1361j40607j430J74582K08079P1228n6386m0472Q3566K38776
2155.9H19446623L04044K22742J31250J55806K92301M44711N09381M49717L40998L49581
2176.3H22647154M72129N55694N22554L96669L01242L43859M40061M60088M09663L36885
2196.7H26885998K89083L05414L93629M71473M43816L40998K66552K96712L81768M28498
2217.1H30503941M12464L36110K26140J94908K68280L51489L77178L03805J86622J34647
2237.5H33295584J71661K30193K41816K08378J45614R4533J17839J89960K37465K26080
2257.9H35159123J63197J22488J35720J63376J78039J81735J85609J81079J75476K07126
$$ plain form
2113.1 818282962 818250120 818293273 818460524 818658113 818749666 818694890 818588376 818572044 818701148 818891644
2133.5 818891644 818990648 818909287 818768680 818767250 818941832 819149911 819221139 819164753 819124281 819207847 819446623
2155.9 819446623 819750667 819973409 820104659 820260465 820552766 820997477 821506858 821956575 822297573 822647154
2176.3 822647154 823119283 823674977 824197531 824594200 824895442 825239301 825679362 826139450 826549113 826885998
2196.7 826885998 827175081 827480495 827874124 828345597 828789413 829130411 829396963 829693675 830075443 830503941
2217.1 830503941 830916405 831252515 831478655 831673563 831941843 832293332 832670510 832974315 833160937 833295584
2237.5 833295584 833467245 833697438 833939254 834147632 834293246 834387779 834505618 834695578 834933043 835159123
2257.9 835159123 835322320 835444808 835580528 835743904 835921943 836103678 836289287 836470366 836645842 836852968
2278.3H36852968K66790K24173P0811j79M5001Q9288Q7559K027j50442k23458j69575
2300.7H37094963j06097j42455k98500m73440m75943k89023j94907l87847o71566p62164
2321.1H33293021o17206m01736l29435l74078l69430m14431n33998m29928j78337j21534
2341.5H29522908n186O24895Q48055m1008j129210j609266j549542j204967n90563
2359.9H24866116P6175N92232Q04364Q04365Q60214J012087J158535J156033R78529
2378.2H32308650P72178N76973M23134L31044J58846j38581l34501l14414j92225q4341
2398.6H33506763j00791k67625m43995m40777k73168j80065k79546m64261n86450n47588
2419H29922497l87907k93970l75271n48720o60420o32643n01931m18305m97163o60658
$$ plain form
2278.3 836852968 837119758 837343931 837414742 837414563 837459564 837548852 837636411 837638438 837487996 837264538 837094963
2300.7 837094963 836988866 836846411 836547911 836074471 835598528 835309505 835114598 834726751 834055185 833293021
2321.1 833293021 832675815 832274079 831944644 831570566 831201136 830786705 830252707 829822779 829644442 829522908
2341.5 829522908 829517722 830142617 830990672 830949664 829820454 828211188 826661646 825456679 824866116
2359.9 824866116 824942291 825534523 826338887 827143252 828003466 829015553 830174088 831330121 832308650
2378.2 832308650 833080828 833657801 834080935 834411979 834570825 834432244 834097743 833783329 833591104 833506763
2398.6 833506763 833405972 833138347 832694352 832253575 831980407 831800342 831520796 831056535 830470085 829922497
2419 829922497 829534590 829240620 828865349 828316629 827656209 827023566 826521635 826103330 825606167 824945509
2439.4H24945509p45892o74963n08964m11868m93944o50465p12276o26147m77671m18723
2459.8H19224596n07534o43432o75380n55932l91007l49462m70400o23703o54280n49614
2480.2H13803852m17650l58522m21763n31196n22673l86000k50697k07126l01540m45664
2500.6H09961021m80950l67105k26319k20239l25680m11391m09067l31580k60294l30746
2521H06597650n20050o23703n76556m61698l91245m70161o46651p55429p31230o21200
2541.4H00799727n02348m72962o03319p73906p59721n99980n25952o01649p12156p40827
2561.8G94506907o44326m82142m17471n21004o80268p67052o93023n25653m72844n69761
2582.2G88733363o78181o66976n32508l91007l46064m15981m98116m96149m11809l45886
$$ plain form
2439.4 824945509 824199617 823524654 823015690 822603822 822109878 821459413 820747137 820120990 819643319 819224596
2459.8 819224596 818717062 818073630 817398250 816842318 816451311 816101849 815631449 815007746 814353466 813803852
2480.2 813803852 813386202 813027680 812605917 812074721 811552048 811166048 810915351 810708225 810406685 809961021
2500.6 809961021 809480071 809112966 808886647 808666408 808340728 807929337 807520270 807188690 806928396 806597650
2521 806597650 806077600 805453897 804877341 804415643 804024398 803554237 802907586 802152157 801420927 800799727
2541.4 800799727 800297379 799824417 799221098 798447192 797687471 797087491 796561539 795959890 795247734 794506907
2561.8 794506907 793862581 793380439 792962968 792441964 791761696 790994644 790301621 789775968 789303124 788733363
2582.2 788733363 788055182 787388206 786855698 786464691 786118627 785702646 785204530 784708381 784296572 783950686
2602.6G83950686m07576n52178o68942o88911o30498o22034p17103q64029r95636j021266
2623G76782513r39489q83519r63152j139462j258373j204312j063228j023173j130938
2641.3G67176867j249731j258016j181781j089573j067340j135409j191676j170456
2657.6G57832885j103401j047314j013338j030147j072228j037300r54628r18269r20713
2676G48735547r36687r72211r65357q67665p77364q20040r49085j031578j027822r81868
2696.4G39405870r73761j041233j136482j191318j175702j099407j037956j054108
2712.7G30695903j108825j136124j111269j061142j013994r66072r10997q72910q28684
2731.1G21685886p67469p48754p68542p66456p25031p20382p69674p69139p34567p49588
$$ plain form
2602.6 783950686 783543110 782990932 782321990 781633079 781002581 780380547 779663444 778799415 777803779 776782513
2623 776782513 775843024 774959505 773996353 772856891 771598518 770394206 769330978 768307805 767176867
2641.3 767176867 765927136 764669120 763487339 762397766 761330426 760195017 759003341 757832885
2657.6 757832885 756729484 755682170 754668832 753638685 752566457 751529157 750574529 749656260 748735547
2676 748735547 747798860 746826649 745861292 744993627 744216263 743396223 742447138 741415560 740387738 739405870
2696.4 739405870 738432109 737390876 736254394 735063076 733887374 732787967 731750011 730695903
2712.7 730695903 729587078 728450954 727339685 726278543 725264549 724298477 723387480 722514570 721685886
2731.1 721685886 720918417 720169663 719401121 718634665 717909634 717189252 716419578 715650439 714915872 714166284
2751.4G14166284p71284p09773n95033n38766n61297n98490o28412o56843o52612o56902
2771.8G07796872p39098q51095r23872r32932r26494r66132j051247j171887j282990
2790.2F98951125j340508j383245j451075j536608j619697j685083j741111j804948
2806.5F86388850j894355j991212k043009k082586k154589k234936k313137k374351
2822.8F69300675k442360k555787k647460k685606k746403k860964k971053l102600
2839.1F47288442l329873l592670l816486l976047m030645l877341l471315k986253
2855.5F18207812k669692k637684k855122l250361l789186m394829m871965n179524
2871.8E88559449n466759n690039n644619n249202m582346l771186k944767k176345
$$ plain form
2751.4 714166284 713395000 712685227 712090194 711551428 710990131 710391641 709763229 709106386 708453774 707796872
2771.8 707796872 707057774 706206679 705282807 704349875 703423381 702457249 701406002 700234115 698951125
2790.2 698951125 697610617 696227372 694776297 693239689 691619992 689934909 688193798 686388850
2806.5 686388850 684494495 682503283 680460274 678377688 676223099 673988163 671675026 669300675
2822.8 669300675 666858315 664302528 661655068 658969462 656223059 653362095 650391042 647288442
2839.1 647288442 643958569 640365899 636549413 632573366 628542721 624665380 621194065 618207812
2855.5 618207812 615538120 612900436 610045314 606794953 603005767 598610938 593738973 588559449
2871.8 588559449 583092690 577402651 571758032 566508830 561926484 558155298 555210531 553034186
2888.1E53034186j509606j029790p62343o70493p07865q31902j050889j327575j604020
2906.5E43539703j916289k346516k926767l576875m131913m438341m423975m089296
2922.8E15689731l511846k744794j789034o77168O20842K056837L409803M529118N353153
2941.1E22936642N856276O134987O282150O372810O439030O350994O169558O067991
2957.4E72610438N935311N614996N162180M711985M324258M020452L819347L644704
2973.8F09843671L439784L321469L264666L041267K662897K316058K048075J851380
2990.1F31789267J669347J377583J044094P35045L92675J00255j23441l52919n65886
3008.4F36066020p89047j083970j415074j684963j862228j996279k125979k259671
$$ plain form
2888.1 553034186 551524580 550494790 549732447 549061954 548354089 547522187 546471298 545143723 543539703
2906.5 543539703 541623414 539276898 536350131 532773256 528641343 524203002 519779027 515689731
2922.8 515689731 512177885 509433091 507644057 506966889 507587731 509644568 513054371 517583489 522936642
2941.1 522936642 528792918 534927905 541210055 547582865 554021895 560372889 566542447 572610438
2957.4 572610438 578545749 584160745 589322925 594034910 598359168 602379620 606198967 609843671
2973.8 609843671 613283455 616604924 619869590 622910857 625573754 627889812 629937887 631789267
2990.1 631789267 633458614 634836197 635880291 636615336 637008011 637108266 636984825 636631906 636066020
3008.4 636066020 635276973 634193003 632777929 631092966 629230738 627234459 625108480 622848809
3024.7F22848809k335966k318382k320826k425134k628506k794802k734303k613127
3041.1F02677763k693713k911627l055394l026128k962291k960384k952933l005088
3057.4E79110205l116011l094018k933800k818287k901852l115713l182948l065109
3073.7E54882467k882898k755344k863824l050685l089905l116310l109276l021777
3090E30992448l068566l151298l031730k876222k924979l058493k999187k794027k760232
3108.4E04327714k917110k852798k576560k556026k798080l073991l221482l072589
3124.7D81259078k793074k669692k740174k852619k780140k532363k440571k669633
3141D59780812k866417k768606k551943k336204k236754k428561k699584k686471k514183
$$ plain form
3024.7 622848809 620512843 618194461 615873635 613448501 610819995 608025193 605290890 602677763
3041.1 602677763 599984050 597072423 594017029 590990901 588028610 585068226 582115293 579110205
3057.4 579110205 575994194 572900176 569966376 567148089 564246237 561130524 557947576 554882467
3073.7 554882467 551999569 549244225 546380401 543329716 540239811 537123501 534014225 530992448
3090 530992448 527923882 524772584 521740854 518864632 515939653 512881160 509881973 507087946 504327714
3108.4 504327714 501410604 498557806 495981246 493425220 490627140 487553149 484331667 481259078
3124.7 481259078 478466004 475796312 473056138 470203519 467423379 464891016 462450445 459780812
3141 459780812 456914395 454145789 451593846 449257642 447020888 444592327 441892743 439206272 436692089
3159.4D36692089k419174k342403k286404k303571k308458k267450k222359k185673
3175.7D18356597k175748k163082k123863k083450k025068j928508j918585k022951
3192D01915342k042920j946866j875729j847714j798600j772433j760304j716674j663685
3210.3C85490417j619935j612395j590728j561791j571864j541316j480163j463651
3226.7C73048574j427561j311034j238346j371444j521617j469701j333893j208573
3243C62166405j112998j098513j178444j228779j159370j071215j072228j090914j054138
3261.3C52099806j034528r77158p95007o46085p57336r94414j092285j054764r40681
3279.7C43807548q38786q10534p99268p48337o49988o27309p45505q88855r79751r45926
$$ plain form
3159.4 436692089 434272915 431930512 429644108 427340537 425032079 422764629 420542270 418356597
3175.7 418356597 416180849 414017767 411893904 409810454 407785386 405856878 403938293 401915342
3192 401915342 399872422 397925556 396049827 394202113 392403513 390631080 388870776 387154102 385490417
3210.3 385490417 383870482 382258087 380667359 379105568 377533704 375992388 374512225 373048574
3226.7 373048574 371621013 370309979 369071633 367700189 366178572 364708871 363374978 362166405
3243 362166405 361053407 359954894 358776450 357547671 356388301 355317086 354244858 353153944 352099806
3261.3 352099806 351065278 350088120 349293113 348647028 347889692 346895278 345802993 344748229 343807548
3279.7 343807548 342968762 342158228 341358960 340610623 339960635 339333326 338587821 337698966 336719215 335773289
3300.1C35773289p40319n54920o63340r92924j214444j193673j040190r23395r05693
3318.4C27544391r29296q98391q52436r60856j113177j082092r67562q61913p56115
3336.8C19122553q14289r93788j067370j083374j010448q00282q41081j166999j251728
3355.2C10093194r94920q08657r05275r38326o78063n56081q33333j168608j165212
3373.5C02044719q89778p09563p23481q16465p89642n97805l37422q0138j85073o19530
3393.9B96295822o89119k72334j1563l53873p81626o17921k55853j59562k37286l91364
3414.3B92525321l82513j43855m5777j04129j9968J78337L27200L19183L13491L58522
3434.7B93325812J70886j05977n2333K54989M40270M00632L47287M57734N91337O40452
$$ plain form
3300.1 335773289 335032970 334478050 333814710 332821786 331607342 330413669 329373479 328450084 327544391
3318.4 327544391 326615095 325716704 324864268 323903412 322790235 321708143 320740581 319878668 319122553
3336.8 319122553 318308264 317314476 316247106 315163732 314153284 313353002 312511921 311344922 310093194
3355.2 310093194 309098274 308289617 307384342 306446016 305767953 305211872 304378539 303209931 302044719
3373.5 302044719 301154941 300445378 299721897 298905432 298115790 297517985 297180563 297100425 296915352 296295822
3393.9 296295822 295606703 295334369 295322806 294968933 294187307 293569386 293313533 293153971 292916685 292525321
3414.3 292525321 292142808 291998953 291953176 291849047 291829079 292007416 292334616 292653799 292967290 293325812
3434.7 293325812 293496698 293390721 293338388 293593377 294033647 294434279 294781566 295239300 295830637 296471089
3455.1B96471089P41989Q61465P56294P15315J014412J171887Q38458M12256M17053
3473.4C03400218P33406J073092J107037P78973P03573R53228R92238R24945J053780
3491.8C11720490J168699J176565J144231J131624J104235R43304Q67486J009553J196295
3510.2C21462482J360119J295358J060694J053572J279711J509846J386523J018703
3526.5C31427008R60439J234919J452148J532644J476228J386732J606316J856774
3542.8C42933208J701206J365989J391322J618146J733244J865148K074242K287507
3559.1C56970012K420724K340376K134591K362132K836109K840548K722890K843648
3575.4C77471030K998650L179073L455669L564656L330916L162831L460526L565312
$$ plain form
3455.1 296471089 297213078 298074543 298830837 299546152 300560564 301732451 302570909 302983165 303400218
3473.4 303400218 304133624 305206716 306313753 307092726 307796299 308749527 309741765 310666710 311720490
3491.8 311720490 312889189 314065754 315209985 316341609 317445844 318389148 319256634 320266187 321462482
3510.2 321462482 322822601 324117959 325178653 326232225 327511936 329021782 330408305 331427008
3526.5 331427008 332387447 333622366 335074514 336607158 338083386 339470118 341076434 342933208
3542.8 342933208 344634414 346000403 347391725 349009871 350743115 352608263 354682505 356970012
3559.1 356970012 359390736 361731112 363865703 366227835 369063944 371904492 374627382 377471030
3575.4 377471030 380469680 383648753 387104422 390669078 393999994 397162825 400623351 404188663
3591.7D04188663L500104L728956L999382L971368L899664L885507L827572L979564
3608.1D34980780M185796M187256M192263M035413M008800M470288M414887L907859
3624.4D68383342L576934L967554M683494M370392M138827M150718M041076M031986
3640.7E01344323M074514L957987L869116M323006M646480L876984L419340M015684
3657E33527434M210830L657817L371299L366410L196776L296853L655850L100276K955079
3675.4E64338624L419340L052414K798318K841175K764821K823651K906740K501428
3691.7E87446511K131045K123832K127707K026677K124727K263487K054631J825393
3708F04124010J839399K123237K170026J784921J527428J448870J475215J500130J575410
$$ plain form
3591.7 404188663 407688767 411417723 415417105 419388473 423288137 427173644 431001216 434980780
3608.1 434980780 439166576 443353832 447546095 451581508 455590308 460060596 464475483 468383342
3624.4 468383342 471960276 475927830 480611324 484981716 489120543 493271261 497312337 501344323
3640.7 501344323 505418837 509376824 513245940 517568946 522215426 526092410 529511750 533527434
3657 533527434 537738264 541396081 544767380 548133790 551330566 554627419 558283269 561383545 564338624
3675.4 564338624 567757964 570810378 573608696 576449871 579214692 582038343 584945083 587446511
3691.7 587446511 589577556 591701388 593829095 595855772 597980499 600243986 602298617 604124010
3708 604124010 605963409 608086646 610256672 612041593 613569021 615017891 616493106 617993236 619568646
3726.4F19568646J655102J529753J514494J669526J838923J679838J006841N13137
3742.7F30976260J256823J813889J019954R93968J547277J322269R48250J036883J301586
3761F42217159J174510J076758J052439R64165J086890J098156J008928J049400J081883
3779.4F51810288R49324P85291Q43167R20832R57549R70185Q19087Q46147R34780O82354
3799.8F60519004Q88407J011133O18100Q99554J063525O54400M12702Q19505R86635
3818.1F67872965N96941R08136Q61705N26547N94616O41465Q05795Q62539O07193N86986
3838.5F74864888O36041N40495O80983O97613L93331N722J85073J198291J064361M45008
3858.9F80711806L05116M19497O43433M81903L11554O78837P31230O59823M49598K62797
$$ plain form
3726.4 619568646 621223748 622753501 624267995 625937521 627776444 629456282 630463123 630976260
3742.7 630976260 632233083 634046972 635066926 636060894 637608171 638930440 639878690 640915573 642217159
3761 642217159 643391669 644468427 645520866 646485031 647571921 648670077 649679005 650728405 651810288
3779.4 651810288 652759612 653544903 654388070 655308902 656266451 657236636 658055723 658901870 659836650 660519004
3799.8 660519004 661407411 662418544 663036644 663936198 664999723 665654123 666066825 666886330 667872965
3818.1 667872965 668469906 669378042 670239747 670766294 671360910 672002375 672808170 673670709 674277902 674864888
3838.5 674864888 675500929 676041424 676722407 677420020 677813351 677819073 678004146 679202437 680266798 680711806
3858.9 680711806 681016922 681436419 682079852 682561755 682873309 683552146 684283376 684943199 685392797 685655594
3879.3F85655594O25670N82516M44710M77314J88232L56674O37829L46720J85550M18067
3899.7F89918876N57542M59909L82185K41458J87874K86043K63154K40803L94762M26292
3920.1F93358898K39372K39015L74794K87056K18153L39687L47257J99079J40607J92225
3940.5F95936143L22223L82125K80977K83599L22401K44618J89006K04802K67744K95043
3960.9F98728681K65836K17259K02120K10702J71304J82390K59340K48194J77204K17319
3981.3G00880349K60591J90497J51217J84357K33590K21074J71959J82450
3997.6G02476084
$$ plain form
3879.3 685655594 686281264 686863780 687308490 687785804 687974036 688330710 688968539 689315259 689500809 689918876
3899.7 689918876 690476418 690936327 691318512 691559970 691747844 692033887 692297041 692537844 692932606 693358898
3920.1 693358898 693598270 693837285 694212079 694499135 694717288 695056975 695404232 695603311 695743918 695936143
3940.5 695936143 696258366 696640491 696921468 697205067 697527468 697772086 697961092 698165894 698433638 698728681
3960.9 698728681 698994517 699211776 699413896 699624598 699795902 699978292 700237632 700485826 700663030 700880349
3981.3 700880349 701140940 701331437 701482654 701667011 701900601 702121675 702293634 702476084
3997.6 702476084
##END=$$ End of the data block
