##TITLE=$$ Begin of the data block
##JCAMP-DX=5.00 $$ ACD/SpecManager v 10.08
##SPECTROMETER/DATA SYSTEM=Alpha
##DATE=29 Dec 2014 11:22:02
##DATA TYPE=INFRARED SPECTRUM
##DATA CLASS=XYDATA
##ORIGIN=
##OWNER=
##NPOINTS=1765
##FIRSTX=399.76428223
##LASTX=3997.64306641
##MAXX=3997.64306641
##MINX=399.76428223
##MAXY=0.83865029
##MINY=0.23221590
##XFACTOR=1.0000000000
##YFACTOR=1.000000000000000e-9
##FIRSTY=0.57112217
##DELTAX=2.03961372
##XUNITS=1/CM
##YUNITS=ARBITRARY UNITS
##XYDATA=(X++(Y..Y))
399.8 571122169 564875543 560517013 557590842 556147635 556397378 557905912 559817076 561825156 563384533
418.1 563384533 562639654 559887886 556818306 554073513 551691175 549004078 545328617 541015744 537742972
436.5 537742972 537395537 540170550 544776499 549349129 553017974 556345522 559480309 561798692 562846601
454.8 562846601 562295556 560180962 557885885 556091845 554152071 551228225 547201753 542669475 538708210
473.2 538708210 536334515 534845948 532917202 530522108 528796256 528682649 529843450 530672193 529673815
491.5 529673815 527076960 524442673 522828162 521929979 520279646 516950071 512753665 508888543 505909622
509.9 505909622 503056705 499029011 493539244 487587184 482685506 479523897 477679908 476144910
526.2 476144910 474514425 473505825 474157274 477013707 481586218 486871392 492068768 496935755 501516104
544.6 501516104 505147398 506530583 505265832 502480328 499691755 497458696 494918227 490691960
560.9 490691960 484318465 476675570 469069839 462240070 456324011 451737732 449304849 449786514 453818917
579.3 453818917 461096466 469791651 477762967 483962774 488621801 492473662 495512873 497079313
595.6 497079313 496923029 495649368 494462460 494386792 495348155 496286035 496470630 496318430 497050792 499430835
616 499430835 503154635 507186532 510683358 513862967 517381966 521420538 525404871 528392613 529961050
634.3 529961050 530706108 531773984 533786535 536089003 537566662 537985504 538139880 539105713 541079342
652.7 541079342 543193161 544508815 544936180 545224488 546182334 547519267 548545539 549779952 551273823
671 551273823 552586973 554322243 556633353 558767498 560148895 560876131 561553478 562715292 564080834
689.4 564080834 564754784 564055502 562047362 559468329 556955755 554532111 551909983 549136043 546945333
707.7 546945333 546296656 547704339 550900578 555103719 559683502 564639568 570323467 576778233 583562791
726.1 583562791 589857936 594947517 598841250 602259398 605784595 609117329 611405551 612020373 611091971
744.5 611091971 609261930 606998861 604153216 600238681 595145226 589442313 584110558 580029070
760.8 580029070 577436924 576021433 575801313 577420473 581594467 588453948 597323239 606975973 616071284
779.1 616071284 623971283 631141901 638234198 645020127 650600433 654502332 657507300 661114216
795.4 661114216 666113496 671748698 676462710 679503977 681519210 683678269 686332941 688717246
811.8 688717246 689872622 689728856 689220905 689440310 690508366 691150069 689804554 686300039 681950688
830.1 681950688 678032815 674544930 670403659 664979696 658927381 653495014 649420917 646217585
846.4 646217585 642572522 637603760 631564558 625359654 619648457 614783645 611871421 612811506 618504465
864.8 618504465 628343821 641335666 655878305 669292688 679410577 686093211 690402150 692856133
881.1 692856133 692829013 689538836 683519423 676563025 670365095 665439963 660968959 655821145 649809301
899.5 649809301 643728077 638187468 632707953 625968695 616947591 605891943 594038665 582590103
915.8 582590103 572089314 562727869 554940403 549320102 546206594 545469701 546505332 548520803
932.1 548520803 551068604 554333806 558880866 565082550 572269857 578248084 580435216 577852607
948.4 577852607 571332574 561922908 549953163 535456777 518868685 501075864 482800663 464054108
964.7 464054108 444253266 422981381 400507510 377496362 354619950 332448244 311417192
979 311417192 292066932 275160074 261321962 250757605 243210316 238102138 234833866 233002111
995.3 233002111 232367545 232696548 233597159 234541625 235027894 234817147 234021112 233003452 232271016 232215896
1015.7 232215896 233002514 234617248 237087443 240475565 244697675 249513760 254466683 259053051
1032 259053051 262940198 265927076 267875969 268848270 269193143 269449592 270108312 271600395 274477452
1050.4 274477452 279159933 285630345 293610066 302942932 313704610 325795680 337998331 347363114
1066.7 347363114 350016177 343921810 331482947 318260610 308683187 303843170 302936822 304993331
1083 304993331 309251606 315036267 321840614 329344541 337075830 344306976 350257784 354315102 356334060
1101.4 356334060 357002079 357689410 359675616 363395393 368354857 373638600 378464252 382435232 385468125
1119.8 385468125 387714714 389588773 391796380 395090640 399759203 405126482 409613103 411507696
1136.1 411507696 409785479 404446870 396354049 386837453 377170861 368258476 360718608 354966521
1152.4 354966521 351169378 349357486 349527001 351682931 355973423 362645954 371878177 383582532
1168.7 383582532 397361428 412609130 428617269 444714159 460447311 475591511 489997238
1183 489997238 503410399 515368938 525367856 533095658 538626075 542447090 545207739 547342300
1199.3 547342300 549026251 550474942 552134275 554607272 558286011 563032091 568281949 573451996
1215.6 573451996 578198969 582296669 585414112 587123811 587163568 585776508 583678067 581536114 579563379
1234 579563379 577590168 575464010 573393106 571949720 571675479 572654366 574438930 576398313 578240335
1252.3 578240335 580075562 582007706 583821297 585099399 585758090 586391389 587841630 590396047 593412399
1270.7 593412399 595766902 596820235 596799135 596314609 595806658 595288634 594498456 593271732 591762722
1289 591762722 590296805 588928521 587286949 584964573 582015693 579004824 576486170 574438393 572416127
1307.4 572416127 570249259 568159401 566394210 565118790 564169288 562935114 560742617 557201385
1323.7 557201385 552351475 546660662 540710270 534914374 529590368 525143325 521987796 520355940
1340 520355940 520060897 520474732 520992339 521286011 521353662 521373749 521310925 520922005 520130634 519139946
1360.4 519139946 518220782 517717540 517692864 517857850 518167496 518862844 520053029 521508753 522946179
1378.8 522946179 524225354 525734842 528462470 533060551 538413286 542771697 545704663 546979725
1395.1 546979725 546688616 545479774 544076979 542669952 540749371 538272381 535614729 533052146
1411.4 533052146 531003654 529639184 528486073 527198195 526464999 526660264 527581990 528997481 530609071
1429.8 530609071 532179117 533812761 535853267 538170218 540217519 542032421 543447435 544221342
1446.1 544221342 544204056 543491721 542446554 541210830 539059043 536267340 535394490 536544263 539494097
1464.5 539494097 543853164 549061298 556139112 566535234 577725589 587241650 595595896 603321671
1480.8 603321671 610675693 617565215 624462724 631477296 637564063 642043531 646170497 650924325
1497.1 650924325 655487716 659288704 662636101 666287184 670267284 672852457 674899817 677286386
1513.4 677286386 679782927 682131469 684282422 686622858 688843668 690718412 692432702 693854094
1529.7 693854094 695315897 696999252 698657334 700482905 702542305 703400433 703389883 703609049 704209745
1548.1 704209745 704938233 705411494 705626369 705832005 705660164 704237223 702829003 701459408 699858606
1566.4 699858606 697946250 695669472 693842351 692077935 689036906 685521305 682548404 679822981
1582.8 679822981 677260160 674622893 671676457 668451011 665313065 662480712 659889281 657311320
1599.1 657311320 654421031 651191592 648002982 645065308 642109215 639023542 635917008 632209182
1615.4 632209182 627592623 624061346 621403873 618104398 614438891 610784173 607434988 605343044
1631.7 605343044 604295194 603113711 601755083 601018965 601078093 601988256 603745461 605847299 607648969
1650.1 607648969 609939098 613174796 615903854 618698716 622172296 626186907 630216658 634012759
1666.4 634012759 638568223 643965721 648640037 653188884 658099651 662749171 667500198 673097551
1682.7 673097551 679667234 684649229 688477337 692580879 696606219 701024950 705527902 709055305
1699 709055305 712145090 714515209 716587126 718770921 720646143 722346842 724143863 726158857 728412569
1717.4 728412569 730305910 731722295 733137488 734710515 736446440 738540888 740842223 743215144
1733.7 743215144 745117486 746499538 748212755 750409067 752857983 755483866 758120537 760713518
1750 760713518 763267994 765780568 768546462 771372914 773742080 775798023 777615011 779499292 781691611
1768.4 781691611 783761442 785276711 786163330 786913872 788067937 789550722 790818930 791668117 792328835
1786.7 792328835 793157399 794438720 795980930 797041833 797595084 798042595 798696935 799664497 800771415
1805.1 800771415 801736653 802345335 802686870 803126097 803970158 805043399 805876136 806295216 806585431
1823.4 806585431 807153046 808077335 809058011 809574306 809571683 809506059 809786916 810509682 811377585 811914206
1843.8 811914206 811844945 811573565 811639786 812145293 812740326 813019514 812904119 812755942 812980950 813630283
1864.2 813630283 814354300 814630866 814305842 813970745 814145386 814772010 815413713 815662205 815582335 815627277
1884.6 815627277 816101849 816880345 817489326 817599952 817404211 817323744 817612886 818164766 818569422 818567872
1905 818567872 818348408 818273306 818521261 818971574 819350660 819404304 819173813 819063246 819321156 819746196
1925.4 819746196 819998443 819936633 819725335 819700778 819988430 820410013 820659459 820589781 820372701 820352256
1945.8 820352256 820646167 821065128 821332514 821331620 821238399 821330070 821682453 822105944 822372794 822403014 822312891
1968.3 822312891 822357297 822656095 823004067 823122919 823013663 822898328 822980881 823262215 823553801 823646963
1988.7 823646963 823519826 823356569 823358953 823546946 823719680 823674679 823444128 823216677 823092937 823046684
2009 823046684 822964847 822736025 822378397 821980238 821606219 821260214 820830643 820294797 819862068 819587409
2029.4 819587409 819353282 819142342 818920076 818589330 818167090 817759335 817430496 817212939 817065299 816896915
2049.8 816896915 816685021 816511691 816443861 816482902 816589952 816670179 816664040 816599071 816587865 816723228 816937625
2072.3 816937625 817063808 817027569 816923738 816896856 817012608 817212224 817368209 817400038 817376316 817457497
2092.7 817457497 817709327 818011701 818216085 818288147 818311334 818405449 818613529 818883836 819083691 819135725
2113.1 819135725 819113314 819155455 819321752 819493413 819544196 819482505 819381595 819366038 819505036 819696248
2133.5 819696248 819790423 819735110 819639146 819644928 819781899 819965005 820050776 820017576 819972217 820038259 820282638
2155.9 820282638 820603430 820838392 820984066 821156502 821444809 821861684 822359383 822819769 823165178 823518872
2176.3 823518872 824016094 824603498 825132251 825509906 825796008 826133251 826570868 827046275 827478528 827827275
2196.7 827827275 828120172 828419626 828787923 829226851 829656780 829999864 830277741 830583334 830964983 831401408
2217.1 831401408 831829071 832176507 832413673 832626283 832912683 833274305 833649755 833939135 834104419 834217489
2237.5 834217489 834381640 834619045 834873140 835089087 835232496 835335195 835484147 835700870 835930705 836117804
2257.9 836117804 836239815 836342335 836469054 836627841 836833596 837052047 837237597 837432861 837666094 837904751
2278.3 837904751 838161111 838368535 838409185 838375390 838425159 838541627 838641882 838650286 838504910 838283777
2298.7 838283777 838137567 838091850 838021517 837763786 837299287 836849332 836619079 836491644 836158633 835498512
2319.1 835498512 834710479 834079802 833696008 833406985 833083391 832715154 832229733 831650078 831233859 831090271
2339.5 831090271 831027508 831088006 831695974 832477033 832449615 831434071 830004096 828606308 827410638
2357.8 827410638 826742351 826697886 827121139 827824891 828666985 829574704 830520928 831547499 832582176
2376.2 832582176 833485901 834214032 834735215 835103929 835403264 835546076 835415900 835086346 834733784 834507823
2396.6 834507823 834430277 834341228 834063590 833603740 833159745 832876623 832688570 832426667 831992805 831445038
2417 831445038 830927074 830528080 830189228 829770327 829205394 828546882 827907383 827386379 826963782 826512933
2437.4 826512933 825923502 825211048 824536383 824015856 823566675 823030353 822353601 821630359 821032166 820589125
2457.8 820589125 820160925 819631994 818981349 818304360 817750037 817356527 817006946 816555083 815950394 815286398
2478.1 815286398 814726472 814336181 814004362 813572049 813020766 812474072 812069952 811833858 811643958 811331451
2498.5 811331451 810858130 810355127 809986591 809783399 809603512 809308767 808897734 808469713 808113515 807822943
2518.9 807822943 807487190 807000756 806394875 805805266 805332124 804941416 804474294 803812444 803054214 802371562
2539.3 802371562 801810265 801310718 800775826 800111592 799330652 798600018 798011065 797486305 796915412 796226084
2559.7 796226084 795475006 794813216 794297993 793827474 793264627 792578280 791855931 791224480 790718555 790237963
2580.1 790237963 789674819 789010286 788326383 787751675 787349105 787034214 786640346 786118269 785590470 785176456
2600.5 785176456 784831822 784420013 783863544 783194244 782524168 781908035 781280100 780553460 779673755 778663635
2620.9 778663635 777659118 776742816 775850236 774875641 773750842 772517920 771311760 770203829 769138157
2639.3 769138157 768021166 766827703 765612185 764431596 763307929 762221217 761104822 759914339
2655.6 759914339 758707404 757586539 756586790 755643904 754631639 753518999 752412200 751403093 750485837
2673.9 750485837 749592543 748674572 747709513 746737480 745842099 745027363 744200706 743274391 742254376
2692.3 742254376 741228938 740256071 739289284 738259137 737146616 735984385 734820962 733689845 732603788
2710.7 732603788 731527686 730422497 729293644 728186905 727155209 726186097 725218773 724249840 723326564
2729 723326564 722486079 721740365 721045017 720313072 719506502 718698919 717955589 717234731 716498852 715746164
2749.4 715746164 714992464 714275539 713618636 713024318 712446749 711835146 711210549 710575640 709905922 709244728
2769.8 709244728 708582461 707852960 707045078 706151068 705202878 704241276 703250349 702203870 701066375
2788.2 701066375 699793935 698426425 697044969 695613384 694070101 692445815 690775156 689016819
2804.5 689016819 687173784 685310245 683384359 681335032 679191589 676998854 674773395 672485650
2820.8 672485650 670097828 667619944 665069222 662454963 659771919 656994045 654114306 651130497
2837.1 651130497 648018479 644697249 641090930 637248337 633264959 629235983 625364840 621881723
2853.4 621881723 618859768 616178811 613562703 610705972 607414663 603581429 599166453 594287753
2869.7 594287753 589091659 583602250 577895284 572248697 567021430 562455177 558660567 555678368
2886.1 555678368 553481877 551980674 550986946 550247312 549563468 548822880 547967136 546923876 545598149
2904.4 545598149 543969154 542035758 539681196 536745131 533165395 529040277 524625123 520232737
2920.7 520232737 516156733 512629867 509865999 508095801 507456183 508082807 510142863 513577938 518107176
2939.1 518107176 523436725 529315233 535508335 541812241 548150539 554535747 560884774 567089796
2955.4 567089796 573174894 579122305 584757805 589942992 594685793 599060416 603120267 606943309
2971.7 606943309 610602856 614080429 617407560 620654702 623689175 626342535 628667712 630760491
2988 630760491 632661402 634358466 635743499 636782050 637520909 637960136 638123393 638018787 637642562
3006.4 637642562 637084961 636333108 635240674 633775353 632051229 630194008 628222466 626106322 623851120
3024.7 623851120 621506810 619155943 616823375 614426970 611804962 608952820 606144905 603522301
3041.1 603522301 600880384 598007917 594954610 591923535 588967681 585998416 583007216 579977810
3057.4 579977810 576875329 573804379 570875049 568020880 565079689 561978579 558801889 555717170
3073.7 555717170 552863896 550136149 547232509 544117093 540957451 537797153 534714401 531726599
3090 531726599 528651416 525497854 522477269 519619524 516735315 513691187 510614216 507706642 504910469
3108.4 504910469 502011538 499140114 496535420 493970186 491145164 488048881 484845430 481795877
3124.7 481795877 478984058 476272613 473513395 470679730 467951536 465474457 463049084 460341811
3141 460341811 457423896 454627782 452061832 449718416 447489887 445063889 442338079 439602762 437039047
3159.4 437039047 434600949 432261348 429953575 427613676 425295353 423044801 420826197 418627292
3175.7 418627292 416461080 414336056 412228256 410130650 408108950 406141043 404125124 402078390
3192 402078390 400079459 398130000 396235108 394404620 392588645 390779525 389034897 387323648 385604650
3210.3 385604650 383954287 382397652 380862713 379291654 377667695 376052707 374531180 373074234
3226.7 373074234 371649504 370334476 369108349 367772639 366297662 364861399 363522828 362275094
3243 362275094 361138701 360017091 358768493 357481569 356350422 355324209 354257494 353201747 352208763
3261.3 352208763 351186872 350152969 349296898 348648399 347912431 346923202 345821172 344751000 343820721
3279.7 343820721 343000501 342153579 341293573 340527594 339881063 339243621 338504165 337632269 336626232
3298 336626232 335621446 334854603 334323257 333699554 332738906 331504434 330249190 329198420 328288764
3316.4 328288764 327367246 326430351 325535804 324682415 323714256 322593480 321500063 320513695 319642037
3334.8 319642037 318882972 318058223 317032605 315938562 314862490 313879132 313094288 312235713 311049193
3353.1 311049193 309776396 308722883 307876825 307027608 306130499 305400461 304832071 304048061 302884936
3371.5 302884936 301689059 300763011 300008804 299264848 298461050 297696024 297125280 296803713 296705067 296483487
3391.9 296483487 295836329 295139581 294904351 294905126 294495761 293674499 293064326 292832524 292683005 292480677
3412.3 292480677 292185962 291867226 291666716 291504949 291328639 291300952 291510671 291862607 292153955 292426229
3432.7 292426229 292823762 293079436 292989463 292898118 293129444 293584973 294018447 294393837 294872075 295447797
3453.1 295447797 296047211 296756685 297607511 298364282 299060822 300097734 301359832 302258044 302665085
3471.4 302665085 303056091 303770721 304834098 305931121 306700587 307419270 308399022 309403390 310342669
3489.8 310342669 311393112 312542230 313732356 314905822 316064447 317205071 318128139 318888366 319805652
3508.1 319805652 321007550 322458655 323867351 324996859 326064646 327332050 328791559 330137104
3524.4 330137104 331209570 332224309 333420902 334857613 336461484 338008106 339433581 341084480
3540.8 341084480 342966974 344651997 346019298 347460926 349103123 350802481 352651626 354761332
3557.1 354761332 357090443 359502435 361824960 364028662 366492361 369345546 372149885 374850452
3573.4 374850452 377704918 380759776 384055287 387618244 391213715 394530982 397654325 401105523
3589.7 401105523 404746950 408333093 412081629 416070819 420069903 424041599 428008616 431874633
3606 431874633 435847431 440043747 444289684 448572218 452689439 456745803 461180091 465533912 469463468
3624.4 469463468 473088801 477087379 481829554 486253858 490426451 494614303 498681039 502737343
3640.7 502737343 506872952 510871768 514704168 519029617 523767889 527658522 531027317 535013914
3657 535013914 539189994 542801082 546186447 549622476 552896678 556276858 559980035 563050091 565945923
3675.4 565945923 569365799 572461188 575283647 578122675 580904305 583778620 586687088 589121461
3691.7 589121461 591207027 593323410 595461309 597538292 599718451 602006972 604117334 605981529
3708 605981529 607746363 609769225 611943841 613772273 615288138 616690814 618147373 619679272 621334195
3726.4 621334195 623029649 624541283 626095116 627851069 629675210 631271899 632208109 632637084 633814394
3744.7 633814394 635627449 636677206 637700975 639302790 640687346 641705453 642819285 644161165
3761 644161165 645333290 646366477 647360504 648290753 649360061 650471509 651514709 652602792 653723061
3779.4 653723061 654652894 655358493 656163156 657087922 658016026 658951163 659783244 660717547 661749899
3797.7 661749899 662440717 663307428 664333582 664931953 665750206 666782975 667493224 667959869 668784678
3816.1 668784678 669769824 670368969 671253741 672091722 672645748 673283339 673924863 674764037 675749779 676421285
3836.5 676421285 676899850 677444875 678030550 678748846 679426610 679808676 679787219 679890394 681053162 682169497
3856.9 682169497 682659447 682954133 683365643 684044063 684582353 684962809 685633421 686266720 686832070 687259912
3877.3 687259912 687586129 688278377 688897669 689380109 689867258 689985514 690218568 690854192 691336453 691639960
3897.7 691639960 692086697 692574263 692928076 693266809 693493903 693686604 694039643 694354534 694568515 694930315
3918.1 694930315 695386410 695696592 695958257 696283102 696495056 696638703 696963370 697348773 697574735 697717071
3938.5 697717071 697904289 698253930 698653877 698900700 699148953 699475408 699750781 699964762 700142145 700334549
3958.9 700334549 700576186 700826406 701082110 701326907 701559186 701854706 702155411 702372253 702551067 702717364
3979.3 702717364 702938676 703214228 703374803 703400552 703495443 703772604 704106271 704378486 704578578
3997.6 704578578
##END=$$ End of the data block
