##TITLE=$$ Begin of the data block
##JCAMP-DX=5.00 $$ ACD/SpecManager v 10.08
##SPECTROMETER/DATA SYSTEM=Alpha
##DATE=26 Dec 2014 10:25:20
##DATA TYPE=INFRARED SPECTRUM
##DATA CLASS=XYDATA
##ORIGIN=
##OWNER=
##NPOINTS=1765
##FIRSTX=399.76428223
##LASTX=3997.64306641
##MAXX=3997.64306641
##MINX=399.76428223
##MAXY=0.83109885
##MINY=0.24130443
##XFACTOR=1.0000000000
##YFACTOR=1.000000000000000e-9
##FIRSTY=0.53739536
##DELTAX=2.03961372
##XUNITS=1/CM
##YUNITS=ARBITRARY UNITS
##XYDATA=(X++(Y..Y))
399.8E37395358n359292l987253j685261M37319J615286J618922Q99910O72520Q29458
$$ 537395358 532036066 528048813 526363552 526800871 528416157 530035079 530934989 531607509 532436967
418.1E32436967P6592j529634l006220l717124l149391k268970k192497k851069k728164
$$ 532436967 532513559 530983925 527977705 524260581 521111190 518842220 516649723 513798654 511070490
436.5E11070490o92010K281785M938543N652547M084646K555907K118170J961768J256168
$$ 511070490 510378480 512660265 517598808 523251355 527336001 529891908 532010078 533971846 535228014
454.8E35228014j3888j436949k401888k769053k372324j961887k641976l968060m474044
$$ 535228014 535214126 533777177 531375289 528606236 526233912 524272025 521630049 517661989 513187945
473.2E13187945l266573j602292p49707q62718j179755r80437l13758L40819L58820
$$ 513187945 509921372 508319080 507569373 506706655 505526900 504546463 504232705 504573524 504932344
491.5E04932344n15223j837670k625436k316087j661331j667261k621681l817915m247338
$$ 504932344 504417121 502579451 499954015 497637928 495976597 494309336 491687655 487869740 483622402
509.9D83622402l893673l461808l669054m423231m745364m093677k619683p43807M62473
$$ 483622402 479728729 476266921 472597867 468174636 463429272 459335595 456715912 455972105 456434578
528.3D56434578M20302K75045J348466L819794O274342O867647N228252K609372P90834
$$ 456434578 456854880 457129925 458478391 462298185 468572527 475440174 480668426 483277798 484068632
546.6D84068632M29243K76148q12918k416610l864080m663676m606545m695296n657137
$$ 484068632 484497875 484774023 483961105 481544495 477680415 473016739 468410194 463714898 458057761
565D58057761o993413p712900o572694l526568j10060K375871L868609N199611O764740
$$ 458057761 451064348 443351448 436778754 433252186 433142126 435517997 439386606 444586217 451350957
583.3D51350957P955343P857054O069750L385335J107007J28627K86371N90324K57909
$$ 451350957 459306300 467163354 473233104 476618439 477725446 477854073 478140444 478730768 478988677
601.7D78988677m72128p70420j96576J034260K072662K290726K039670K098024K927304
$$ 478988677 478516549 477746129 477549553 478583813 480656475 482947201 484986871 487084895 490012199
620D90012199M170358M972219M718691L492773K287567K056122K567410K887368K276004
$$ 490012199 494182557 499154776 503873467 507366240 509653807 511709929 514277339 517164707 519440711
638.4E19440711J075863L04640N16951J406789J995742J622796P08520K09928N73814
$$ 519440711 520516574 520821214 521338165 522744954 524740696 526363492 527072012 527281940 527855754
656.8E27855754J435637J940430J578927P01844k9981N27322J975239K392888K118289
$$ 527855754 529291391 531231821 532810748 533512592 533482611 534009933 535985172 538378060 540496349
675.1E40496349J397193R17554J168549J848578K023757J309216K61903n75543r23276
$$ 540496349 541893542 542811096 543979645 545828223 547851980 549161196 549423099 548847556 547924280
693.5E47924280j015425j584887k650321l559589l710628k793550j154959M24087J627803
$$ 547924280 546908855 545323968 542673647 539114058 535403430 532609880 531454921 531879008 533506811
711.8E33506811K564013L463328M611074N905629O685853O598830O013632N406558
$$ 533506811 536070824 539534152 544145226 550050855 556736708 563335538 569349170 574755728
728.1E74755728N111814M910409M318893L283084K071440J057565L91305l09647j558005
$$ 574755728 579867542 584777951 589096844 592379928 594451368 595508933 595900238 595590591 594032586
746.5E94032586l134489m443646n067050n040646m790843m523754m053354l064692
$$ 594032586 590898097 586454451 581387401 576346755 571555912 567032158 562978804 559914112
762.8E59914112j366556R88126L572107N808115P428824Q578957R339213R488046Q819640
$$ 559914112 558547556 559535682 563107789 568915904 576344728 584923685 594262898 603750944 612570584
781.2F12570584P465958N991757M914344M353106M078328L930509L950775M068256
$$ 612570584 620036542 626028299 630942643 635295749 639374077 643304586 647255361 651323617
797.5F51323617M192650M374206M352391L739893K763689J878261J406908J322866
$$ 651323617 655516267 659890473 664242864 667982757 670746446 672624707 674031615 675354481
813.8F75354481J137852N46396l11136j240313j971603k571284l429950m487335n525112
$$ 675354481 676492333 677038729 676727593 675487280 673515677 670944393 667514443 663027108 657501996
832.2F57501996o251693o277859n716980n088329m719258m578411m327059l853321
$$ 657501996 651250303 644972444 639255464 634167135 629447877 624869466 620542407 616689086
848.5F16689086l512144l631652m292964n099059m873871k337397K371550P309198
$$ 616689086 613176942 609545290 605252326 600153267 595279396 592941999 595313549 602622747
864.8F02622747J0553122J1968672J2294114J1567473R579838O547689K923608o93023
$$ 602622747 613175869 625144541 637438655 649006128 658585966 665133655 668057263 667364240
881.1F67364240l657699n519330o332756o651401o857991o881714o578863o017029
$$ 667364240 663706541 658187211 651854455 645203054 638345063 631463349 624884486 618867457
897.4F18867457n518258n472481o065607p169843q361161r232640r778678j0248423
$$ 618867457 613349199 607876718 601811111 594641268 586280107 577047467 567268789 557020366
913.7E57020366j0627866j0391116r000718o568730l838718j644910l66210L57449
$$ 557020366 546392500 536001384 527000666 520431936 516593218 514948308 514582098 514939547
930.1E14939547J154482K235055L449321M506647N094827M819393L100574j81198m274607
$$ 514939547 516094029 518329084 521778405 526285052 531379879 536199272 539299846 539118648 534844041
948.4E34844041q254588j1592388j4118791j5837371j6834378j7386526j7883301j8503248
$$ 534844041 526589453 514997065 500878274 485040903 468206525 450819999 432936698 414433450
964.7D14433450j9140482j9570917j9624710j9255698j8490285j7330170j5713453
$$ 414433450 395292968 375722051 356097341 336841643 318351358 301021188 285307735
979B85307735j3559699j0943800q157760n579546l441915j770034n50554L50833J050920
$$ 285307735 271748036 260804236 252646476 247066930 243625015 241854981 241304427 241655260 242706180
997.4B42706180J504257J623362J379699Q41260K22474j95637l04282j15216K92197
$$ 242706180 244210437 245833799 247213498 248054758 248277232 248081595 247777313 247662097 247954294
1015.7B47954294Q54388J502424K185345K905667L503680L757745L720552L530741
$$ 247954294 248808682 250311106 252496451 255402118 258905798 262663543 266384095 269914836
1032B69914836L110289K433002J619756Q92640M75883M40687P61926J435220K469987
$$ 269914836 273025125 275458127 277077883 277970523 278446406 278887093 279649019 281084239 283554226
1050.4B83554226L753692N057365O276786P499069Q791268J0021478J0390490Q383691
$$ 283554226 287307918 292365283 298642069 306141138 314932406 324953884 335344374 343728065
1066.7C43728065L030241m221141r700269j0695696p949948m171550j017005J311541
$$ 343728065 346758306 342537165 332836896 322141200 314191252 310019702 309002697 310314238
1083C10314238L007978M248858N152017N776584O067365N840540M958213L546953K014637
$$ 310314238 313322216 317571074 322723091 328499675 334567040 340407580 345365793 348912746 350927383
1101.4C50927383R58502Q47250J668185K905131L933578M396677M240990L621906K797663
$$ 350927383 351885885 352733135 354401320 357306451 361240029 365636706 369877696 373499602 376297265
1119.8C76297265K077908J802146K188236L118425M148096M573494L763378J618564
$$ 376297265 378375173 380177319 382365555 385483980 389632076 394205570 397968948 399587512
1136.1C99587512j374692m415363o774604q063048q274108p638097o483883n068093
$$ 399587512 398212820 393797457 387022853 378959805 370685697 363047600 356563717 351495624
1152.4C51495624l533453k017260n92619Q41439K441019M284680O350755Q428514J0260225
$$ 351495624 347962171 345944911 345352292 346193731 348634750 352919430 359270185 367698699 377958924
1170.7C77958924J1749595J2890100J3635010J3993859J3995141J3623476J2895167
$$ 377958924 389708519 402598619 416233629 430227488 444222629 457846105 470741272
1185D70741272J1817902J0338843Q475334O458759M573226L094494K230227J966775
$$ 470741272 482559174 492898017 501373351 507832110 512405336 515499830 517730057 519696832
1201.3E19696832K086043K381086K837778L540754M455387N298317N692720N368948
$$ 519696832 521782875 524163961 527001739 530542493 534997880 540296197 545988917 551357865
1217.7E51357865M350782K986908J637399M88758m24743j150787j681625j944781j915037
$$ 551357865 555708647 558695555 560332954 560821712 560396969 559246182 557564557 555619776 553704739
1236E53704739j641333j199246o68168p0751O18220J346886J993120K386212K357066
$$ 553704739 552063406 550864160 550195992 550125241 550743461 552090347 554083467 556469679 558826745
1254.4E58826745J903116J298249R29952R61065J335502J862943K199471K125144J733363
$$ 558826745 560729861 562028110 562958062 563919127 565254629 567117572 569317043 571442187 573175550
1272.7E73175550J210868O44326N2631m90725q63254r93371q90553p41124q24273j221001
$$ 573175550 574386418 575030744 575083375 574592650 573729396 572736025 571845472 571104348 570280075 569059074
1293.1E69059074j760125k145291k189397j994372j804769j839936k040147k030135
$$ 569059074 567298949 565153658 562964261 560969889 559165120 557325184 555285037 553254902
1309.4E53254902j687586j239479r82999j111210j510799k087295k948403m023194
$$ 553254902 551567316 550327837 549344838 548233628 546722829 544635534 541687131 537663937
1325.8E37663937n002380n590677n648315n151987m173100k876163j402020j82390
$$ 537663937 532661557 527070880 521422565 516270578 512097478 509221315 507819295 507636905
1342.1E07636905L24070L72052K99693J40011j03057m57704q77142j226246j460314
$$ 507636905 507960975 508333027 508632720 508772731 508669674 508211970 507334828 506108582 504648268
1360.4E04648268j418888q90494n21540n38826l65377N8353O42002J074910J047075
$$ 504648268 503229380 502338886 501817346 501278520 500913143 500971496 501613498 502688408 503735483
1378.8E03735483Q97169J115084J956522L366590M161179L388702K025962P02560k12431
$$ 503735483 504632652 505747736 507704258 511070848 515232027 518620729 520646691 521349251 521136820
1397.1E21136820o59346q06392j158237j782417j998246k017796k046287j767397j424372
$$ 521136820 520477474 519671082 518512845 516730428 514732182 512714386 510668099 508900702 507476330
1415.5E07476330j412988j145780k16722M51862Q99136J214683J393617J594662J607657
$$ 507476330 506063342 504917562 504700840 505152702 506051838 507266521 508660138 510254800 511862457
1433.9E11862457J758933K362013K441883K137303J691759J044452L41535k13087o86049
$$ 511862457 513621390 515983403 518425286 520562589 522254348 523298800 523640335 523427248 522741199
1452.2E22741199j249195k417028k350032Q881J161576K125024L660441M684090N902172
$$ 522741199 521492004 519074976 516724944 516733825 517895401 520020425 523680866 528364956 534267128
1470.6E34267128Q786976J0406673R523153Q537054P955730P597983O708920N995750
$$ 534267128 543054104 553460777 562983930 571520984 579476714 587074697 593783617 599779367
1486.9E99779367O165922O521702N469978M479050M524529M547358M007161L143906
$$ 599779367 605945289 612466991 617936969 622416019 626940548 631487906 635495067 638638973
1503.2F38638973K484799L032207L642202L090679K466500K011240K111613K152443
$$ 638638973 641123772 644155979 647798181 650888860 653355360 655366600 657478213 659630656
1519.5F59630656K107680K125681J890480J915872J827479J398146J170039J104891
$$ 659630656 661738336 663864017 665754497 667670369 669497848 670895994 672066033 673170924
1535.8F73170924M16696l84986J97708J029253R25541K44081m04834n80371o38962
$$ 673170924 673587620 673202634 673400342 674429595 675355136 675599217 675194383 674614012 673975050
1554.2F73975050r51647k119303k017498m59433q22186j343072j683414j832366j340985
$$ 673975050 673023403 670904100 668886602 668427169 667604983 666261911 664578497 662746131 661405146
1572.6F61405146j788199k593875j541912q20220j227677j663565j923442j942218
$$ 661405146 659616947 657023072 655481160 654660940 653433263 651769698 649846256 647904038
1588.9F47904038j801192j744986j935124k272666k637625k933383k970457k948701
$$ 647904038 646102846 644357860 642422736 640150070 637512445 634579062 631608605 628659904
1605.2F28659904l259718l781677l859162l615439m052520m417836k976299k656281
$$ 628659904 625400186 621618509 617759347 614143908 610091388 605673552 602697253 600040972
1621.5F00040972l551543l287792k668798k220869j637995j863003k579272j282632
$$ 600040972 596489429 593201637 590532839 588311970 586673975 584810972 582231700 580949068
1637.8E80949068J89662N22614M58240L58880J108586J643479J699925L213882L859997
$$ 580949068 581138730 581661344 582119584 582478464 583587050 585230529 586930454 590144336 594004333
1656.2E94004333L292203L052235L403484M115999M055619M218698M988372M714608
$$ 594004333 597296536 600348771 603752255 607868254 611923873 616142571 621130943 625845551
1672.5F25845551M692674N331040N173862M698574M733026O177306O052196N111516
$$ 625845551 630538225 635869265 641043127 645741701 650474727 656652033 662704229 667815745
1688.8F67815745N254626M710138M236162M096746L706277M184126L981471L498912
$$ 667815745 673070371 677780509 682016671 686113417 689819694 694003820 697985291 701484203
1705.1G01484203L399611K708852J989126J606882J523495K045870K435088J857817
$$ 701484203 704883814 707592666 709581792 711188674 712712169 714758039 717193127 719050944
1721.5G19050944J391649J615822J918972J970231J613856J307905J853108K090931
$$ 719050944 720442593 722058415 723977387 725947618 727561474 728869379 730722487 732813418
1737.8G32813418K150774K387464K379060K071857J800657K297878L332376L337920
$$ 732813418 734964192 737351656 739730716 741802573 743603230 745901108 749233484 752571404
1754.1G52571404K783060K345920J875639J920461K279222K158821J732826J132608
$$ 752571404 755354464 757700384 759576023 761496484 763775706 765934527 767667353 768799961
1770.4G68799961R12606J538337J869320J661182J384318J081288P87794Q36909R72807
$$ 768799961 769712567 771250904 773120224 774781406 776165724 777247012 778034806 778871715 779844522
1788.8G79844522R28641J103699J103163P36356N75006R35673J455248J374602P80821
$$ 779844522 780773163 781876862 782980025 783716381 784291387 785227060 786682308 788056910 788837731
1807.1G88837731K92480M35054J009882J257717J014591O24835K85268J78516M96030
$$ 788837731 789130211 789565265 790575147 791832864 792847455 793472290 793757558 793936074 794432104
1825.5G94432104P69913P04348O75678N30958L28601N19216P33912L75926j64866J728
$$ 794432104 795202017 795906365 796582043 797113001 797441602 797960818 798694730 799070656 798905790 798907518
1845.9G98907518M81666P08103P34031M88222J33216q8394J1921L09050M17888J01626
$$ 798907518 799389184 800097287 800831318 801319540 801452756 801364362 801376283 801685333 802103221 802204847
1866.3H02204847j97470J38700N61595O56009O45757N06758K28524M9174J53244L93271
$$ 802204847 802007377 802146077 802707672 803363681 804009438 804516196 804744720 804793894 804947138 805340409
1886.7H05340409N15044N30005L09765J4484J16646M23133N37158L46422k5451k65837
$$ 805340409 805855453 806385458 806695223 806709707 806826353 807249486 807786644 808133066 808107615 807841778
1907.1H07841778j07467L45885N51701K38121k10405k25246M1366L63290O16074M06444
$$ 807841778 807734311 808080196 808631897 808870018 808659613 808434367 808475733 808839023 809455097 809861541
1927.5H09861541j2398j63197Q821K96175M18485J63257k42174k33471J68025N02110
$$ 809861541 809849143 809685946 809694767 809990942 810409427 810572684 810330510 810097039 810265064 810767174
1947.9H10767174N71012L31641J6868p5043J16468M18544N02646K14278j51992j35481
$$ 810767174 811338186 811669827 811686695 811611652 811728120 812146664 812649310 812863588 812711596 812576115
1968.3H12576115J85132M20213M55797K57253p5757k21551k742L13640L51846M3631
$$ 812576115 812761247 813181460 813637257 813894510 813818753 813597202 813594460 813908100 814259946 814303577
1988.7H14303577l11673k75671J23262M02391L64244P7069k81513m26471k38478P0810
$$ 814303577 813991904 813716233 813839495 814241886 814606130 814683199 814401686 813975215 813736737 813807547
2009H13807547J39356j89901o54637p60138m31359j34886k17557n12242n96046m68791
$$ 813807547 813946903 813757002 813102365 812342227 811910868 811775982 811558425 811046183 810450137 809981346
2029.4H09981346k86758q1599m6670l07262o46055o87003l67582r298R0718j08123
$$ 809981346 809694588 809612989 809566319 809259057 808613002 807925999 807558417 807549119 807639837 807531714
2049.8H07531714l71396l86953j06216K27809L29018J16467j90794k57969L040L23116
$$ 807531714 807160318 806773365 806667149 806894958 807223976 807340443 807149649 806891680 806894720 807217836
2070.2H07217836M14312J74880k13504l58104p3731L46243M65214J88768j85907k52485
$$ 807217836 807632148 807807028 807593524 807235420 807161689 807507932 807973146 808161914 807976007 807723522
2090.6H07723522M8280L86417M82499K99097l3260j88052M8279M25816N37157K50399
$$ 807723522 807771802 808158219 808640718 808939815 808906555 808718503 808766782 809192598 809729755 809980154
2111H09980154j56462k66135K146L12209L70026J23262k21312l11196p1943K78175
$$ 809980154 809823692 809557557 809559703 809871912 810241938 810365200 810143888 809832692 809760749 810038924
2131.4H10038924M14312J64688k31564l52979r0122K86519M32253K06292j51754k65657
$$ 810038924 810453236 810617924 810386360 810033381 809943259 810229778 810662031 810868323 810716569 810450912
2151.8H10450912k0206L58462N42045L68297J6152r6023J90497O01768Q07643O37472
$$ 810450912 810430706 810789168 811331213 811699510 811715662 811619639 811810136 812411904 813219547 813857019
2172.2H13857019K57671J09851L60370P28667Q20934N47350J98305J13964L45230O47723
$$ 813857019 814114690 814224541 814584911 815313578 816134512 816681862 816880167 816994131 817339361 817987084
2192.6H17987084P47085N26428J75834M8518K71499O24836P49111N04136J57893P8022
$$ 817987084 818734169 819260597 819436431 819484949 819756448 820381284 821130395 821634531 821792424 821870446
2213H21870446L23594O24895O87241M59135J06633l2962K14518N73337O58035L78787
$$ 821870446 822194040 822818935 823506176 823965311 824071944 824038982 824253500 824826837 825484872 825863659
2233.4H25863659p212j36554J34587N05984N65767K79189p8202j99556M4525M26948
$$ 825863659 825856447 825719893 825854480 826360464 826926231 827205420 827127218 826927662 826972187 827399135
2253.8H27399135N71787L36945p8082k21431Q4817M91679N98311L16024p5698j89304
$$ 827399135 827970922 828307867 828229785 828008354 828093171 828584850 829183161 829499185 829423487 829234183
2274.2H29234183R5665N08786O09576K77639j26779k28107p689K88188L57807Q9586
$$ 829234183 829329848 829838634 830448210 830725849 830599070 830370963 830363274 830651462 831009269 831098855
2294.6H31098855k53082l50773j60694J47283K27034r6262n14805n63741j81794J81735
$$ 831098855 830845773 830495000 830334306 830481589 830708623 830612361 830097556 829533815 829352021 829533756
2315H29533756J44303k38836o36220o58035k88368J9670K5928j71721m12345n49853
$$ 829533756 829678059 829439223 828803003 828144968 827856600 827876270 827902198 827730477 827318132 826768279
2335.4H26768279m38929m8697J99855j6153j52767M2141k4081l55601n60343o20961
$$ 826768279 826329350 826280653 826480508 826464355 826311588 826353729 826329648 825974047 825413704 824792743
2355.8H24792743p43449p46071l73006K16424N16415L37362O8009J12534M17888P33137
$$ 824792743 824049294 823303223 822930217 823146641 823663056 824000418 824068427 824180961 824598849 825331986
2376.2H25331986Q01027N10990J01567r2030L6717K85148K73407j03474n22911o25134
$$ 825331986 826133013 826644003 826745570 826653540 826690257 826975405 827248812 827145338 826622427 825997293
2396.6H25997293l41058L0875Q6308k20180n82814p05600m79102j49250q9109l59058
$$ 825997293 825656235 825687110 825773418 825553238 824970424 824264824 823785722 823636472 823547363 823188305
2417H23188305p32839q52466n80728k25127j65581m63069q45849r55761p06255l47376
$$ 823188305 822455466 821603000 821022272 820797145 820631564 820168495 819322646 818366885 817660630 817313254
2437.4H17313254k13027m60327q55028r90272p59661l89695k27154m52816q28207r48488
$$ 817313254 817100227 816639900 815784872 814794600 814034939 813645244 813418090 812965274 812137067 811188579
2457.8H11188579o97732l29972k02834m14133p37250q78155p02084l67462k21551m03165
$$ 811188579 810490847 810160875 809958041 809543908 808806658 807928503 807226419 806858957 806637406 806234241
2478.1H06234241p14005q24034n94079k33889p5400k78651o29843p42316n09918j40488
$$ 806234241 805520236 804696202 804102123 803868234 803792834 803514183 802884340 802142024 801632106 801491618
2498.5H01491618L2127j60873m94003o61850n28753j64270L5643j87158n74768p57039
$$ 801491618 801523745 801362872 800868869 800207019 799678266 799513996 799549639 799362481 798787713 798030674
2518.9G98030674n99086k65777j33216l69668p28965q95023p37370m36723l31342n00321
$$ 798030674 797431588 797165811 797032595 796662927 795933962 795038939 794301569 793864846 793533504 793033183
2539.3G93033183p92563r86338q63552n21183l29673m67956p76113r46879q30352n56410
$$ 793033183 792240620 791254282 790390730 789869547 789539874 789071918 788295805 787348926 786518574 785962164
2559.7G85962164l85940m94599p66277r02295p61331m85301l41653m54367p03752q40664
$$ 785962164 785576224 785081625 784315348 783413053 782651722 782166421 781824768 781370401 780666649 779825985
2580.1G79825985p03990m51267l52919m29869n94675p05540n86510l32236j79589k47240
$$ 779825985 779121995 778670728 778317809 777887940 777293265 776587725 776001215 775668979 775489390 775242150
2600.5G75242150n16594p50184p14600n24699m26233n38290q31306j069188j057088
$$ 775242150 774725556 773975372 773260772 772736073 772309840 771771550 770940244 769871056 768813968
2618.9G68813968q71122p54714q95083j169562j311899j237869j053750r74000j086473
$$ 768813968 767942846 767188132 766293049 765123487 763811588 762573719 761519969 760545969 759459496
2637.2G59459496j285077j420796j352369j144469j017511j054823j212359j346648
$$ 759459496 758174419 756753623 755401254 754256785 753239274 752184451 750972092 749625444
2653.5G49625444j289427j086235r62436j030564j177609j250267j188279j017451
$$ 749625444 748336017 747249782 746287346 745256782 744079173 742828906 741640627 740623176
2669.9G40623176q52525q52764j016021j116931j045525q91268p65860q01862r96053
$$ 740623176 739770651 738917887 737901866 736784935 735739410 734848142 734082282 733280420 732284367
2688.2G32284367j105130j024902r21547r18388r97663j108646j202345j197040j098812
$$ 732284367 731179237 730154335 729232788 728314400 727316737 726208091 725005746 723808706 722709894
2706.6G22709894j037121j084685j199782j260102j179754j006961q89659r28462j025974
$$ 722709894 721672773 720588088 719388306 718128204 716948450 715941489 715051830 714123368 713097394
2724.9G13097394j032949r34422p98941p28964p43032p94709q74340q82089p59066
$$ 713097394 712064445 711130023 710331082 709602118 708859086 708064377 707190037 706307948 705548882
2743.3G05548882o58273p06852q28325q72374p59423n80728n14388n77331o52849o74308
$$ 705548882 704890609 704183757 703355432 702483058 701723635 701142907 700628519 700051188 699398339 698724031
2763.7F98724031o50107o03438n89311o54280p59244q56876r08733q96215q97467r86100
$$ 698724031 698073924 697470486 696881175 696226895 695467651 694610775 693702042 692805827 691908360 690922260
2784.1F90922260j124024j218855j232505j236439j302183j417458j558542j654744
$$ 690922260 689798236 688579381 687346876 686110437 684808254 683390796 681832254 680177510
2800.4F80177510j640082j616835j694083j833737j989067k088368k063632k034843
$$ 680177510 678537428 676920593 675226510 673392773 671403706 669315338 667251706 665216863
2816.7F65216863k120077k259970k368748k428651k462745k490640k550304k680897
$$ 665216863 663096786 660836816 658468068 656039417 653576672 651086032 648535728 645854831
2833F45854831k841711k965808l049314l142774l308058l538609l727317l760457l579199
$$ 645854831 643013120 640047312 636997998 633855224 630547166 627008557 623281240 619520783 615941584
2851.4F15941584l235161k942205k852380k978742l284216l654957m078626m581929
$$ 615941584 612706423 609764218 606911838 603933096 600648880 596993923 592915297 588333368
2867.7E88333368n028724n309403n469859n516231n326331m876256m285931l609598
$$ 588333368 583304644 577995241 572525382 567009151 561682820 556806564 552520633 548911035
2884E48911035k850115k101839j453280r65297o90878o17623o60062p08282q14200
$$ 548911035 546060920 543959081 542505801 541540504 540849626 540232003 539571941 538863659 538049459
2902.4E38049459j046955j376331j762032k152563k577662l047943l426433l634333
$$ 538049459 537002504 535626173 533864141 531711578 529133916 526085973 522659540 519025207
2918.7E19025207l682554l454864k931118k228320j400709m90129N73635J802206K969623
$$ 519025207 515342653 511887789 508956671 506728351 505327642 504837513 505411148 507213354 510182977
2937E10182977L942728M723787N223870N462408N619944N792558N934477N933046N795658
$$ 510182977 514125705 518849492 524073362 529535770 535155714 540948272 546882749 552815795 558611453
2955.4E58611453N646526N517602N368293N119204M726529M311800L956139L716469
$$ 558611453 564257979 569775581 575143874 580263078 584989607 589301407 593257546 596974015
2971.7E96974015L676951L696144L646374L506481L196657K818644K560496K384186
$$ 596974015 600650966 604347110 607993484 611499965 614696622 617515266 620075762 622459948
2988F22459948K175212J855791J452982J120806Q80003O66260M13776M4823l52502
$$ 622459948 624635160 626490951 627943933 629064739 629944742 630611002 631024778 631069601 630717099
3006.4F30717099o25968p47144q75831j187444j569629j823425j941085j969158k008737
$$ 630717099 630091131 629343987 628468156 627280712 625711083 623887658 621946573 619977415 617968678
3024.7F17968678k151310k286732k359212k393245k447963k540052k528250k518296
$$ 617968678 615817368 613530636 611171424 608778179 606330216 603790164 601261914 598743618
3041.1E98743618k678514k858937k891361k788306k723157k814830k946198l005445
$$ 598743618 596065104 593206167 590314806 587526500 584803343 581988513 579042315 576036870
3057.4E76036870k960205k810895k696931k720118k877474l048539l023922k820909
$$ 576036870 573076665 570265770 567568839 564848721 561971247 558922708 555898786 553077877
3073.7E53077877k628506k636850k855539k985358k912581k836824k806067k826154
$$ 553077877 550449371 547812521 544956982 541971624 539059043 536222219 533416152 530589998
3090E30589998k961397l035248k879560k650678k633273k806604k848685k690494k590180
$$ 530589998 527628601 524593353 521713793 519063115 516429842 513623238 510774553 508084059 505493879
3108.4E05493879k658844k651155k497613k483487k643436k773971k801567k741188
$$ 505493879 502835035 500183880 497686267 495202780 492559344 489785373 486983806 484242618
3124.7D84242618k628803k529323k528966k584219k496928k300411k280921k481431
$$ 484242618 481613815 479084492 476555526 473971307 471474379 469173968 466893047 464411616
3141D64411616k582580k469122k315879k159327k081275k238602k433508k386809k232164
$$ 464411616 461829036 459359914 457044035 454884708 452803433 450564831 448131323 445744514 443512350
3159.4D43512350k158671k169729k178639k127141k079755k030879j957685j934230
$$ 443512350 441353679 439183950 437005311 434878170 432798415 430767536 428809851 426875621
3175.7D26875621j954734j928747j875341j817971j763583j763582j811057j860827
$$ 426875621 424920887 422992140 421116799 419298828 417535245 415771663 413960606 412099779
3192D12099779j836688j741945j652748j590252j583308j606494j565307j502514j466990
$$ 412099779 410263091 408521146 406868398 405278146 403694838 402088344 400523037 399020523 397553533
3210.3C97553533j429528j394301j365871j384258j408517j359403j314819j312763
$$ 397553533 396124005 394729704 393363833 391979575 390571058 389211655 387896836 386584073
3226.7C86584073j262635j145839j071126j194387j362205j310617j170873j080007
$$ 386584073 385321438 384175599 383104473 381910086 380547881 379237264 378066391 376986384
3243C76986384r81658r54122j080036j154899j049161r19700r03338r36330r22054
$$ 376986384 376004726 375050604 373970568 372815669 371766508 370846808 369943470 369007140 368085086
3261.3C68085086q65221p87049p11143o54578p30545q77976r14991q99226q69065q15511
$$ 368085086 367219865 366432816 365721673 365067095 364336550 363458574 362543583 361644357 360775292 359959781
3281.7C59959781p35342o77973o80238o13183n72056o88880p94381q41439q41647p00236
$$ 359959781 359224439 358546466 357866228 357253045 356680989 355992109 355197728 354356289 353514642 352814406
3302.1C52814406n18590n69046q43376j044213j031459r02086q28177q55207q76725
$$ 352814406 352295816 351726770 350883394 349839181 348807722 347905636 347077459 346222252 345345527
3320.5C45345527q09789p83026r44942j058698r70036q70675p82042o88941p63803
$$ 345345527 344535738 343752712 342807770 341749072 340779036 339908361 339126319 338437378 337673575
3338.8C37673575r72420j077771j034379r06766p91162r01222j137674j145661r28581
$$ 337673575 336701155 335623384 334589005 333682239 332891077 331989855 330852181 329706520 328777939
3357.2C28777939p66814q21232q90047p67380o96093q70704j130641j158863r20504
$$ 328777939 328011125 327189893 326299846 325532466 324836373 323965669 322835028 321676165 320755661
3375.5C20755661p56771p47502p73877p75128o69599l96758j44750k69741o20216o76036
$$ 320755661 319998890 319251388 318477511 317702383 317032784 316636026 316491276 316221535 315601319 314925283
3395.9C14925283l48419j14709l90679p57843o17146l05414k42472k83510l78221m22448
$$ 314925283 314576864 314462155 314071476 313313633 312696487 312391073 312148601 311865091 311486870 311064422
3416.3C11064422k84135k10107k02447j7345K12342K89202J94221J80155L24428K17706
$$ 311064422 310780287 310570180 310367733 310350388 310562730 310851932 311046153 311226308 311550736 311768442
3436.7C11768442j05321j34379J12951K98292L59028L85791M47065N17219N72115O31035
$$ 311768442 311663121 311528742 311641693 311939985 312299013 312684804 313131869 313649088 314221203 314852238
3457.1C14852238O85274O32912O79255J000195J142324P61032K86162K66373N55992
$$ 314852238 315537512 316170424 316849679 317849874 318992198 319753230 320039392 320305765 320861757
3475.5C20861757Q98272R57787O25908N92709R33051R88930Q76695R33379R73344R75251
$$ 320861757 321760029 322717816 323343724 323936433 324869484 325858414 326735109 327668488 328641832 329617083
3495.9C29617083R54032R15349Q62181P28607P18683Q90672J123399J336962J221478
$$ 329617083 330571115 331486464 332348645 333077252 333795935 334686607 335810006 337146968 338368446
3514.2C38368446Q84801Q44627J094699J297832J170039Q81493Q78453J186133J429915
$$ 338368446 339253247 340097874 341192573 342490405 343660444 344541937 345420390 346606523 348036438
3532.6C48036438J458645J335234J249164J423329J547039J360058J185358J345932
$$ 348036438 349495083 350830317 352079481 353502810 355049849 356409907 357595265 358941197
3548.9C58941197J495362J505315J621425J826108K012819K047211J810163J492798
$$ 358941197 360436559 361941874 363563299 365389407 367402226 369449437 371259600 372752398
3565.2C72752398J888097K785593K858370K511055K544939K769083K940059L103614
$$ 372752398 374640495 377426088 380284458 382795513 385340452 388109535 391049594 394153208
3581.5C94153208L087282K690434K509892L214717L517151L260732L362894L696263
$$ 394153208 397240490 399930924 402440816 405655533 409172684 412433416 415796310 419492573
3597.9D19492573L739833L722877L693103L424168L422588L727883L777504L809333
$$ 419492573 423232406 426955283 430648386 434072554 437495142 441223025 445000529 448809862
3614.2D48809862L749907L663302M226595M555791M130274L335476L015042M173040
$$ 448809862 452559769 456223071 460449666 465005457 469135731 472471207 475486249 479659289
3630.5D79659289M671484M315079M122406M046380L957481L830134L526628L082753
$$ 479659289 484330773 488645852 492768258 496814638 500772119 504602253 508128881 511211634
3646.8E11211634L360748M568338M652620L955602M032553M355251L929973L458917
$$ 511211634 514572382 519140720 523793340 527748942 531781495 536136746 540066719 543525636
3663.1E43525636L354252K998530K619267L160238L075421K427042L240048L844262
$$ 543525636 546879888 549878418 552497685 555657923 558733344 561160386 564400434 568244696
3679.4E68244696L566622L289581K913832K250135J770258K389908L024578K832234
$$ 568244696 571811318 575100899 578014731 580264866 582035124 584425032 587449610 590281844
3695.8E90281844K324402J868129J754701K174378K257228J624524R58681J351059
$$ 590281844 592606246 594474375 596229076 598403454 600660682 602285206 603243887 604594946
3712.1F04594946K517521K560139J837909J335442J231015J303077J523077J824081
$$ 604594946 607112467 609672606 611510515 612845957 614076972 615380049 616903126 618727207
3728.4F18727207J591206Q87453N49913J376092K307236J969517O45578J53243J300156
$$ 618727207 620318413 621205866 621755779 623131871 625439107 627408624 628054202 628207445 629507601
3746.7F29507601J026750L37779J559675K333701J659632J031816J298666J411974
$$ 629507601 630534351 630872130 632431805 634765506 636425138 637456954 638755620 640167594
3763.1F40167594J060784R21190Q38101J064002J461267J317800Q97169O99103Q79466
$$ 640167594 641228378 642149568 642987669 644051671 645512938 646830738 647727907 648427010 649306476
3781.4F49306476R07481Q62300J045168J138031J055241P47204M71353N61655K42293
$$ 649306476 650213957 651076257 652121425 653259456 654314697 655061901 655533254 656094909 656337202
3799.8F56337202J75774J172840J105368Q26419J348257J302302M62353j9908M33564
$$ 656337202 656512976 657685816 658791184 659617603 660965860 662268162 662730515 662710607 663144171
3818.1F63144171L09229N57542J282752J113474R04202P03454N26011N67019J09792
$$ 663144171 663453400 664010942 665293694 666407168 667311370 668014824 668540835 669107854 669217646
3836.5F69217646k06053O16133J221657J245439J155496P85768k18273j384914O8903
$$ 669217646 669011593 669627726 670849383 672094822 673250318 674036086 673817813 672432899 672501802
3854.8F72501802J976252J612842O42657j788K52426O09159K08319K53856P17699R34840
$$ 672501802 674478054 676090896 676733553 676731765 676984191 677593350 677801669 678055525 678773224 679708064
3875.2F79708064Q60393K16186K13802O60777M86374O36577N46396J29461N47230Q12710
$$ 679708064 680568457 680784643 680998445 681659222 682145596 682782173 683328569 683458030 684005260 684817970
3895.6F84817970J89721l19182j56224L08037R19342J101970P13468L75151K21134
$$ 684817970 685007691 684688509 684532285 684840322 685759664 686861634 687575102 687950253 688171387
3914F88171387J8060K7418L26455L60429J93179L01897L85642J50383J33633M35233
$$ 688171387 688189447 688216865 688543320 688903749 689096928 689398825 689784467 689934850 690068483 690503716
3934.4F90503716N07117L46303J22428N1200L12090L45707J35362K76387M58956L35157
$$ 690503716 691010833 691357136 691479564 691530764 691842854 692188561 692323923 692600310 693059266 693394423
3954.8F93394423J81913J63257J89185K88725L84927K71976J18971J31309J89304K18809
$$ 693394423 693576336 693739593 693928778 694217503 694602430 694874406 694993377 695124686 695313990 695532799
3975.2F95532799K86042K55585J37866J25825J25587J14083K11656K90037K22861J21475
$$ 695532799 695818841 696074426 696212292 696338117 696463704 696577787 696789443 697079480 697302341 697423816
3995.6F97423816J13785
$$ 697423816 697537601
3997.6F97537601
$$ 697537601
##END=$$ End of the data block
