##TITLE=$$ Begin of the data block
##JCAMP-DX=5.00 $$ ACD/SpecManager v 10.08
##SPECTROMETER/DATA SYSTEM=Alpha
##DATE=26 Dec 2014 10:25:20
##DATA TYPE=INFRARED SPECTRUM
##DATA CLASS=XYDATA
##ORIGIN=
##OWNER=
##NPOINTS=1765
##FIRSTX=399.76428223
##LASTX=3997.64306641
##MAXX=3997.64306641
##MINX=399.76428223
##MAXY=0.83233571
##MINY=0.24138801
##XFACTOR=1.0000000000
##YFACTOR=1.000000000000000e-9
##FIRSTY=0.53727990
##DELTAX=2.03961372
##XUNITS=1/CM
##YUNITS=ARBITRARY UNITS
##XYDATA=(X++(Y..Y))
399.8E37279904n744577l861904j348018Q47160J630843J428485R86755P63416Q00491
418.1E32782555K08377j358985k900124l609061l192723k490461k358258k762854k579093
436.5E11739373p92861K294600N068541N569577M163623K741694K060593J856267J179337
454.8E35880744j74939j548112k335608k534330k264380k252400k947211l942490m364371
473.2E13516903l200352j451314o01768p75576j145422r87292l28540K06530J51455
491.5E05384624p33554k073586k692134k183795j446008j459360k511472l834605m339278
509.9D84110832l921330l370017l518462m415452n014777m258991k426237n70207M43041
528.3D57058400M42207L07947J233757L634959O215036O915540N310505K727360Q79705
$$ y = [537279904, 531535327, 527673423, 526325405, 527172565, 528803408, 530231893, 531218648, 531982064, 532782555, 532990932, 531631947, 528731823, 525122762, 521930039, 519439578, 517081320, 514318466, 511739373, 510946512, 513241112, 518309653, 523879230, 528042853, 530784547, 532845140, 534701407, 535880744, 535705805, 534157693, 531822085, 529287755, 527023375, 524770975, 521823764, 517881274, 513516903, 510316551, 508865237, 508263469, 507487893, 506342471, 505355179, 505026639, 505233169, 505384624, 504651070, 502577484, 499885350, 497701555, 496255547, 494796187, 492284715, 488450110, 484110832, 480189502, 476819485, 473301023, 468885571, 463870794, 459611803, 457185566, 456615359, 457058400, 457500607, 457808554, 459042311, 462677270, 468892306, 475807846, 481118351, 483845711, 484725416]
546.6D84725416L66419J26988q23349k426266l958405m659324m576981m663885n636901
565D58473712p180363p858097o356448l314823k11924K194941L824263N203933O733090
583.3D51508284P945627P867693O041527L372044J172930K06619K84106N28216K86430
601.7D79213476l64214p30008k29448R68695K081394K432436K133965K081126K928704
620D90516126M183233M959881M707992L536463K379239K081155K496422K793491K261579
638.4E19915581J121402L18348N30302J390458J962244J686394Q27313L25262N99742
656.8E28677046J288951J754045J474798P10070R3639O49869K025724K399623K074302
675.1E41148067J445412J078606J227855J767755J999140J354277J86205o96659r29296
$$ y = [484725416, 485091835, 485218823, 484395474, 481969208, 478010803, 473351479, 468774498, 464110613, 458473712, 451293349, 443435252, 437078804, 433763981, 433552057, 435746998, 439571261, 444775194, 451508284, 459453911, 467321604, 473363131, 476735175, 477908105, 478114724, 478398830, 478927046, 479213476, 478849262, 478119254, 477889806, 478858501, 480939895, 483372331, 485506296, 487587422, 490516126, 494699359, 499659240, 504367232, 507903695, 510282934, 512364089, 514860511, 517654002, 519915581, 521036983, 521355331, 521885633, 523276091, 525238335, 526924729, 527752042, 528077304, 528677046, 529965997, 531720042, 533194840, 533904910, 533998549, 534648418, 536674142, 539073765, 541148067, 542593479, 543672085, 544899940, 546667695, 548666835, 550021112, 550207317, 549510658, 548581362]
693.5E48581362r61900j534998k645493l638267l800571k759159j010776N33879J670778
711.8E34434855K608836L493070M579008N850792O626010O570995O076276N455673
728.1E75695515N077004M917026M380762L266156J999736J073599M28736l76582j615525
746.5E94846427l084063m350007n060315n194127m982829m635513m090905l039957
762.8E60408711j312911J046777L633916N857825P465542Q607745R405494R579956
779.1F04693055Q857846P462681N940675M795135M268586M142940M050613L957987
795.4F48169518M056274M272581M466295M374921L670037K667308J845658J429498
811.8F74952090J352668J173973N32210m11332j351774k101838k685011l439307m480720
$$ y = [548581362, 547619462, 546084464, 543438971, 539800704, 536000133, 533240974, 532230198, 532764077, 534434855, 537043691, 540536761, 545115769, 550966561, 557592571, 564163566, 570239842, 575695515, 580772519, 585689545, 590070307, 593336463, 595336199, 596409798, 596838534, 596461952, 594846427, 591762364, 587412357, 582352042, 577157915, 572175086, 567539573, 563448668, 560408711, 559095800, 560142577, 563776493, 569634318, 577099860, 585707605, 595113099, 604693055, 613550901, 621013582, 626954257, 631749392, 636017978, 640160918, 644211531, 648169518, 652225792, 656498373, 660964668, 665339589, 669009626, 671676934, 673522592, 674952090, 676304758, 677478731, 678010941, 677599609, 676247835, 674145997, 671460986, 668021679, 663540959]
830.1F63540959n545675o229997o259382n755007n132318m747092m620195m386544
846.4F20864749l912389l537298l613174m274129n055309m778445k278089K357662
862.8E95773578P272720J0522783J1972844J2330354J1593222R552658O442726K822935
879.1F68283820p46786l741563n604386o362617o672740o877124o900728o626606o031335
897.4F18719935n457043n393863o049335p222474q409798r266793r828449j0278582
913.7E56813598j0591746j0304808q943618o598830l892600j636327l09765M02212
930.1E14938116J167476K230048L434062M499257N106568M832685L084779k39014m334629
948.4E34719348q296788j1639893j4135837j5802503j6823143j7424255j7923296j8510342
$$ y = [663540959, 657995284, 651765287, 645505905, 639750898, 634618580, 629871488, 625251293, 620864749, 616952360, 613415062, 609801888, 605527759, 600472450, 595694005, 593415916, 595773578, 603046298, 613569081, 625541925, 637872279, 649465501, 659018159, 665460885, 668283820, 667537034, 663795471, 658191085, 651828468, 645155728, 638278604, 631377876, 624751270, 618719935, 613262892, 607869029, 601819694, 594597220, 586187422, 576920629, 567092180, 556813598, 546221852, 535917044, 526973426, 520374596, 516481996, 514845669, 514535904, 514938116, 516105592, 518335640, 521769702, 526268959, 531375527, 536208212, 539292991, 539053977, 534719348, 526422560, 514782667, 500646830, 484844327, 468021184, 450596929, 432673633, 414163291]
964.7D14163291j9104659j9552738j9647955j9244195j8427640j7261803j5659541
979B85264760j3522804j0917246q136600n540490l392771j766846n99995K91020J037538
997.4B42716566J538261J651004J386092Q29607K01851j98722k80738r6738K94819
1015.7B48042002Q69349J533389K211392K891093L473104L757059L681541L432661
1032B69891590L080934K496064J673758R23932N04970M49091P59572J428425K427638
1050.4B83635974L725797N112946O338507P492274Q741349R963065J0348708Q380979
1066.7C43739599L046572m227996r697705j0642559p899999m155249j021057J279950
1083C10421556K970249M211187N122870N776465O069601N832582M965932L575265K045810
$$ y = [414163291, 395058632, 375505894, 355857939, 336613744, 318186104, 300924301, 285264760, 271741956, 260824710, 252688110, 247147620, 243754849, 241988003, 241388008, 241679028, 242716566, 244254827, 245905831, 247291923, 248121530, 248323381, 248124659, 247843921, 247747183, 248042002, 248911351, 250444740, 252656132, 255547225, 259020329, 262777388, 266458929, 269891590, 272972524, 275468588, 277142346, 278066278, 278571248, 279020339, 279779911, 281208336, 283635974, 287361771, 292474717, 298813224, 306305498, 315046847, 325009912, 335358620, 343739599, 346786171, 342558175, 332860470, 322217911, 314317912, 310162663, 309141606, 310421556, 313391805, 317602992, 322725862, 328502327, 334571928, 340404510, 345370442, 348945707, 350991517]
1101.4C50991517R84222Q35299J618028K886653L986359M464060M243880L567517K775252
1119.8C76352787K128810J831233K156556L105074M175663M581690L709197J544893
1136.1C99585903j405955m409492o772041q046478q230180p608532o471485n055756
1152.4C51585984l538847k020448n63711Q53777K431929M301250O370604Q419573J0237456
1170.7C78077567J1710405J2848705J3642341J4027864J4020145J3648092J2904197
1185D70879316J1792690J0307550Q472413O462693M543484L054320K240301K008915
1201.3E19761682K100467K379716K862751L565371M463136N306662N652189N292415
1217.7E51384389M334510L014505J636147M71950m18842j133740j675129j941681j900136
$$ y = [350991517, 351975739, 352811038, 354429066, 357315719, 361302078, 365766138, 370010018, 373577535, 376352787, 378481597, 380312830, 382469386, 385574460, 389750123, 394331813, 398041010, 399585903, 398179948, 393770456, 386998415, 378951937, 370721757, 363113225, 356641740, 351585984, 348047137, 346026689, 345462978, 346316755, 348748684, 353049934, 359420538, 367840111, 378077567, 389787972, 402636677, 416279018, 430306882, 444327027, 457975119, 470879316, 482672006, 492979556, 501451969, 507914662, 512458146, 515512466, 517752767, 519761682, 521862149, 524241865, 527104616, 530669987, 535133123, 540439785, 546091974, 551384389, 555718899, 558733404, 560369551, 560841501, 560422659, 559288919, 557613790, 555672109, 553771973]
1236E53771973j624704j185953o34075m0114O03438J320660J980782K363562K322972
1254.4E58878541J891434J330674R79006R92775J354456J879752K197981K109348J733005
1272.7E73346972J215280O31511M4226m89533q61644r67741q63731p43091q30353j225054
1293.1E69256842j764119k150535k181709j963079j806438j882315k050042j988053
1309.4E53470552j651526j245260j000702j132786j542867k094686k919137l986240
1325.8E37897348m991889n610227n658210n138397m162132k879680j401126j56283
1342.1E07899404L46660L57151K76506J51038o8664m20451q58128j252354j509428
1360.4E04921734j446902q93534n26607n49674l72767L8922O27637J099646J075327
$$ y = [553771973, 552147269, 550961316, 550327241, 550287127, 550890565, 552211225, 554192007, 556555569, 558878541, 560769975, 562100649, 563079655, 564072430, 565426886, 567306638, 569504619, 571613967, 573346972, 574562252, 575193763, 575237989, 574748456, 573886812, 572919071, 572055340, 571312249, 570481896, 569256842, 567492723, 565342188, 563160479, 561197400, 559390962, 557508647, 555458605, 553470552, 551819026, 550573766, 549573064, 548440278, 546897411, 544802725, 541883588, 537897348, 532905459, 527295232, 521637022, 516498625, 512336493, 509456813, 508055687, 507899404, 508246064, 508603215, 508879721, 509030759, 508962095, 508541644, 507683516, 506431162, 504921734, 503474832, 502581298, 502054691, 501505017, 501132250, 501171172, 501798809, 502898455, 503973782]
1378.8E03973782R03964J117647J941204L310025M120588L387034J998365O65486k23399
1397.1E21194696o82294q26180j153767j737893j934588j994848k049029j763105j416445
1415.5E07636547j397610j113534k06172M23908Q74043J192927J369298J610338J652420
1433.9E12042165J800477K374113K426028K129018J688838J052619L63349k14219o93857
1452.2E22968531j221478k396763k421319l5286J175105K145410L699243M737079N943597
1470.6E34594119Q769571J0318220R473026Q549988P965446P572412O694436O032705
1486.9E99969923O204486O508708N449534M474103M532636M554569L996492L120660
1503.2F38811111K449394L039300L718198L148913K495289K005875K062201K106428
$$ y = [503973782, 504877746, 505995393, 507936597, 511246622, 515367210, 518754244, 520752609, 521418095, 521194696, 520512402, 519686222, 518532455, 516794562, 514859974, 512865126, 510816097, 509052992, 507636547, 506238937, 505125403, 504919231, 505343139, 506217182, 507410109, 508779407, 510389745, 512042165, 513842642, 516216755, 518642783, 520771801, 522460639, 523513258, 523876607, 523662388, 522968531, 521747053, 519350290, 516928971, 516893685, 518068790, 520214200, 523913443, 528650522, 534594119, 543363690, 553681910, 563154936, 571704924, 579670370, 587242782, 593937218, 599969923, 606174409, 612683117, 618132651, 622606754, 627139390, 631693959, 635690451, 638811111, 641260505, 644299805, 648018003, 651166916, 653662205, 655668080, 657730281, 659836709]
1519.5F59836709K123774K181530J934468J933277J809418J352608J140416J131594
1535.8F73443794M45485l79681K26676J045227R31382K69831l72470n48839o26326
1554.2F74435079r81390k147138j981974m47989q50021j368881j681983j821339j344204
1572.6F61810160j800776k596438j525283p94410j210571j667559j931190j955808
1588.9F48328125j824080j763344j939059k262532k633035k928198k960205k955258
1605.2F29062414l274977l782213l846943l603459m055440m416406k938688k619862
1621.5F00524426l543020l295779k669632k194047j591206j820803k564132j280606
1637.8E81565201K30074N81145M79460L40939J095176J651465J751721L309548L901243
$$ y = [659836709, 661960483, 664142013, 666076481, 668009758, 669819176, 671171784, 672312200, 673443794, 673889279, 673509598, 673736274, 674781501, 675712883, 675982714, 675610244, 675061405, 674435079, 673453689, 671306551, 669324577, 668876588, 668026567, 666657686, 664975703, 663154364, 661810160, 660009384, 657412946, 655887663, 655093253, 653882682, 652215123, 650283933, 648328125, 646504045, 644740701, 642801642, 640539110, 637906075, 634977877, 632017672, 629062414, 625787437, 622005224, 618158281, 614554822, 610499382, 606082976, 603144288, 600524426, 596981406, 593685627, 591015995, 588821948, 587230742, 585409939, 582845807, 581565201, 581795275, 582376420, 582855880, 583196819, 584291995, 585943460, 587695181, 591004729, 594905972]
1656.2E94905972L298104L056407L428221M159033M081786M210472M975677M721760
1672.5F26837432M695535N356968N218982M713416M703343O114006O028712N134761
1688.8F68803155N283714M719198M182279L978371L644407M223883M019618L469706
1705.1G02324331L339767K694130K013862J617909J489639J983047K423465J893639
1721.5G19779789J406610J586736J879036J965165J653374J354157J826585J997173
1737.8G33448625K093970K411485K393723K062797J815081K322197L348231L346980
1754.1G53243089K778053K341747J892329J950860K305924K152622J684427J098633
1770.4G69447684R23217J540124J856566J671075J401604J066088P66039Q32319R61245
$$ y = [594905972, 598204076, 601260483, 604688704, 608847737, 612929523, 617139995, 622115672, 626837432, 631532967, 636889935, 642108917, 646822333, 651525676, 657639682, 663668394, 668803155, 674086869, 678806067, 682988346, 686966717, 690611124, 694835007, 698854625, 702324331, 705664098, 708358228, 710372090, 711989999, 713479638, 715462685, 717886150, 719779789, 721186399, 722773135, 724652171, 726617336, 728270710, 729624867, 731451452, 733448625, 735542595, 737954080, 740347803, 742410600, 744225681, 746547878, 749896109, 753243089, 756021142, 758362889, 760255218, 762206078, 764512002, 766664624, 768349051, 769447684, 770370901, 771911025, 773767591, 775438666, 776840270, 777906358, 778672397, 779504716, 780465961]
1788.8G80465961R08911J101315J123130P54476N77807R41813J479626J392483P82073
1807.1G89527595K87950M22895R81569J218081R99927O69241L54708K09510M83215
1825.5G95154691P44641O70254O46174N17249L34799N38170P48158M07219j18971J9789
1845.9G99662173M69982O79076P12097M90904J29580j02699L6180L53218M24027P2360
1866.3H02926898k40982J07229N68271O76751O67453N42760K47478M4227J57714L84152
1886.7H06081951M75824N05447L17156L7492J53601M58181N35309L06427n4419k49266
1907.1H08567703o9738L61085N27442J92523k46287k26438P2837L92556O20664M06146
1927.5H10598493o736j55627K0146L08514M31776J65879k49147k06173K15412M99487
$$ y = [780465961, 781374872, 782476187, 783599317, 784353793, 784931600, 785873413, 787353039, 788745522, 789527595, 789815545, 790238440, 791220009, 792438090, 793438017, 794107258, 794461966, 794671476, 795154691, 795899332, 796569586, 797215760, 797733009, 798067808, 798605978, 799354136, 799761355, 799642384, 799662173, 800132155, 800811231, 801523328, 802014232, 802143812, 802041113, 802077293, 802430511, 802854538, 802926898, 802685916, 802793145, 803361416, 804038167, 804705620, 805248380, 805495858, 805540085, 805697799, 806081951, 806557775, 807063222, 807380378, 807417870, 807571471, 808029652, 808564961, 808871388, 808816969, 808567703, 808497965, 808859050, 809386492, 809579015, 809332728, 809106290, 809179127, 809571683, 810192347, 810598493, 810591757, 810436130, 810456276, 810764790, 811196566, 811362445, 811113298, 810907125, 811122537, 811622024]
1947.9H11622024N23567L00586J6272p7307J11520M35412N20825K11657j61350j55628
1968.3H13347578J64270M30465M79281K59519p0811j90198N901K89798L55899P0810
1988.7H15142512l08096k89977J15455M05013L73185P6055k99215m55916k49863J09792
2009H14618945J95980j45256o34075p77483m54962j43468k30849n25117n91159m58359
2029.4H10854197k67446o0797m9949l10898o43134p11202l88802J8955J26481j15574
2049.8H08451831l97920l92199r6023K35796L46363J39475k00332l00347q524L55005
2070.2H08133125M29333J67727k04980l43681p7665L47555M95970K26736j67250k57015
2090.6H08749855L5584L87668M89473K90275m7564j90854N1379M23610N24104K33054
$$ y = [811622024, 812145591, 812446177, 812462449, 812385142, 812496662, 812932074, 813452899, 813664556, 813503206, 813347578, 813511848, 813942313, 814421594, 814681113, 814610302, 814420104, 814426005, 814715803, 815071702, 815142512, 814834416, 814544439, 814659894, 815064907, 815438092, 815514147, 815214932, 814759016, 814509153, 814618945, 814814925, 814669669, 814035594, 813258111, 812803149, 812659681, 812428832, 811903715, 811312556, 810854197, 810586751, 810525954, 810476005, 810165107, 809521973, 808810771, 808421969, 808440924, 808567405, 808451831, 808053911, 807661712, 807565689, 807801485, 808147848, 808287323, 808086991, 807786644, 807778120, 808133125, 808562458, 808730185, 808525205, 808181524, 808103859, 808451414, 808947384, 809174120, 809006870, 808749855, 808785439, 809173107, 809662580, 809952855, 809905291, 809714437, 809765816, 810189426, 810713530, 810946584]
2111H10946584j55390k57372M410L35515M07696J50203k29656l50237o3658L04759
2131.4H11092854L68833J22488j98663l06010o7532K93970M31955K02894j64270k62916
2151.8H11513603J3470L76106N06043L24249L9816l9994J99019N68152P69377O09815
2172.2H14879656K48790J38878M14372P59602Q06927N27144K12431J28328L39687O41227
2192.6H19097042P33674N10990J69099L3199K58506O42717P72714M99964J55926J18077
2213H22991908L73840O63519P15434M41075O1393n2333K10941N55515O28710L65674
2233.4H26955676O795j22011J15633M59135N44846K92003n1796j35482J04964M16398
2253.8H28586161N25415L24607l8803j86383O3300M56989O06536L50655n8115k02179
$$ y = [810946584, 810791194, 810533822, 810538232, 810873747, 811281443, 811431646, 811201990, 810851753, 810788095, 811092854, 811461687, 811584175, 811385512, 811079502, 811011970, 811305940, 811737895, 811940789, 811776519, 811513603, 811527073, 811903179, 812409222, 812733471, 812773287, 812733293, 812932312, 813500464, 814269841, 814879656, 815128446, 815267324, 815681696, 816441298, 817248225, 817775369, 817987800, 818116128, 818455815, 819097042, 819830716, 820341706, 820510805, 820544004, 820802510, 821445227, 822217941, 822717905, 822873831, 822991908, 823365748, 824029267, 824744701, 825185776, 825247169, 825194836, 825405777, 825961292, 826590002, 826955676, 826962471, 826840460, 826956093, 827415228, 827960074, 828252077, 828200281, 828064799, 828169763, 828586161, 829111576, 829436183, 829397380, 829210997, 829274297, 829731286, 830337822, 830688477, 830630362, 830428183]
2274.2H30428183Q1778N22554O34372K70903j61886k41578J9431L31283L78728P1943
2294.6H32335711k79606l50952j46031J44958K05636j19924n34654n69701j61588J84655
2315H30708504R6261l00884o76930o68406k91765K2471L3319k08378m70758n37276
2335.4H27706158l58283n961J67310n3584j34885Q7738K6583k67148m97818p42733
2355.8H25927377q94726o72638k16663K61843M68612L16262R2626J33991M38392P06375
2376.2H26561451P44164N13315J40608p6890L3259K80619K74658r2566n11825o01232
2396.6H27265561l10898K2590N8830k33948n84841o85036m60864j47819q3864l59535
2417H24480176p40230q56578n72801k00570j47223m66347q74519r93371o96719k94924
$$ y = [830428183, 830509961, 831032515, 831666887, 831937790, 831775904, 831534326, 831553757, 831885040, 832263768, 832335711, 832056105, 831705153, 831559122, 831704080, 831909716, 831789792, 831255138, 830685437, 830523849, 830708504, 830804765, 830503881, 829826951, 829158545, 828866780, 828889251, 828922570, 828714192, 828243434, 827706158, 827347875, 827341914, 827509224, 827455640, 827320755, 827408493, 827435076, 827167928, 826670110, 825927377, 825032651, 824360013, 824143350, 824405193, 824873805, 825190067, 825282693, 825416684, 825855076, 826561451, 827305615, 827818930, 827959538, 827882648, 827915907, 828196526, 828471184, 828378618, 827866793, 827265561, 826954663, 826977253, 827036083, 826802135, 826217294, 825532258, 825071394, 824923575, 824839711, 824480176, 823739946, 822883368, 822310567, 822109997, 821962774, 821496427, 820621908, 819628537, 818931818, 818636894]
2437.4H18636894k06470n15700q92698r83000p17938l23773k06112m93110q47041r28283
2457.8H12522769o93262l59177k30611m10556p20621q78989o96600l28421j92285m10497
2478.1H07601750p35760q51810o20305k40207m9293k45214o21259p62105n49614j64271
2498.5H02761912M7386j32501m80592o49274m99665j55092J133k27988n67496p06315
2518.9G99391508n60760k62797j44959l53277o90340q86620p59601m52638l34620n34058
2539.3G94411838q59261j003563q12173m75466l20077m69983p83503r46879p88927
2557.7G87952006n09858l80934m99963p70629r20057p75993m85003l46899m93288p51674
2578.1G82017708q39174o63340m20213l36647m26471o04808p22945o05881l21329j44541
$$ y = [818636894, 818430424, 817914724, 817022026, 816039026, 815321088, 814997315, 814791203, 814298093, 813451052, 812522769, 811829507, 811470330, 811239719, 810829163, 810108542, 809229553, 808532953, 808204532, 808012247, 807601750, 806865990, 806014180, 805393875, 805153668, 805104375, 804859161, 804237902, 803475797, 802926183, 802761912, 802809298, 802676797, 802196205, 801546931, 801047266, 800892174, 800893307, 800665319, 800097823, 799391508, 798830748, 798567951, 798422992, 798069715, 797379375, 796492755, 795733154, 795280516, 794945896, 794411838, 793552577, 792549014, 791736841, 791261375, 790941298, 790471315, 789687812, 788740933, 787952006, 787442148, 787061214, 786561251, 785790622, 784870565, 784094572, 783609569, 783262670, 782769382, 782017708, 781178534, 780515194, 780094981, 779758334, 779331863, 778727055, 778004110, 777398229, 777076900, 776932359]
2598.5G76932359k35737n15103p31409p06255n36442m39167n68449q54612j052439
2616.8G71292746j039028q69095p32780q56578j169622j341641j256705j066267r63867
2635.2G61997163j050472j264691j424849j360476j141072j004100j057326j234830
2651.5G52459347j346528j262844j076758r72867j041412j185537j255393j182138
2667.8G43135870r92656q48174q96275j056791j104951j004874q74460p75039q23498
2686.2G34759152j010656j095891j016856r12189q72851r67264j154244j268565j202524
2704.5G25258112j040041r95696j097322j207172j245440j171171j014590q97944r24826
2722.9G15663910j029968j042068r34542p90238o93738p12753q14736r04143q81016
$$ y = [776932359, 776696622, 776181519, 775450110, 774743855, 774207413, 773768246, 773199797, 772345185, 771292746, 770253718, 769384623, 768651843, 767795265, 766625643, 765284002, 764027297, 762961030, 761997163, 760946691, 759682000, 758257151, 756896675, 755755603, 754751503, 753694177, 752459347, 751112819, 749849975, 748773217, 747800350, 746758938, 745573401, 744318008, 743135870, 742143214, 741295040, 740398765, 739341974, 738237023, 737232149, 736357689, 735582650, 734759152, 733748496, 732652605, 731635749, 730723560, 729850709, 728883445, 727729201, 726460636, 725258112, 724218071, 723222375, 722125053, 720917881, 719672441, 718501270, 717486680, 716588736, 715663910, 714633942, 713591874, 712657332, 711867094, 711173356, 710460603, 709645867, 708741724, 707860708]
2741.2G07860708p49409o78241p29978p97868q22365p58827o03080n05626n63741o61492
2761.6G00990081o84381o32822n62430n73933o84500q11278q86798q87335q51571q54194
2782F93560839r81629j172066j244008j215041j227558j311183j416862j538157j665354
2800.4F81788981j689911j637936j664698j784682j950741k076924k088844k074600
2816.7F66820645k126813k242267k373516k470732k507150k491653k518475k653063
2833F47436976k815902k946079l053963l159165l329039l557145l761411l836930l612995
2851.4F17364347l182650k902329k877354l018618l301859l680706m134655m641294
2867.7E89624882n064011n327880n484641n521357n338073m918813m318059l611803
$$ y = [707860708, 707111299, 706433058, 705703080, 704905212, 704082847, 703324020, 702720940, 702215314, 701651573, 700990081, 700305700, 699672878, 699110448, 698536515, 697852015, 697040737, 696153939, 695266604, 694415033, 693560839, 692579210, 691407144, 690163136, 688948095, 687720537, 686409354, 684992492, 683454335, 681788981, 680099070, 678461134, 676796436, 675011754, 673061013, 670984089, 668895245, 666820645, 664693832, 662451565, 660078049, 657607317, 655100167, 652608514, 650090039, 647436976, 644621074, 641674995, 638621032, 635461867, 632132828, 628575683, 624814272, 620977342, 617364347, 614181697, 611279368, 608402014, 605383396, 602081537, 598400831, 594266176, 589624882, 584560871, 579232991, 573748350, 568226993, 562888920, 557970107, 553652048, 550040245]
2884E50040245k881288k140642j449287r59158p06493o09160o43432p43091q41737
2902.4E39065957j017868j328707j730144k178133k649545l086389l428638l648102
2918.7E19998431l681659l437520k941906k255499j396239m46677N95808J768589K934694
2937E11138022L949881M734575N216956N461336N617261N781889N953967N981863N834281
2955.4E59670031N680978N564690N423605N160213M739523M316747L980756L771007
2971.7E98307550L721535L716290L675044L527939L211439K875745K647400K435863
2988F24118805K178252J863956J488626J167536R27210O79493M10497P6830l02553
3006.4F32608652n76794p15494q89421j213908j564383j775980j864672j929402k037228
$$ y = [550040245, 547158957, 545018315, 543569028, 542609870, 541903377, 541294217, 540650785, 539907694, 539065957, 538048089, 536719382, 534989238, 532811105, 530161560, 527075171, 523646533, 519998431, 516316772, 512879252, 509937346, 507681847, 506285608, 505838931, 506434739, 508203328, 511138022, 515087903, 519822478, 525039434, 530500770, 536118031, 541899920, 547853887, 553835750, 559670031, 565351009, 570915699, 576339304, 581499517, 586239040, 590555787, 594536543, 598307550, 602029085, 605745375, 609420419, 612948358, 616159797, 619035542, 621682942, 624118805, 626297057, 628161013, 629649639, 630817175, 631744385, 632423878, 632834375, 632911205, 632608652, 632031858, 631316364, 630426943, 629213035, 627648652, 625872672, 624008000, 622078598, 620041370]
3024.7F20041370k166330k257050k330243k382636k458453k561748k552569k541125
3041.1F00791216k686024k859235k902746k780497k681613k800405k983928l051936
3057.4E78044832k979875k793550k681435k742111k888143l046453l034294k820194
3073.7E55058777k644062k672016k876103k986670k895117k821087k829493k878904
3090E32455325k979934l022492k890527k681673k661526k826929k849996k676368k580523
3108.4E07285357k675832k672851k505511k524435k699227k814501k846062k758473
3124.7D85788465k610803k540469k596915k633423k465367k243578k266348k510696
3141D65920866k623201k496660k348452k204836k112836k253204k468109k439350k255589
$$ y = [620041370, 617875040, 615617990, 613287747, 610905111, 608446658, 605884910, 603332341, 600791216, 598105192, 595245957, 592343211, 589562714, 586881101, 584080696, 581096768, 578044832, 575064957, 572271407, 569589972, 566847861, 563959718, 560913265, 557878971, 555058777, 552414715, 549742699, 546866596, 543879926, 540984809, 538163722, 535334229, 532455325, 529475391, 526452899, 523562372, 520880699, 518219173, 515392244, 512542248, 509865880, 507285357, 504609525, 501936674, 499431163, 496906728, 494207501, 491393000, 488546938, 485788465, 483177662, 480637193, 478040278, 475406855, 472941488, 470697910, 468431562, 465920866, 463297665, 460801005, 458452553, 456247717, 454134881, 451881677, 449413568, 446974218, 444718629]
3159.4D44718629k147853k131433k153188k156704k112866k035260j967400j953840
3175.7D28060085j964808j949131j933694j889825j775086j701653j769543j860201
3192D13216144j835466j774191j724482j631469j556813j551241j546293j555831j561582
3210.3C98478776j483440j422376j428753j439094j414180j319200j234740j266003
3226.7C87470990j302450j183749j075774j201511j341670j292289j191765j111149
3243C77770633j027883j016110j093745j105309j011341r28820r31888r68486r34899
3261.3C68752152q52317q02725p34747o22511o98894r10461r83268r62019q79675p55370
3281.7C60550165o90967o80327o75142o33627o16431o93471p93427q65698q46952o82860
$$ y = [444718629, 442570776, 440439343, 438286155, 436129451, 434016585, 431981325, 430013925, 428060085, 426095277, 424146146, 422212452, 420322627, 418547541, 416845888, 415076345, 413216144, 411380678, 409606487, 407882005, 406250536, 404693723, 403142482, 401596189, 400040358, 398478776, 396995336, 395572960, 394144207, 392705113, 391290933, 389971733, 388736993, 387470990, 386168540, 384984791, 383909017, 382707506, 381365836, 380073547, 378881782, 377770633, 376742750, 375726640, 374632895, 373527586, 372516245, 371587425, 370655537, 369687051, 368752152, 367899835, 367097110, 366362363, 365739852, 365040958, 364130497, 363147229, 362185210, 361305535, 360550165, 359859198, 359178871, 358503729, 357870102, 357253671, 356560200, 355766773, 354901075, 354054123, 353371263]
3302.1C53371263n02527n34833q11129j072407j128048j026541r10103q41618q02278
3320.5C45741779p82669p97093r19402j036942r90986r10044p95335o56217p66069
3338.8C38087022r96023j039475j043797j004666q22365q50260j109779j181782r98228
3357.2C29040647q36760q67129q66353o63102n77658q41916j178980j174956r17614
3375.5C21116179p99060q19146q54671q25554o40154l21031j04576l18051p32660p35730
3395.9C14965546k86251l5823m11212q25882o30528k79307k20567k62618l51727m33564
3416.3C11228067l67076k55912j41114L8803J96278K45481J70380K20508L86446K09719
3436.7C11931580j48832j44959J25825K81603L21805L94464M53114M37498M86255O59883
$$ y = [353371263, 352868736, 352333903, 351522774, 350450367, 349322319, 348295778, 347385675, 346544057, 345741779, 344959110, 344162017, 343242615, 342205673, 341214687, 340304643, 339509308, 338853091, 338087022, 337090999, 336051524, 335007727, 334003061, 333180696, 332330436, 331220657, 330038875, 329040647, 328203887, 327336758, 326470405, 325807303, 325229645, 324387729, 323208749, 322033793, 321116179, 320317119, 319497973, 318643302, 317817748, 317177594, 316856563, 316751987, 316433936, 315701276, 314965546, 314679295, 314643472, 314232260, 313406378, 312775850, 312496543, 312275976, 312013358, 311661631, 311228067, 310860991, 310605079, 310463965, 310502768, 310699046, 310944527, 311114907, 311335415, 311721861, 311931580, 311782748, 311637789, 311763614, 312045217, 312367022, 312761486, 313214600, 313652098, 314138353, 314798236]
3457.1C14798236P88391O72280O38336R58860J094163P42107L32892L23713O41763
3475.5C20990741R73881R29325N88209O30647R19878Q91924Q13067R32515R85741R93431
3495.9C29649359J022369J014948R38504P83176P35521Q23438J012624J301735J277685
3514.2C38559359R60797R00925J082956J246453J151651Q61347Q60810J188427J444519
3532.6C48257244J544207J459151J288295J391620J546144J399100J193225J321882
3548.9C59400868J467020J494080J705318J934290J992017J972407J837701J590997
3565.2C73394698J926005K763480K893179K617479K601981K720803K897203L115058
3581.5C94929886L085494K708763K631157L311575L513873L248035L384352L710985
$$ y = [314798236, 315586627, 316258907, 316897243, 317856103, 318950266, 319692373, 320025265, 320348978, 320990741, 321964622, 322893947, 323482156, 324112803, 325032681, 325924605, 326737672, 327670187, 328655928, 329649359, 330671728, 331686676, 332625180, 333408356, 334143877, 334967315, 335979939, 337281674, 338559359, 339520156, 340421081, 341504037, 342750490, 343902141, 344763488, 345624298, 346812725, 348257244, 349801451, 351260602, 352548897, 353940517, 355486661, 356885761, 358078986, 359400868, 360867888, 362361968, 364067286, 366001576, 367993593, 369966000, 371803701, 373394698, 375320703, 378084183, 380977362, 383594841, 386196822, 388917625, 391814828, 394929886, 398015380, 400724143, 403355300, 406666875, 410180748, 413428783, 416813135, 420524120]
3597.9D20524120L727317L733486L714174L384143L330291L719121L920525M014701
3614.2D50067878L910869L725588M218996M502505M023820L242314L008604M226804
3630.5D80927378M754126M434228M185170M009843L966510L957510L645122L086746
3646.8E12966633L261685M485727M657745L978848M017413M304171L913819L522277
3663.1E45108318L419638K980351K515972L070295L031850K392709L264606L914237
3679.4E69697976L629744L310025K906144K269804J833379K424717K985895K788961
3695.8E91846645K332151J857996J710772K164066K285242J714766J080394J406074
3712.1F06398106K461791K476096J820743J330495J201153J280844J512408J851797
$$ y = [420524120, 424251437, 427984923, 431699097, 435083240, 438413531, 442132652, 446053177, 450067878, 453978747, 457704335, 461923331, 466425836, 470449656, 473691970, 476700574, 480927378, 485681504, 490115732, 494300902, 498310745, 502277255, 506234765, 509879887, 512966633, 516228318, 520714045, 525371790, 529350638, 533368051, 537672222, 541586041, 545108318, 548527956, 551508307, 554024279, 557094574, 560126424, 562519133, 565783739, 569697976, 573327720, 576637745, 579543889, 581813693, 583647072, 586071789, 589057684, 591846645, 594178796, 596036792, 597747564, 599911630, 602196872, 603911638, 604992032, 606398106, 608859897, 611335993, 613156736, 614487231, 615688384, 616969228, 618481636, 620333433]
3728.4F20333433J626611R03904O18875J460433K294064J913607N29587o6995J249432
3746.7F30862951J197219M23908J499057K290905J652062J086592J393557J449883
3763.1F41856134J010179R17316R63449J125455J393497J259804Q87930O96242Q85547
3781.4F50995553R25898Q84473J084328J194835J103639P33853L88205N02467K39790
3799.8F58053041J52409J120686J064479Q22723J347959J289189N02765N6923M95613
3818.1F64905787L29315N00262J231909J076579R11534P85708N50330M95434P8380
3836.5F70865238j48952O36995J218318J262963J131714P62045k29716j476825R954
3854.8F74031734K053977J730740P45534O080J51158N10811J58429K37823P68542J058519
$$ y = [620333433, 621960044, 622863948, 623482823, 624943256, 627237320, 629150927, 629680514, 629613519, 630862951, 632060170, 632484078, 633983135, 636274040, 637926102, 639012694, 640406251, 641856134, 642866313, 643783629, 644747078, 645872533, 647266030, 648525834, 649413764, 650110006, 650995553, 651921451, 652805924, 653890252, 655085087, 656188726, 656922579, 657310784, 657813251, 658053041, 658205450, 659326136, 660390615, 661213338, 662561297, 663850486, 664353251, 664410174, 664905787, 665235102, 665735364, 666967273, 668043852, 668955386, 669741094, 670291424, 670786858, 670865238, 670716286, 671353281, 672571599, 673834562, 674966276, 675728321, 675498605, 674021780, 674031734, 676085711, 677816451, 678561985, 678568065, 678719223, 679230034, 679388463, 679626286, 680394828, 681453347]
3875.2F81453347R50933K19404J65463O01649M71354O50882N13494Q4639N90026Q98183
3895.6F86599374K24471l48449k12610K50221Q81195J090526P21634M16517K50220
3914F89873099J6570N1082L29852L11494J39474K51770L30151J29878K25365N99087
3934.4F92257822N71668K85327N3704J4663K85864L11672J12415L04162N10633L95775
3954.8F95103705K21908J51753K10584L76105L98815J62959K1457J10269K16961K72632
3975.2F97247148L14056K67387J88529J50860Q7917J25944K66969K86758J93298J41502
3995.6F99270368J40786
3997.6F99411154
$$ y = [681453347, 682404280, 682623684, 682789147, 683390796, 683862150, 684513032, 685026526, 685111165, 685701191, 686599374, 686823845, 686475396, 686262786, 686513007, 687394202, 688484728, 689206362, 689622879, 689873099, 689889669, 689940751, 690270603, 690582097, 690721571, 690973341, 691303492, 691433370, 691658735, 692257822, 692829490, 693114817, 693168521, 693183184, 693469048, 693780720, 693893135, 694197297, 694707930, 695103705, 695325613, 695477366, 695687950, 696064055, 696462870, 696625829, 696647286, 696757555, 696974516, 697247148, 697561204, 697828591, 698017120, 698167980, 698255897, 698381841, 698648810, 698935568, 699128866, 699270368, 699411154]
##END=$$ End of the data block
