##TITLE=$$ Begin of the data block
##JCAMP-DX=5.00 $$ ACD/SpecManager v 10.08
##SPECTROMETER/DATA SYSTEM=Alpha
##DATE=26 Dec 2014 10:25:20
##DATA TYPE=INFRARED SPECTRUM
##DATA CLASS=XYDATA
##ORIGIN=
##OWNER=
##NPOINTS=1765
##FIRSTX=399.76428223
##LASTX=3997.64306641
##MAXX=3997.64306641
##MINX=399.76428223
##MAXY=0.83393222
##MINY=0.24144059
##XFACTOR=1.0000000000
##YFACTOR=1.000000000000000e-9
##FIRSTY=0.53686041
##DELTAX=2.03961372
##XUNITS=1/CM
##YUNITS=ARBITRARY UNITS
##XYDATA=(X++(Y..Y))
399.8 536860406 531348288 527319372 525456905 525825620 527330935 529033184 530691624 531840682 531962991
418.1 531962991 531190753 529703021 527162015 524240851 521698177 519305050 516766846 513850570 511160970
436.5 511160970 510466456 512951076 518127918 523639500 527532399 530115843 532175004 533999503 535412908
454.8 535412908 535797775 534521461 532031715 529326141 526874781 524418831 521363437 517411590 513216972
473.2 513216972 510147810 508605838 507964611 507226169 506058335 505132854 504966140 505339980 505589545
491.5 505589545 504896700 502895176 500203431 497924596 496424437 494918823 492214233 488187164 483888537
509.9 483888537 480122507 476904958 473494947 469108403 464216113 460099250 457566708 456826985 457215697
528.3 457215697 457548350 457763016 459140003 463056087 469436318 476339787 481563926 484254330 485099137
546.6 485099137 485332757 485310197 484433442 482090205 478256524 473688424 469230413 464645237 458950877
565 458950877 451732695 443896919 437413812 433896363 433672100 436035097 440047085 445356488 452045381
583.3 452045381 459889621 467686504 473667353 477015913 478223294 478557706 479028344 479645640 479849130
601.7 479849130 479293674 478398323 478170782 479291558 481522769 483981222 486026376 488070637 491070867
620 491070867 495315194 500283360 504990995 508538902 510922730 513021886 515622795 518521965 520702004
638.4 520702004 521619737 521848857 522488356 524067223 526174605 527901053 528668404 528892457 529475808
656.8 529475808 530920446 532813787 534300327 534952402 534913898 535529256 537652075 540070117 542086840
675.1 542086840 543454945 544537961 545898914 547770083 549716294 550944567 551075935 550417900 549532890
693.5 549532890 548597574 547091663 544443369 540799737 537026227 534274280 533264995 533829272 535474479
711.8 535474479 537991822 541499436 546211004 552171111 558866501 565449059 571480513 576953590
728.1 576953590 582115293 587067962 591430306 594700217 596743464 597830415 598221540 597814858 596124053
746.5 596124053 592874944 588393867 583313406 578146577 573172152 568553865 564482808 561393082
762.8 561393082 560018539 561055422 564714015 570607543 578096449 586758792 596209705 605734944
779.1 605734944 614534497 622018397 628009796 632866085 637182176 641332746 645404696 649414241
795.4 649414241 653481841 657715857 662146986 666483700 670087397 672697484 674511909 675888002
811.8 675888002 677159131 678303659 678915083 678575993 677209377 675119936 672451913 668928683 664325595
830.1 664325595 658701658 652445316 646173656 640382469 635187328 630377054 625747740 621410966
846.4 621410966 617547154 614019334 610405326 606147826 601061702 596180439 593879938 596369803
862.8 596369803 603742301 614224672 626120687 638386667 649910927 659415483 665848196 668621778
879.1 668621778 667754829 663923323 658283889 651888669 645205975 638343394 631461501 624870300 618850529
897.4 618850529 613369942 607950568 601851106 594552338 586086214 576820552 567027867 556782484
913.7 556782484 546225786 535924375 526943684 520340741 516520917 514952183 514599085 514925361
930.1 514925361 516085327 518327832 521750689 526244879 531368792 536196232 539241254 538973570 534614921
948.4 534614921 526288092 514643788 500487506 484606624 467712581 450269401 432370991 413898349
964.7 413898349 394806206 375260442 355614126 336357325 317948103 300724685 285107732
979 285107732 271649778 260777771 252667934 247159392 243762687 241985902 241440594 241816550 242875531
997.4 242875531 244372159 245984614 247344226 248171046 248402059 248196021 247873873 247790247 248128012
1015.7 248128012 248997778 250506431 252700418 255571961 259030014 262798011 266503304 269956082
1032 269956082 273018569 275445938 277065724 277982503 278514475 279011756 279801756 281253994 283716142
1050.4 283716142 287423134 292476803 298800021 306309909 315040380 324959785 335239828 343530387
1066.7 343530387 346536547 342382908 332828045 322294414 314446777 310315520 309267253 310483336
1083 310483336 313424289 317652255 322788298 328537405 334555715 340367496 345362097 348983496 351083189
1101.4 351083189 352126509 352984220 354592562 357477158 361425668 365799636 369998515 373612136
1117.7 373612136 376426637 378509730 380302280 382494628 385635316 389786690 394304454 397972018
1134 397972018 399514467 398108184 393703163 386968195 378973603 370788038 363206208 356735975 351689845
1152.4 351689845 348171771 346144378 345570028 346456319 348945737 353268206 359596878 367955893 378171772
1170.7 378171772 389903367 402746618 416308641 430265725 444288850 457959294 470869571
1185 470869571 482663989 492969036 501424193 507871568 512424767 515495002 517741859 519760787
1201.3 519760787 521869481 524242640 527093410 530652940 535107255 540403247 546068311 551384032
1217.7 551384032 555698156 558651805 560255885 560742795 560355246 559257805 557610452 555679202 553799212
1236 553799212 552217245 551050425 550395906 550351262 550988793 552330792 554289281 556629360 558958352
1254.4 558958352 560882330 562252820 563247919 564239621 565578759 567423820 569595695 571702778 573438764
1272.7 573438764 574660301 575334787 575426280 574939191 574057817 573072612 572216570 571501613 570698261 569494307
1293.1 569494307 567735970 565599799 563444018 561482489 559661508 557771623 555725694 553747118
1309.4 553747118 552103519 550857723 549833357 548664331 547109962 545039415 542145073 538167477
1325.8 538167477 533212245 527658403 522009313 516859233 512710333 509832680 508400321 508210957
1342.1 508210957 508539677 508904099 509196341 509330451 509222746 508780122 507931650 506692708 505177975
1360.4 505177975 503728807 502849281 502332926 501783967 501412988 501444519 502054274 503135741 504191875
1378.8 504191875 505088687 506215632 508163869 511454999 515522301 518850982 520802021 521403313 521139920
1397.1 521139920 520504594 519745648 518621385 516892374 514970958 512996554 510966241 509233296 507845104
1415.5 507845104 506443679 505321920 505123854 505565286 506463885 507669687 509040892 510654569 512306988
1433.9 512306988 514086306 516442895 518881261 521027744 522740424 523801923 524137259 523909748 523225427
1452.2 523225427 521989703 519580126 517214537 517206967 518343031 520445168 524127424 528847337 534765124
1470.6 534765124 543509364 553823888 563304126 571862340 579848230 587437689 594126105 600138903
1486.9 600138903 606332064 612840772 618286431 622767270 627346754 631950974 635953963 639050066
1503.2 639050066 641457140 644488931 648247957 651410699 653883636 655841231 657884181 660042405
1519.5 660042405 662224412 664427698 666377604 668350756 670225501 671616912 672747791 673861682
1535.8 673861682 674280941 673858941 674114704 675249219 676246166 676529825 676130116 675547957 674904108
1554.2 674904108 673893213 671709716 669788063 669412911 668590426 667212784 665498316 663654804 662298083
1572.6 662298083 660482585 657912910 656445801 655657232 654406846 652721941 650811613 648870885
1588.9 648870885 647042453 645286500 643356740 641085207 638456047 635540724 632575452 629628599
1605.2 629628599 626399457 622655332 618814170 615208089 611162841 606776953 603837550 601183593
1621.5 601183593 597656488 594441593 591826677 589643359 588044345 586199760 583660066 582486928
1637.8 582486928 582799792 583411872 583895147 584251165 585398555 587099910 588864982 592167258 596098006
1656.2 596098006 599435806 602512777 605970085 610175848 614260137 618442953 623395622 628090262
1672.5 628090262 632783890 638152122 643351495 648037255 652702868 658758104 664782763 669968843
1688.8 669968843 675283551 679954886 684047937 687996387 691648960 695849419 699849188 703306794
1705.1 703306794 706648409 709330499 711297393 712905824 714454651 716482043 718876123 720720410
1721.5 720720410 722096801 723692715 725606143 727576554 729174078 730441332 732240677 734275341
1737.8 734275341 736405492 738826513 741225958 743266761 745027244 747336388 750697732 754032135
1754.1 754032135 756810963 759172738 761065483 763005197 765315890 767491400 769183457 770223260
1770.4 770223260 771093965 772675455 774584472 776271701 777660012 778709888 779481351 780337036 781333327
1788.8 781333327 782257318 783333838 784448028 785217941 785822690 786804855 788277447 789598882 790336251
1807.1 790336251 790645480 791106462 792113543 793352723 794359267 794998050 795305133 795495689 796007156
1825.5 796007156 796780288 797419846 798031628 798583567 798982561 799558401 800304592 800676882 800497174 800471604
1845.9 800471604 800950289 801671922 802414358 802904367 803023934 802910984 802920818 803267598 803732693 803837895
1866.3 803837895 803583264 803676426 804263771 804963231 805624664 806124806 806328893 806364477 806534171 806938529
1886.7 806938529 807455838 808004856 808333814 808361351 808509469 808967888 809487343 809787035 809758902 809531450
1907.1 809531450 809471011 809840679 810370147 810555577 810289383 810031474 810084820 810479581 811110258 811530113
1927.5 811530113 811545193 811415970 811474383 811827838 812250674 812356770 812061191 811824620 812045336 812598348
1947.9 812598348 813173234 813492239 813487232 813384414 813518643 813984513 814515471 814736485 814553320 814369202
1968.3 814369202 814557374 815035284 815513372 815723896 815631509 815447211 815473914 815814972 816198468 816248655
1988.7 816248655 815922797 815635979 815757811 816160500 816515326 816595495 816342115 815931797 815703034 815801740
2009 815801740 815960586 815772355 815114558 814347208 813912451 813778698 813568592 813077629 812499464 812043428
2029.4 812043428 811793625 811757624 811712265 811370790 810706794 810010552 809640467 809674621 809810460 809686899
2049.8 809686899 809269428 808865368 808804929 809095562 809445083 809539020 809309125 809038043 809070408 809434772
2070.2 809434772 809863925 810036004 809824586 809480131 809444189 809829712 810288489 810443699 810258329 810046017
2090.6 810046017 810141921 810568094 811060250 811329484 811262071 811068296 811146200 811614811 812162578 812389970
2111 812389970 812218428 811949730 811959743 812312305 812711596 812818885 812571883 812247515 812195659 812504292
2131.4 812504292 812908113 813044548 812812209 812467992 812377632 812671602 813115656 813318193 813148320 812887609
2151.8 812887609 812903821 813289940 813836753 814196825 814220309 814165771 814382613 814963818 815734088 816336691
2172.2 816336691 816578984 816716790 817132890 817899644 818716407 819245756 819454372 819590986 819947422 820602238
2192.6 820602238 821345568 821863413 822042584 822100937 822384596 823018730 823767245 824259639 824408710 824495912
2213 824495912 824837804 825502157 826224864 826649547 826706946 826687992 826941967 827530205 828169048 828507483
2233.4 828507483 828473151 828354955 828530610 829048455 829610646 829885066 829786360 829582810 829659998 830126405
2253.8 830126405 830697298 830998540 830915868 830731988 830841720 831318855 831895769 832222104 832177639 832020402
2274.2 832020402 832147539 832660973 833244979 833502710 833377421 833167076 833182156 833488286 833854556 833932221
2294.6 833932221 833641052 833280146 833177924 833376467 833597064 833495378 832993984 832417786 832212865 832396269
2315 832396269 832546473 832282543 831609488 830959260 830702424 830735207 830785811 830621719 830158293 829611003
2335.4 829611003 829244554 829188108 829325378 829306066 829214931 829311728 829274416 828890443 828299105 827542245
2355.8 827542245 826664984 825932682 825638294 825947702 826539278 826900721 826971829 827078879 827525675 828303695
2376.2 828303695 829112947 829617441 829711139 829637766 829715490 829996526 830228686 830110967 829602063 829000592
2396.6 829000592 828700483 828766167 828852296 828598380 827967703 827258348 826828897 826726437 826650321 826258719
2417 826258719 825479209 824626207 824097931 823929787 823782921 823295295 822416782 821454585 820779562 820486784
2437.4 820486784 820272088 819724202 818788230 817782879 817069352 816760778 816589713 816122472 815253437
2455.7 815253437 814301372 813632190 813332796 813153028 812733710 811950445 811054230 810414553 810119629 809914589
2476.1 809914589 809484720 808731258 807886660 807318151 807127833 807058156 806758046 806111515 805349231 804838657
2496.5 804838657 804737210 804797113 804611564 804083228 803453684 803003132 802854121 802842855 802639008 802080274
2516.9 802080274 801337123 800763667 800523400 800368011 799949944 799220145 798371315 797655463 797204733 796877742
2537.3 796877742 796375036 795545101 794570684 793775558 793272376 792909741 792416632 791636407 790714324 789938509
2557.7 789938509 789445341 789085507 788557827 787740171 786817133 786066949 785599709 785262048 784791350 784066379
2578.1 784066379 783216298 782526255 782112002 781790495 781348348 780715704 779994667 779422104 779130638 778981924
2598.5 778981924 778708518 778160989 777432978 776760578 776259840 775830269 775254071 774389923 773351192
2616.8 773351192 772363365 771528363 770758927 769848824 768689811 767372668 766124010 765099347 764164209
2635.2 764164209 763085544 761799574 760380507 759010732 757878304 756914675 755860209 754579484
2651.5 754579484 753182113 751918733 750893593 749948621 748904526 747709334 746443868 745290816
2667.8 745290816 744322836 743439853 742503822 741451442 740390480 739453316 738640130 737872183 737007380
2686.2 737007380 735955238 734831333 733809829 732921481 732062221 731085598 729914308 728644848 727474868
2704.5 727474868 726446927 725434959 724341393 723128557 721861303 720704854 719728947 718847990 717917442
2722.9 717917442 716863811 715786636 714854598 714088857 713359118 712579310 711744130 710864902 710030138
2741.2 710030138 709322393 708660901 707928538 707120359 706306815 705586493 705003917 704477489 703883171 703200102
2761.6 703200102 702521861 701917231 701356530 700760007 700055540 699247599 698394120 697530568 696671188 695786357
2782 695786357 694799125 693662703 692441344 691237152 690021813 688709080 687294424 685781002 684144676
2800.4 684144676 682448208 680784166 679108560 677308619 675340772 673259914 671178818 669127226
2816.7 669127226 667021811 664775550 662366629 659871399 657392144 654921651 652367771 649667025
2833 649667025 646800458 643824100 640789151 637631893 634292126 630745709 627005935 623214722 619602323
2851.4 619602323 616326809 613335609 610412776 607343376 603985488 600277185 596147299 591509521
2867.7 591509521 586401701 580997169 575479269 569959402 564579368 559586823 555213809 551568270
2884 551568270 548675478 546530306 545065820 544105828 543392003 542724788 542035460 541327953 540533960
2902.4 540533960 539498746 538115740 536352336 534181297 531553924 528471529 525008142 521320224
2918.7 521320224 517626405 514179528 511235535 509000421 507606149 507115841 507675171 509453118 512418628
2937 512418628 516386628 521111429 526319861 531796813 537456989 543295264 549266517 555252075 561136782
2955.4 561136782 566883087 572484970 577913344 583098054 587923706 592324734 596348763 600165665
2971.7 600165665 603946924 607715011 611429393 614998043 618281186 621234775 623925328 626418233
2988 626418233 628702223 630654573 632183075 633395016 634372056 635081172 635514975 635601759 635324419
3006.4 635324419 634802401 634103596 633212507 632029414 630497038 628745735 626908243 625010550 622995019
3024.7 622995019 620819330 618522286 616115570 613686740 611275554 608783305 606281817 603788257
3041.1 603788257 601120412 598250031 595342278 592559695 589854181 587017596 584010363 580944359
3057.4 580944359 577937782 575099766 572376311 569612503 566724181 563683450 560632706 557778060
3073.7 557778060 555107296 552430749 549575448 546583831 543640673 540781856 537951946 535088539
3090 535088539 532080412 528998077 526091039 523420334 520765781 517942250 515050590 512289643 509642839
3108.4 509642839 506948948 504293561 501808584 499292314 496590853 493772209 490919083 488146275
3124.7 488146275 485496759 482896060 480282038 477653056 475120217 472776651 470465422 467944443
3141 467944443 465294242 462773860 460426301 458217680 456092417 453814626 451297551 448804229 446523547
3159.4 446523547 444391221 442258656 440066904 437866300 435705513 433628261 431630462 429653317
3175.7 429653317 427671522 425706834 423773378 421881020 420038223 418232977 416426092 414588451
3192 414588451 412762225 410989314 409273952 407607228 405990213 404419303 402868241 401318997 399785727
3210.3 399785727 398283809 396797359 395341039 393913269 392470151 391047120 389687926 388380915
3226.7 388380915 387137890 385997534 384926975 383733183 382375389 381034285 379780740 378641874
3243 378641874 377638489 376646072 375536740 374386370 373315364 372334689 371389866 370446950 369532049
3261.3 369532049 368662685 367819399 367060095 366442978 365741223 364810199 363809824 362868220 362047076
3279.7 362047076 361307889 360564500 359817088 359111100 358506739 357947946 357258290 356402516 355484366 354636759
3300.1 354636759 353974551 353454649 352860063 352012932 350956321 349857271 348848373 347952634 347132385
3318.4 347132385 346336037 345536143 344704181 343729556 342657566 341633409 340667993 339844346 339186490
3336.8 339186490 338391960 337342083 336288840 335313588 334416330 333639473 332743257 331565678 330371350
3355.2 330371350 329394341 328553736 327665597 326754123 326009840 325371295 324545562 323386997 322164297
3373.5 322164297 321216822 320476472 319727361 318878621 318056643 317430228 317036629 316830069 316521257 315861672
3393.9 315861672 315139949 314810365 314732105 314328760 313568652 312965035 312634349 312377661 312116027 311746299
3414.3 311746299 311306447 311003208 310807049 310642183 310638607 310847014 311128438 311258256 311332077 311611295
3434.7 311611295 311856389 311763912 311603189 311719507 312057644 312424779 312785923 313239187 313792855 314397305
3455.1 314397305 315057397 315765589 316387862 317022264 317995369 319124967 319858462 320126355 320413709
3473.4 320413709 321041435 321999460 322948247 323580503 324256808 325227946 326143444 326955050 327893347 328884214
3493.8 328884214 329867482 330852687 331829697 332766712 333561301 334294945 335160911 336259991 337595582
3512.2 337595582 338855147 339796871 340682209 341792077 343110114 344305217 345199764 346094072 347272068
3530.6 347272068 348685920 350183755 351594687 352887690 354339570 355963230 357407451 358585358
3546.9 358585358 359917343 361495852 363099992 364824593 366756588 368801564 370868862 372736335
3563.2 372736335 374254197 376133591 378945649 381893724 384521872 387109160 389833689 392758250
3579.5 392758250 395931929 399131417 401919365 404504925 407800734 411386937 414679199 418069959
3595.8 418069959 421814114 425610334 429418117 433194518 436592221 439902574 443643063 447612882
3612.1 447612882 451673597 455604047 459331036 463582784 468164057 472251177 475479901 478424609
3628.5 478424609 482601613 487356484 491832763 496087462 500184894 504179299 508080840 511686265
3644.8 511686265 514791012 518075645 522575021 527248740 531235635 535253286 539575517 543502808
3661.1 543502808 547027647 550479650 553466618 555959761 559090436 562194467 564556599 567771614
3677.4 567771614 571665585 575261474 578566611 581473351 583701670 585558176 588101029 591165185
3693.7 591165185 593960524 596251249 598059297 599740446 601906836 604224622 605929792 606922328
3710 606922328 608225644 610651135 613146126 614985943 616334379 617560744 618888438 620457768 622317195
3728.4 622317195 623918295 624829471 625454962 626827002 629009366 630889356 631518304 631652713 632938921
3746.7 632938921 633969307 634327710 635974705 638365269 640007317 641003549 642309964 643803179 644928813
3765.1 644928813 645849586 646695018 647765100 649217248 650552094 651440203 652083933 652980149 653939009
3783.5 653939009 654824853 655891478 657012403 658037126 658798218 659286737 659846783 660110831 660288036
3801.8 660288036 661411881 662441254 663208425 664568603 665902436 666393578 666363120 666754544 667058647
3820.2 667058647 667619169 668913066 670044184 671008885 671843469 672445655 672957540 672978818 672743559
3838.5 672743559 673355460 674590588 675898850 677086055 677855551 677635670 676240683 676302671 678303003
3856.9 678303003 679934442 680572271 680543840 680830359 681509256 681675315 681831419 682562709 683570743
3875.2 683570743 684473574 684718013 684991360 685709834 686193705 686802924 687260032 687253058 687806189 688736260
3895.6 688736260 688995957 688605726 688321114 688576341 689476311 690599740 691367269 691802859 692057610
3914 692057610 692059934 692091942 692422271 692747414 692955256 693311512 693670154 693733037 693878531 694464862 695077658
3936.4 695077658 695391119 695420623 695411682 695725441 696074188 696203291 696462393 696900487 697285414 697543621
3956.8 697543621 697743833 697970033 698289216 698651493 698864996 698942780 699068546 699273169 699478388 699683130
3977.2 699683130 699926913 700196445 700421154 700575709 700740933 700949371 701132298 701275826 701439142 701621175
3997.6 701621175
##END=$$ End of the data block
