##TITLE=$$ Begin of the data block
##JCAMP-DX=5.00 $$ ACD/SpecManager v 10.08
##SPECTROMETER/DATA SYSTEM=Varian
##DATE=30 Apr 2013 09:54:04
##DATA TYPE=INFRARED SPECTRUM
##DATA CLASS=XYDATA
##ORIGIN=
##OWNER=
##NPOINTS=3735
##FIRSTX=399.26403809
##LASTX=4000.35498047
##MAXX=4000.35498047
##MINX=399.26403809
##MAXY=80.53346252
##MINY=17.98897362
##XFACTOR=1.0000000000
##YFACTOR=0.000000100000000
##FIRSTY=49.37686157
##DELTAX=0.96440572
##XUNITS=1/CM
##YUNITS=TRANSMITTANCE
##XYDATA=(X++(Y..Y))
399.3D93768616J53013534Q5075226K4368897j953125p87659N297851M314576L19061
407G63416977k2202K291413K358627o61926l290634l260422j827774r59702j018066
415.7G57026291j795273l620605o066056o927719m240112R80987N356827O606064N442963
424.3G52763367L924026L018723K440262K017974K100678K675400K976989K346344
432.1G74263763J058274q39k37198K80838J098556J716919J768570J166992J44959
440.7G81260834r71604k001190k795181l008499k293473q35952N01404P71331l36914
449.4G70290756k366943m501114n998764o476593o126251n655365n660782n825958
457.1G27678986m922104j948548K627259O890335Q871078Q011322N419922K864304
$$ plain form
399.3 493768616 646782150 731857376 756226273 754273148 753485489 758783340 763097916 763416977
407 763416977 763394775 765686188 768044815 767382889 764092255 760831833 759004059 758044357 757026291
415.7 757026291 755231018 751610413 745544357 738616638 734376526 735357513 740714340 747320404 752763367
424.3 752763367 756687393 759706116 762146378 764164352 766265030 768940430 771917419 774263763
432.1 774263763 775322037 775321198 775084000 775364838 776463394 778180313 779948883 781115875 781260834
440.7 781260834 780289230 778288040 775492859 772484360 770190887 769354935 769856339 770627670 770290756
449.4 770290756 767923813 763422699 757423935 750947342 744821091 739165726 733504944 727678986
457.1 727678986 722756882 720808334 723435593 730325928 739197006 747208328 752628250 755492554
464.8G55492554J501159J329728J588668J586457J242370R48258R98459J209259J109695
473.5G67006607M49905n18493j265640j430054j079636o12411m60739q57850j796188
482.2G59435501l105774m477691n425721n385284m095307j968917M5242J169662J392899
490.9G37584610J287308J270218J219101Q76693M24652L79105R23615J595001J803512
499.6G47363815J520996J236878J250458J244201O98395m24499j641922k598267l499603
508.2G45150452m716187o074982o822738o417923n180435l946686l127594k350540
516G06513367j155854J45874N71595n84183l109283o254883r481354j2480469j4478988
524.6F59685822j3974381r676247j915588P019768J4179687J7790604J8023682J6230850
$$ plain form
464.8 755492554 756993713 758323441 759912109 761498566 762740936 763689194 764687653 765896912 767006607
473.5 767006607 767456512 766938019 765672379 764242325 763162689 762550278 762089539 761231689 759435501
482.2 759435501 756329727 751852036 746426315 741041031 736945724 734976807 735022049 736191711 737584610
490.9 737584610 738871918 740142136 741361237 742237930 742662582 743041687 743965302 745560303 747363815
499.6 747363815 748884811 750121689 751372147 752616348 753314743 752890244 751248322 748650055 745150452
508.2 745150452 740434265 734359283 727536545 721118622 715938187 711991501 708863907 706513367
516 706513367 705357513 705503387 706074982 705490799 702381516 696126633 686645279 674164810 659685822
524.6 659685822 645711441 636035194 634119606 641139374 655319061 673109665 691133347 707364197
532.4G07364197J3639068J0766602P808838N182571L458176K799454K681961K295532
540.1G55996399J231232k50397j559982k293091k450943k333756k353973k890167m139862
548.7G38955460n998917q090210r942627j1125870j1228332r830857o682739k006454
556.5F74049454L378525Q285980J1626816J2817916J1978608R838485P369919N300369
564.2G44646072L814164K687606J714173R81827P36084J022110J528320J792602J549759
572.9G60472717Q83560R7657n32227r04846j068878j092758r73893o82373k92740l2577
582.5G55873642j36948o22940j235122j674347j878662k041092k345047k767258l226013
591.2G39946213l844910m871292o182175o968612o179963l486938J84402L187638M327774
$$ plain form
532.4 707364197 721003265 731769867 739578705 744761276 748219452 751018906 753700867 755996399
540.1 755996399 757227631 756977234 755417252 753124161 750673218 748339462 745985489 743095322 738955460
548.7 738955460 732956543 724866333 714923706 703797836 692569504 682738647 676055908 674049454
556.5 674049454 677427979 685713959 697340775 710158691 722137299 731975784 739345703 744646072
564.2 744646072 748460236 751147842 752862015 753843842 754579926 755602036 757130356 758922958 760472717
572.9 760472717 761356277 761453934 760921707 760016861 758947983 757855225 756881332 756198959 755906219 755873642
582.5 755873642 755736694 755113754 753878632 752204285 750325623 748284531 745939484 743172226 739946213
591.2 739946213 736101303 731230011 725047836 718079224 711899261 708412323 708596725 711784363 716112137
599.9G16112137L595810J895981J98364j046753j870422k433091k836837l230286l959580
608.5G06425323n428619p611389r593735r759979o820602j039658N467453R849319
616.3F81488113J0256806O840057J374054l873138p051468p115479m038925R75342
624F78855362N711441P974014O951294L734589L03192k240982m443359p317963j0321579
632.7F79206009j0821076o153106L392715J3744049J9611359J8332977J1554260L442994
640.4G32310181k577591n656815o918716p766877q766479r584274r481201p898179
648.1F73660049m949112j569671R39789J756820J057053k49634j255264j571655j306610
656.8F66511765p51343j44425L91388Q30155J213302J609268K065735K583466L095856
$$ plain form
599.9 716112137 719707947 721603928 721802292 720755539 718885117 716452026 713615189 710384903 706425323
608.5 706425323 700996704 693385315 683791580 674031601 667210999 666171341 671638794 681488113
616.3 681488113 691744919 698584976 699959030 696085892 689034424 681918945 677880020 678855362
624 678855362 684566803 692540817 699492111 703226700 703529892 701288910 696845551 689527588 679206009
632.7 679206009 668384933 662231827 665624542 679368591 698979950 717312927 728867187 732310181
640.4 732310181 729732590 724075775 717157059 709390182 700623703 691039429 681558228 673660049
648.1 673660049 668710937 667141266 668081055 669837875 670894928 670645294 669390030 667818375 666511765
656.8 666511765 665760422 665615997 666007385 666837540 668050842 669660110 671725845 674309311 677405167
665.4F77405167L471832L586807L442459L214951L126755L240890L394318L348465
673.2G04231644L000564K460633J954498J666260J629638J714554J721954J530304
680.9G19910049J172409P55539L14789k03857p95365j282653j427460j182098p93000
689.6G16468353o30798r30862j704789k851486m247818n667343o660233o655960n348434
698.2F81770630l059921o86570Q27103J074066L31269q21915j987076l081818m107284
706.9F70258484m915772n266494n069123m501648l867797l355484k930069k443047
714.6F37909050j820335j140786n41191m3869M79279J145744J853905K288360K177659
723.3F42307816J550674P25784N5237k94418l26691n6305N68924J564942K744216L664475
$$ plain form
665.4 677405167 680876999 684463806 687906265 691121216 694247971 697488861 700883179 704231644
673.2 704231644 707232208 709692841 711647339 713313599 714943237 716657791 718379745 719910049
680.9 719910049 721082458 721837997 722152786 721948929 721153564 719870911 718443451 717261353 716468353
689.6 716468353 715837555 714906693 713201904 710350418 706102600 700435257 693775024 687119064 681770630
698.2 681770630 678710709 678024139 678851242 679925308 680256577 679434662 677447586 674365768 670258484
706.9 670258484 665342712 660076218 655007095 650505447 646637650 643282166 640352097 637909050
714.6 637909050 636088715 634947929 634406738 634362869 634842148 635987892 637841797 640130157 642307816
723.3 642307816 643858490 644584274 644639511 644345093 644018402 643962097 644531021 646095963 648840179 652504654
733F52504654L772583K662888K77938l040847o601029r408417j0339355q694801n014077
741.6F16119537j355667k40936k654114o855697r499054q398781m394188l98522J459198
750.3E83781776J717606K667580N764351J0092849J3267708J3600159J1344375Q132248
758F50368652N539856M209900L984986M475174N375595O433258P356720P869110P821502
766.7G03434753P223664O179046M798203L140488J206588r72519l130340m617539m569091
775.4G12693253k439728J449661N871811R303207J0760651J0242691Q501129O420822
783.1G62803497M506913K800598J155243m58603j926270l230209m581986o116485p366867
791.8G47585831p230378m786834l70331M237061O877059O458741L525924l46832l537292
$$ plain form
733 652504654 656277237 658940125 659218063 656177216 649576187 640167770 629828415 621133614 616119537
741.6 616119537 614763870 614522934 611868820 605013123 595514069 587115288 582721100 582322578 583781776
750.3 583781776 585499382 588166962 593931313 604024162 617291870 630892029 642236404 650368652
758 650368652 655908508 660118408 664103394 668578568 673954163 680387421 687744141 695613251 703434753
766.7 703434753 710658417 716837463 721635666 724776154 725982742 725010223 721879883 717262344 712693253
775.4 712693253 710253525 711703186 717574997 726878204 737638855 747881546 756382675 762803497
783.1 762803497 767310410 770111008 771266251 770807648 768881378 765651169 761069183 754952698 747585831
791.8 747585831 740355453 735568619 735198288 739435349 746312408 752771149 756297073 755950241 752412949
800.5G52412949m974595m339904k176895K09121J376648O28128j686554m754562q007126
809.1G28687210j1051712j3066101j2818680r778595n243149k015228k611465p584076
816.9F64518204j5429917k3911934l1333808l6709900l9148522l7537765l1111145
823.6D49335213k0423241p754822L610306J0918922J3324738J2213554J0290299J0070610
831.3D81585579J2724266J7807655K3752365K8650284L0992966L0217400K6886138
838.1F52616653K2316971J7782975J3847427J0399933P302627M901581L790588M075013
845.8G37033768N005798N454788M776688L191910J393737j15051j332092k589035m180985
854.5G48639526o021042p411117p140884m151993J487961Q137359J3311463J5199432
$$ plain form
800.5 752412949 747438354 743098450 740921555 741130676 742507324 743135452 741448898 736694336 728687210
809.1 728687210 717635498 704569397 691750717 681972122 676728973 674713745 672102280 664518204
816.9 664518204 649088287 625176353 593842545 557132645 517984123 480446358 449335213
823.6 449335213 428911972 421157150 424767456 435686378 449011116 461224670 471514969 481585579
831.3 481585579 494309845 512117500 535869865 564520149 595513115 625730515 652616653
838.1 652616653 674933624 692716599 706564026 716963959 724266586 729168167 732958755 737033768
845.8 737033768 742039566 747494354 752271042 755462952 756856689 756741638 755409546 752820511 748639526
854.5 748639526 742618484 735207367 728066483 723914490 725402451 733539810 746851273 762050705
862.2G62050705J3738785J0376663O880722M292831K737351J872330J351928R79081
869.9H04280396O59255L48893M6081k12250l67889l65677k01111M5548K40326K89383
879.5H04762955J97525K7084j84631m29459o71997q38165q87146q69827q86612r98307
889.2G99221420j206588j517258j981201k668457l621827m843139o248551p540741
896.9G69593658q122787p265930m580460m62341L915329P176285Q501815Q004075O468887
905.6G83228531M751205L328247K274704J507874R95941P65076P90100R28192R68781
914.3G99538651P66677L43018j34811m97056p05566q33511r20182r03472p45011n76019
923.9G95332718o24924r77478j490631k018738k627182l415298m094238l933487k368470
$$ plain form
862.2 762050705 775789490 786166153 793046875 797339706 800077057 801949387 803301315 804280396
869.9 804280396 804939651 805288544 805334625 805122375 804754486 804388809 804187698 804233246 804473572 804762955
879.5 804762955 804960480 804987564 804802933 804373474 803701477 802863312 801976166 801106339 800219727 799221420
889.2 799221420 798014832 796497574 794516373 791847916 788226089 783382950 777134399 769593658
896.9 769593658 761470871 754204941 749624481 749162140 753077469 760253754 768755569 776759644 783228531
905.6 783228531 787979736 791307983 793582687 795090561 796086502 796851578 797641678 798569870 799538651
914.3 799538651 800305328 800648346 800513535 800016479 799310913 798477402 797557220 796653748 795908737 795332718
923.9 795332718 794707794 793730316 792239685 790220947 787593765 784178467 780084229 776150742 773782272
932.6G73782272K73743K775040L893585L294296J671372M4250j001511j470184j579361
941.3G81683502j410141r22317j96686M68597P24106M18854l23944j251984k149658
949.9G77040329k850723l153458k854233j956176p91932J80664P77512J229401J862869
958.6G69484253K661056L220978L155289K463531J494828O17904m196m16183p91016
967.3G81886444j363678k241745l146515l421860k535858o90841J142501J945344J462173
976G73035965L22418n76248p58438l43704K51388O55289O76651L07388l00216q97065
985.6G72373428j264343j322174j123657p82547m25034j86615j78070m15344p97806
994.3G65877838j182403j478348j676789j800460j856079j840210j777420j742173
$$ plain form
932.6 773782272 774056015 776831055 780724640 784018936 785690308 785734558 784733047 783262863 781683502
941.3 781683502 780273361 779351044 779154358 779622955 780347061 780765915 780441971 779189987 777040329
949.9 777040329 774189606 771036148 768181915 766225739 765433807 765614471 766391983 767621384 769484253
958.6 769484253 772145309 775366287 778521576 780985107 782479935 783097839 783093643 782677460 781886444
967.3 781886444 780522766 778281021 775134506 771712646 769176788 768485947 769628448 771573792 773035965
976 773035965 773358383 772782135 772023697 771679993 771931381 772586670 773263321 773570709 773270493 772373428
985.6 772373428 771109085 769786911 768663254 767880707 767455673 767269058 767090988 766675644 765877838
994.3 765877838 764695435 763217087 761540298 759739838 757883759 756043549 754266129 752523956
1002G52523956j833267k130814k686843l553238m751511o101150p060318o915284n424118
1010.7G12067413l378372k321319l353577o079483q851395j0219650j0113144r543686
1018.4F58206787r310532r310569r206467r428902j1028022j4373055j8235741k0475883
1026.1E56837616j9708176j6250305j1489372o516762j456566M058380J0014878J5693626
1033.8E31183319K0058632K2370415K2527542K1013641J8607292J6039315J3753128
1040.6F65553284J1863937J0303040R004821P977372P232589O693650O190796N562820
1048.3G30382309M769134L915177L160019K584533K144623J751252J383590J102448
1056G51193085R51614Q76770P67822N68314L03268J3047l07389o69250j026230j300049
$$ plain form
1002 752523956 750690689 748559875 745873032 742319794 737568283 731467133 724406815 717491531 712067413
1010.7 712067413 708689041 706367722 703014145 696934662 688083267 677863617 667750473 658206787
1018.4 658206787 648896255 639585686 630379219 620950317 609922295 595549240 577313499 556837616
1026.1 556837616 537129440 520879135 509389763 502873001 501416435 505474815 515489693 531183319
1033.8 531183319 551241951 573612366 596139908 617153549 635760841 651800156 665553284
1040.6 665553284 677417221 687720261 696725082 704702454 711935043 718628693 724819489 730382309
1048.3 730382309 735151443 739066620 742226639 744811172 746955795 748707047 750090637 751193085
1056 751193085 752144699 753021469 753789291 754357605 754660873 754673920 754366531 753697281 752671051 751371002
1065.7G51371002j465759j576386j689300j809006j934433k131729k520370l192902
1073.4G35051117m180222n458297o845627p815476p518005n261917j188583L512420
1081.1G00295410P194748Q743820Q141938O228561M008942K139740Q37402L1280m73251
1089.8G37148590q73718j271820j659546k013703k388610k881775l527298m267578
1097.5G18264542n033112n811996o651535p646714q904419j0354919j1451874j1160889
1105.2F51249084q567428l785629J696090N730362O777039M727859P97959l178406
1112.9F55446930n527268n389709l151169k93045J549149J755142J070557P47528J355819
1121.6F47563934K480622L465347M188080M970245N889511O455384O062316M640961
$$ plain form
1065.7 751371002 749905243 748328857 746639557 744830551 742896118 740764389 738244019 735051117
1073.4 735051117 730870895 725412598 718566971 710751495 703233490 697971573 696782990 700295410
1081.1 700295410 707490158 716233978 724375916 730604477 734613419 736753159 737590561 737621841 737148590
1089.8 737148590 736274872 735003052 733343506 731329803 728941193 726059418 722532120 718264542
1097.5 718264542 713231430 707419434 700767899 693121185 684216766 673861847 662409973 651249084
1105.2 651249084 642681656 638896027 640592117 646322479 653099518 657827377 658625336 655446930
1112.9 655446930 649919662 644529953 641378784 641085739 642634888 644390030 645460587 646208115 647563934
1121.6 647563934 650044556 653509903 657697983 662668228 668557739 675013123 681075439 685716400
1129.3F85716400K755051J091232o9885r04160j703720k554931l311768l801498m026947
1138F73189774m182129m491501n024719n656891o197129o554489o784096o995506p232818
1146.7F20070496p444992p550621p539979p522048p687684q193016r032516j0004463
1154.4E55095177j0812874j1246491j1272926j0955849j0268898r009590o937179m001885
1162.1D80589485m20418L473206P377243J0952110J3652191J4818154J4083061J1660156
1169.8E56185188Q128243L990707l43857m093704o001320n272369k846222j340447
1177.5E48406219l030281p479438j1330758j0956001n753746J051560N081443M663735
1185.3E20652733K412224L055000R366341J9696235K9126435L3127021L0573960K3855667
$$ plain form
1129.3 685716400 688471451 689562683 689492798 688588638 686884918 684329987 681018219 677216721 673189774
1138 673189774 669007645 664516144 659491425 653834534 647637405 641082916 634298820 627303314 620070496
1146.7 620070496 612625504 605074883 597534904 590012856 582325172 574132156 565099640 555095177
1154.4 555095177 544282303 533035812 521762886 510807037 500538139 491528549 484591370 480589485
1162.1 480589485 480169067 483642273 491019516 501971626 515623817 530441971 544525032 556185188
1169.8 556185188 564313431 568304138 567960281 563866577 557865257 552592888 549746666 548406219
1177.5 548406219 545375938 537896500 526565742 515609741 509855995 510907555 515988998 520652733
1185.3 520652733 523064957 526119957 535486298 555182533 584308968 617435989 648009949 671865616
1193F71865616J6507416J0756073O858062M083252J874695J44806j076202j916199
1200.7G09097519k585297l215332l835678m414520m862671n076370n073319n063705
1208.4F74970627n293503n781250o259079o408615o146088n678825n326424n321159
1216.1F28755684n726166o453895p329865q187141q963890r728470j0604210j1661301
1223.8E60100746j2864227j4088211j5161438j5919113j6269684j6231117j5895462
1230.6D53671494j5369492j4781036j4308358j4061584j3786163j2699547r847718
1237.3C58817596m906616J211052O597748R388580Q817520N505219Q84285l637848
1245C82677536p132034r049378q938637o421394j528511M923973J1392021J6246071
$$ plain form
1193 671865616 688373032 699129105 705987167 710070419 711945114 712089920 711013718 709097519
1200.7 709097519 706512222 703296890 699461212 695046692 690184021 685107651 680034332 674970627
1208.4 674970627 669677124 663895874 657636795 651228180 645082092 639403267 634076843 628755684
1216.1 628755684 623029518 616575623 609245758 601058617 592094727 582366257 571762047 560100746
1223.8 560100746 547236519 533148308 517986870 502067757 485798073 469566956 453671494
1230.6 453671494 438302002 423520966 409212608 395151024 381364861 368665314 358817596
1237.3 358817596 353910980 355122032 361719780 371108360 379925880 385431099 386315384 382677536
1245 382677536 375545502 366496124 357557487 351136093 349607582 354531555 365923576 382169647
1252.8C82169647J8608208J8710289J7452507J5551681J3041268R504394M709359j006356
1260.5D78740997o870269j2051087j5887375j7886238j7671203j5013314r918136k712632
1268.2C80730743N868035J4663582K2273292K7486687K9734192K9242744K6804505
1274.9E36803780K3371238J9742241J6430397J3641701J1319046R264946P303581N382500
1282.7F43259430L538284J788559P3166j707916l612137n619125p652893r594727j1229820
1291.3F09242821j2197190j2099990j0809136q694115o448135m537315k825356q51784
1299E50779800J485482L665695N113335N964202P026444Q822708J0744820J1325531
1306.8F04928017R437027N268707K78511l651314n127106l828544p23801K215080K957764
$$ plain form
1252.8 382169647 400777855 419488144 436940651 452492332 465533600 475037994 479747353 478740997
1260.5 478740997 471870728 459819641 443932266 426046028 408374825 393361511 383443375 380730743
1268.2 380730743 386598778 401262360 423535652 451022339 480756531 509999275 536803780
1274.9 536803780 560175018 579917259 596347656 609989357 621308403 630573349 637876930 643259430
1282.7 643259430 646797714 648586273 648659439 646951523 643339386 637720261 630067368 620472641 609242821
1291.3 609242821 597045631 584945641 574136505 565442390 558994255 554456940 551631584 550779800
1299 550779800 552265282 555930977 561044312 567008514 574034958 582857666 593602486 604928017
1306.8 604928017 614365044 619633751 619912262 616260948 611133842 607305298 606581497 608796577 611754341
1315.4F11754341O62232l705521p994957j0294342j0005646p857895n152397k988891
1323.2E64416924j887551j748428k012520k010231j388969l24212O83022J245232J355743
1331.8E58329010J301003J384010J750068K405930L331299M533081O001739P622261
1339.6E86658401R132081J0197143J0577545J0259285R438896Q383713P299118O288452
1347.3F58234634N383072M568863L809433L094330K489853K111893K015991K104874
1355F83812943K173461K064209J783600J458435J189194R65347P35398N27038M44412
1363.7F95154037N13230N76782M08325n1193o30722j161346j723633k533646l520889
1372.3F87030945m086228l454437j374054J503601L986740N128174M767914L460007
$$ plain form
1315.4 611754341 612416573 608711052 600716095 590421753 580416107 572558212 567405815 564416924
1323.2 564416924 562529373 560780945 558768425 556758194 555369225 555045013 555728035 556973267 558329010
1331.8 558329010 559630013 561014023 562764091 565170021 568501320 573034401 579036140 586658401
1339.6 586658401 595790482 605987625 616565170 626824455 636263351 644647064 651946182 658234634
1347.3 658234634 663617706 668186569 671996002 675090332 677580185 679692078 681708069 683812943
1355 683812943 685986404 688050613 689834213 691292648 692481842 693447189 694182587 694709625 695154037
1363.7 695154037 695667267 696244049 696652374 696601181 695970459 694809113 693085480 690551834 687030945
1372.3 687030945 682944717 679490280 678116226 679619827 683606567 688734741 693502655 696962662
1380.1F96962662J980819Q71201K75803M3716p8125k75269n86547r25217j186218j368027
1389.7F95714798j615601k123794k943421l863143m533768m786606m843979n142136
1397.4F65862350n898361o887512p706833q231163q703232r349365j0023079j0358620
1405.1E98704185j0220489r815216r264793q253403o367111l861428j840667j321335
1412.8E47759743j947747j777343J332969P788773J5511818K1142044K2261391J8878555
1420.6F30950203J3118553P579727L768158J686020N35507l61709j199036j905899
1428.3F54171524k442398k832108l064117l156128l330345l973198n270882o883583
1436F23218765q080215q259850p328987n592346l416901j132621P99560J798859J583481
$$ plain form
1380.1 696962662 698943481 699814682 700090485 700134201 700056076 699780807 699194260 698269043 697082825 695714798
1389.7 695714798 694099197 691975403 689031982 685168839 680635071 675848465 671004486 665862350
1397.4 665862350 659963989 653076477 645369644 637138481 628435249 619085884 609062805 598704185
1405.1 598704185 588483696 578668480 569403687 561150284 554783173 550921745 549081078 547759743
1412.8 547759743 545811996 544034653 545367622 553156395 568668213 589810257 612071648 630950203
1420.6 630950203 644068756 651648483 655416641 657102661 657638168 657276459 656077423 654171524
1428.3 654171524 651729126 648897018 645832901 642676773 639346428 635373230 630102348 623218765
1436 623218765 615138550 606878700 599549713 593957367 590540466 589407845 590207405 592006264 593589745
1444.7E93589745N73921l31154n37720k95524l65220j164321k368737l411026m236374
1453.3E81453590n352935p063065q772011r258423p751007m751663j778068k55776
1461.1E36470642n61180j955719l280563l687821k876167q92258K073403N645637R122238
1469.7E40058212J1548958J2118454J0642510P714691M405441J686211k6703r25713
1477.5E87222061j496620k105103k789192l366050l698502l851509m013786m309769
1485.2E61591530m742890n303955o049080o975364p845917q291283q209304q039208
1492.9E06134529q483009r857178j1763115j3469963j4606247j5372848j6093712j6714134
1500.6C99774323j6879464j6443710j5702667j5063706j4640655j4335423j4243145
$$ plain form
1444.7 593589745 594163666 593832512 593294792 592999268 592634048 591469727 589100990 585689964 581453590
1453.3 581453590 576100655 569037590 560265579 551007156 543256149 538504486 536726418 536470642
1461.1 536470642 535909462 533953743 530673180 526985359 524109192 523216934 525290337 530935974 540058212
1469.7 540058212 551607170 563725624 574368134 582082825 586488266 588174477 588147774 587222061
1477.5 587222061 585725441 583620338 580831146 577465096 573766594 569915085 565901299 561591530
1485.2 561591530 556848640 551544685 545495605 538520241 530674324 522383041 514173737 506134529
1492.9 506134529 497651520 487794342 476031227 462561264 447955017 432582169 416488457 399774323
1500.6 399774323 382894859 366451149 350748482 335684776 321044121 306708698 292465553
1507.3B92465553j4715709j5871506j7169933j7665196j6707859j4263477j0549336
1514.1A85522537n632801K93961O239300J0368766J1050396Q148670L282414j274471
1521.8B17998772m045296m943142m757137m268112l801480l355942k908935k513619
1529.5A87405109k161350j652889o96392Q24718K724896M750385O967945R775543J3363209
1538.2B21301174J7180062K0159072K1631604K1942844K1995640K2217598K2181892
1545C68609886K1315727J9760628J8282585J7398339J6869163J6159134J5160637J4226875
1552.7E07782974J3585510J3028031J2288895J1511993J1105347J1168136J1254387
1559.4E91725273J0770416R511185P766037O008034M551811L409576K324067R75494
$$ plain form
1507.3 292465553 277749844 261878338 244708405 227043209 210335350 196071873 185522537
1514.1 185522537 179889736 180183697 186422997 196791763 207842159 215990829 219273243 217998772
1521.8 217998772 213953476 209010334 204253197 199985085 196183605 192827663 189918728 187405109
1529.5 187405109 185243759 183590870 182894478 183719196 186444092 191194477 198162422 207937965 221301174
1538.2 221301174 238481236 258640308 280271912 302214756 324210396 346427994 368609886
1545 368609886 389925613 409686241 427968826 445367165 462236328 478395462 493556099 507782974
1552.7 507782974 521368484 534396515 546685410 558197403 569302750 580470886 591725273
1559.4 591725273 602495689 612006874 619772911 625780945 630332756 633742332 636066399 637041893
1567.1F37041893o54984k038917k358971j214180Q85125K827796L777886L760033L411483
1575.8F45437164L260575L287277L074417K229004O27746j604003m194031o782150
1583.5F45335999q967591j0406532j0939789j0673828r938812r085083q217697p099648
1591.2E70007019n405121l193664j178856m43840j710511m691352q024140r918480
1599E35441055r180374o019096k082367M43458J80970k559166o028138q204574p952500
1607.6D94039268n378875j402970K880249O584015R174805J0569038J1141396J1490478
1615.4E39097404J2023926J2693939J3106347J2861290J1807632J0064392P908096
1622.1F19563026N655442L566971J757774J70135j327667k778282m056129m977265
$$ plain form
1567.1 637041893 636386909 634347992 631989021 630774841 631659966 634487762 638265648 642025681 645437164
1575.8 645437164 648697739 651985016 655059433 657288437 657916183 656312180 652118149 645335999
1583.5 645335999 636368408 625961876 615022087 604348259 594409447 585324364 577106667 570007019
1591.2 570007019 564601898 561408234 560229378 559785538 558075027 553383675 545359535 535441055
1599 535441055 526260681 520241585 518159218 518602676 518783646 516224480 510196342 501991768 494039268
1607.6 494039268 488660393 487257423 490137672 496721687 505896492 516465530 527606926 539097404
1615.4 539097404 551121330 563815269 576921616 589782906 601590538 611654930 619563026
1622.1 619563026 625218468 628785439 630543213 630713348 629385681 626607399 622551270 617574005
1629.8F17574005n548935o149635p398605r689255j2719155j5563926j7447129j8586158
1637.5E24471207k0171433k3280372k7700577l1880684l4066696l3433075l0155869
1644.3C23782501k4755077j7801914j0280304l683186Q60691L650093O206227R671039
1652B87650070J3474159J5825787J5524044J3063469R939728P191162M910545L023834
1659.7C70602798K039834K726364N202865Q670464J2118263J5130844J7912903K0649872
1667.4D55054207K3008003K4276199K3927880K2071533J9448051J6996918J5287323
1674.2F00070114J4237213J3361969J2325669J1234588J0385590R810257R196777Q284607
1681.9F88906784P234497O501999O352615O555710O568451O011429M998703M048233
$$ plain form
1629.8 617574005 612025070 605875435 598476830 588787575 576068420 560504494 543057365 524471207
1637.5 524471207 504299774 481019402 453318825 421438141 387371445 353938370 323782501
1644.3 323782501 299027424 281225510 270945206 267262020 268122711 271772804 277979031 287650070
1652 287650070 301124229 316950016 332474060 345537529 355477257 362668419 367578964 370602798
1659.7 370602798 372642632 375368996 380571861 389242325 401360588 416491432 434404335 455054207
1667.4 455054207 478062210 502338409 526266289 548337822 567785873 584782791 600070114
1674.2 600070114 614307327 627669296 639994965 651229553 661615143 671425400 680622177 688906784
1681.9 688906784 696141281 702643280 708995895 715551605 722120056 728131485 733130188 737178421
1689.6G37178421L642120L782883L968582L680878K944870K321014K256928K520828
1697.3G62296524K441177J733933R10263P30133J330490K083588K317886K004166J634750
1706G77482910J571274J699753J699905J452408J088715P60803N07812L22724K15759
1714.7G86802063J76697J74408K46734N17807J015931J491394J551666J060867L59650
1723.4G93397217j4115J41983N04075O17752M34646L39279O06461R42535P51114j19018
1733G97601929j034622j157837l44086O76956J066589P04346J58081m9591N3635J18103
1742.7G97793503k6016k62452m67758o61850q48007q84552o45752k16751J98364N09873
1752.3G94488602P45849Q41294O25305J17492l14865k92816J07269M09089L23867J18943
$$ plain form
1689.6 737178421 740820541 744603424 748572006 752252884 755197754 757518768 759775696 762296524
1697.3 762296524 764737701 766471634 767381897 768112030 769442520 771526108 773843994 775848160 777482910
1706 777482910 779054184 780753937 782453842 783906250 784994965 785755768 786263580 786586304 786802063
1714.7 786802063 786978760 787153168 787399902 787917709 788933640 790425034 791976700 793037567 793397217
1723.4 793397217 793383102 793525085 794029160 794646912 795081558 795420837 796027298 796969833 797720947 797601929
1733 797601929 796567307 795409470 795065384 795742340 796808929 797513275 797671356 797621765 797675400 797793503
1742.7 797793503 797767487 797505035 797037277 796375427 795527420 794642868 793997116 793780365 793978729 794488602
1752.3 794488602 795234451 796075745 796701050 796818542 796503677 796210861 796318130 796727219 797051086 797170029
1761.9G97170029K60772P73621J156998R79004L80249j33667l01743l29513m94690
1770.6G99461060p17926o54603j61895M81109Q45337P60117L85742k7771l49426n39093
1780.3G99482651n51071l70865j09177M7302K9831k3117O3629K57340L09219K3194
1789.9G99158936m90189q73032q35037l97568J50910N06973N47791L33023m654l40882
1799.5G97756271n72357o23092m82026k30102R918J65329K54822L23334L54538K82974
1809.2G97239609R5443j13220k20489k06528j62964j70822k02789j76163o3858Q6060
1818.8G96104279K26135L37295L74833K66342L5019j25351j2131L17840N40467M05044
1828.5G98469772M8828j31530O8588M24881N48706L13644o1035l09677l76358l51868
$$ plain form
1761.9 797170029 797430801 798204422 799361420 800340424 800720673 800587006 800285263 799955750 799461060
1770.6 799461060 798743134 798088531 797926636 798407745 799253082 800013199 800398941 800371170 800021744 799482651
1780.3 799482651 798931580 798560715 798451538 798498840 798528671 798505554 798569183 798826523 799135742 799158936
1789.9 799158936 798668747 797795715 796960678 796563110 796714020 797220993 797768784 798101807 798097153 797756271
1799.5 797756271 797183914 796560822 796078796 795848694 795858612 796023941 796278763 796602097 796956635 797239609
1809.2 797239609 797335052 797221832 797001343 796794815 796631851 796461029 796258240 796082077 796018219 796104279
1818.8 796104279 796330414 796667709 797042542 797308884 797343903 797218552 797206421 797524261 798064728 798469772
1828.5 798469772 798518600 798387070 798455658 798880539 799429245 799742889 799681854 799372177 798995819 798643951
1838.1G98643951k80380j50451l9368j09024l99170p05795p63245n36881k59017j59226
1847.8G95241394k32773l05710k68707j71204j02996p5379o0653q2703j99204l92150
1857.4G93349915n41077n42755m27552l19900k92053k99073k70004k36435l26309o18591
1867.1G89476166j021118j319352j356887j177903r88311r84879j205139j522598j755371
1875.7G78144608j770401j534272j119537o93131m39682m10080m16717j25885O57272
1884.4G72292175J748276K658615K954559K588883J906433J323776J008377Q35190
1892.1G87316284O10581K98080K9602p0038k0065N6839P2479M3106J9150m044p1792
1902.7G88280182j88522k93274l38364l54691m08172n01862n66406n57556n24292n56488
$$ plain form
1838.1 798643951 798363571 798213120 798173752 798064728 797665558 796959763 796196518 795659637 795400620 795241394
1847.8 795241394 795008621 794702911 794434204 794263000 794160004 794084625 794023972 793941269 793742065 793349915
1857.4 793349915 792808838 792266083 791838531 791518631 791226578 790927505 790657501 790421066 790094757 789476166
1867.1 789476166 788455048 787135696 785778809 784600906 783612595 782627716 781422577 779899979 778144608
1875.7 778144608 776374207 774839935 773720398 773027267 772587585 772177505 771760788 771634903 772292175
1884.4 772292175 774040451 776699066 779653625 782242508 784148941 785472717 786481094 787316284
1892.1 787316284 787926865 788224945 788254547 788184509 788164444 788221283 788293762 788336868 788356018 788351974 788280182
1902.7 788280182 788091660 787798386 787460022 787105331 786697159 786195297 785628891 785071335 784547043 783990555
1912.4G83990555o88172q92028j157685j502380j870422k065583j861267j212539l27683
1921.1G72412796M87671J052704J359787J457977J352997J053314O56586L24554J51978
1929.7G80310364R5062M4403m8294j36795j55640q9416L7231J95389L48816M31519
1939.4G81032639L81012K11792L5934k7542L2883J18713J30539O5765l204k8381l3570
1950G81916580o8588j44806k29263k86866k97546k46735j25808L6087J64947J93100
1959.6G80911102J28327M7912J4649J1520l1814j45188k70996l20358k63214j59073
1969.3G79922867r7428j20163k00195k86712l50266l93143m19922m20455l82309l17688
1978.9G76934586k70081k77634l36837l96042l99247l31726k27279j30615o8207m6997
$$ plain form
1912.4 783990555 783302383 782410355 781252670 779750290 777879868 775814285 773953018 772740479 772412796
1921.1 772412796 772900467 773953171 775312958 776770935 778123932 779177246 779833832 780158386 780310364
1929.7 780310364 780405426 780449829 780401535 780264740 780109100 780019684 780056915 780252304 780601120 781032639
1939.4 781032639 781413651 781625443 781661377 781633835 781666718 781785431 781915970 781981735 781978531 781950150 781916580
1950 781916580 781847992 781703186 781473923 781187057 780889511 780642776 780516968 780553055 780718002 780911102
1959.6 780911102 781039429 781087341 781101990 781113510 781081696 780936508 780665512 780345154 780081940 779922867
1969.3 779922867 779825439 779705276 779505081 779218369 778868103 778474960 778055038 777634583 777252274 776934586
1978.9 776934586 776664505 776386871 776050034 775653992 775254745 774923019 774695740 774565125 774496918 774449921
1988.6G74449921o9580j24512j65024j23138K8228K24610L41568K96936J19018q3694
1998.2G74894333k19803k72217k74582k56500k23007j78146j41221j37024j71890k34146
2007.8G72785797l04260l60108l80859l56598l01666k51007k32010k43073k57721k53372
2017.5G69845123k33230k15378k11029k13089k03400j73416j30768r3460p7362q8653
2027.1G68205338j24512j77918k40554l09449l89099m88052o02188p02668p51419p34100
2036.8G63685379o74286o13251n67627n15823m26254k89993j32370R307J05744J48010
2046.4G60728836J50452J44195J54419J77918J84936J58005J21689J20926J67923K21252
2056.1G62330551K33765K13089K18811K94494M07944M75083M36477L11280J79290J11542
$$ plain form
1988.6 774449921 774380341 774255829 774090805 773967667 773995895 774220505 774562073 774859009 774978027 774894333
1998.2 774894333 774674530 774402313 774127731 773871231 773648224 773470078 773328857 773191833 773019943 772785797
2007.8 772785797 772481537 772121429 771740570 771383972 771082306 770831299 770599289 770356216 770098495 769845123
2017.5 769845123 769611893 769396515 769185486 768972397 768768997 768595581 768464813 768371353 768293991 768205338
2027.1 768205338 768080826 767902908 767662354 767352905 766963806 766475754 765873566 765170898 764419479 763685379
2036.8 763685379 763011093 762397842 761830215 761314392 760888138 760598145 760465775 760475082 760580826 760728836
2046.4 760728836 760879288 761023483 761177902 761355820 761540756 761698761 761820450 761941376 762109299 762330551
2056.1 762330551 762564316 762777405 762996216 763290710 763698654 764173737 764610214 764921494 765100784 765212326
2065.7G65212326J21536J63269J77536J40000P8048M0665N2261R0943J16730J12533
2075.4G66305847R6131R2468J04980J22452J40610J66473J97754K14768K00424J59912
2085G67801819J07498M3259m4632j44654k09808j95084j07193j0223K7542j2436r6435
2095.6G67159653j70899j96151j57547o5766M2725J20010J37711J12304R3079J19705
2105.2G67194824J83106K28653J99966R1629l6774j05819q0948m654M5242K8534k3041
2115.9G67720718m4174l738O5765J01547O0578n2033j92108l00140l29285k70614j58158
2126.5G66598358m7455K1057M1504L1662R003k0599n9891j09634j63880k06375k16293
2137.1G65877457j80207j03225q927P4616J19018J01242R537j38626k93274l93677
$$ plain form
2065.7 765212326 765333862 765497131 765674667 765814667 765892715 765933380 765985641 766076584 766193314 766305847
2075.4 766305847 766401978 766494446 766599426 766721878 766862488 767028961 767226715 767441483 767641907 767801819
2085 767801819 767909317 767952576 767907944 767763290 767553482 767358398 767251205 767240982 767268524 767256088 767159653
2095.6 767159653 766988754 766792603 766635056 766569290 766612015 766732025 766869736 766982040 767075119 767194824
2105.2 767194824 767377930 767606583 767806549 767898178 767861404 767755585 767674637 767669983 767715225 767743759 767720718
2115.9 767720718 767676544 767672806 767738571 767840118 767900696 767848663 767656555 767356415 767027130 766756516 766598358
2126.5 766598358 766550903 766571960 766613464 766645126 766654129 766633530 766573639 766464005 766300125 766093750 765877457
2137.1 765877457 765697250 765594025 765585098 765659714 765778732 765879974 765889511 765750885 765457611 765063934
2146.7G65063934m04968l33633k13929r0332l585J7089k5787r4604j44349j58844j53961
2157.3G63457031j46179j27792q3695j7624N0354J08948J61514J96534J80282Q9188
2167G63868561m7913j59530j94474j60217r9335l9139J8921O5613O9275R842q4381
2177.6G63247223j55029j72806j65863j78375k07062j98288j09406L5019J52893J71204
2187.2G62419510P9803p4615k30560l44773l95889l75443k84118j40076J9150J41220
2196.9G60814209J79901J15280k8763j93786l20358l82920l90396l56064k77633j52359
2206.5G59007111j2436P6980O7368k6703j40457k18506k57340k85186l10822l04031
2216.1G57595978k27585q2016Q1940J92871J98898R7427o4697k15988l03955l20282
$$ plain form
2146.7 765063934 764658966 764325333 764111404 764021072 764017487 764034576 764008789 763914185 763769836 763610992 763457031
2157.3 763457031 763310852 763183060 763099365 763081741 763132095 763241043 763402557 763599091 763779373 763868561
2167 763868561 763820648 763661118 763466644 763306427 763207092 763167953 763186874 763252487 763321762 763331604 763247223
2177.6 763247223 763092194 762919388 762753525 762575150 762368088 762169800 762060394 762095413 762248306 762419510
2187.2 762419510 762499313 762424698 762194138 761849365 761453476 761078033 760793915 760653839 760672989 760814209
2196.9 760814209 760994110 761109390 761080627 760886841 760566483 760183563 759793167 759437103 759159470 759007111
2206.5 759007111 758994675 759071655 759139023 759112320 758971863 758753357 758496017 758210831 757900009 757595978
2216.1 757595978 757368393 757286377 757368317 757561188 757760086 757857513 757792816 757576828 757272873 756952591
2225.8G56952591k91443k43149j83181j17417o9198o5766j06201j57166j89514k04620
2235.4G55324936k18353k18048j66855m4861J14364K48337L14408L09829K48413J38779
2245.1G56050949j0147j73874l11127l79562l49274k17056k1744J54496K28500J74484
2254.7G55145645M1199r6359k00577k81677l51029l83911l34320j83640K9221K22778
2264.4G53607330L13797K64435R9793j04905k73132l65219l82767l44696k66113j66168
2274G52382355p2174j2131J755l0747j09329k24075l39661m03595l88184l12500k11105
2284.6G50280609r1095O1646K30255L48282L53851K54745J18332K442q7891j63727
2294.3G51307449j99814j44958Q774J89209K93426K74659J71127N0125o1569j81427
$$ plain form
2225.8 756952591 756661148 756417999 756234818 756117401 756048203 755982437 755876236 755719070 755529556 755324936
2235.4 755324936 755106583 754888535 754721680 754676819 754791183 755039520 755353928 755663757 755912170 756050949
2245.1 756050949 756040802 755866928 755555801 755176239 754826965 754609909 754588165 754742661 754971161 755145645
2254.7 755145645 755186844 755090485 754889908 754608231 754257202 753873291 753538971 753355331 753384552 753607330
2264.4 753607330 753921127 754185562 754285355 754180450 753907318 753542099 753159332 752814636 752548523 752382355
2274 752382355 752310181 752298050 752299805 752269058 752159729 751935654 751595993 751192398 750804214 750491714 750280609
2284.6 750280609 750189514 750251160 750481415 750829697 751183548 751438293 751556625 751559067 751471176 751307449
2294.3 751307449 751107635 750962677 750971451 751160660 751454086 751728745 751899872 751949997 751888428 751707001
2303.9G51707001l15094m12369l99323k55355m5090J30920K15073K20261K02407K14081
2313.5G51262512K90680M40292O29654P87354Q52127Q25272P60879O99921O33011N34897
2323.2G57716599M11834K82974J30234q3313l37600n30777n67856m60892l02658j47019
2332.8G56111526M0589K90222N34058O39343N28412K36282j35727m78134o86340o97632
2342.5G56382599n63507m50211m85458n83573n01022j05057M42200Q19626Q59756O78406
2352.1G56493759N01938M34036M32053M43725M79432N29708M88892K21329k84195q57926
2361.8G58882751j245574j273270r50775m63867o5613P8506j8768k20947m18778o19278
2371.4G53684387q74557j147461j297150j213074r41543o50940m82559m53186m92401
$$ plain form
2303.9 751707001 751391907 750979538 750580215 750324860 750279770 750410690 750625763 750846024 751048431 751262512
2313.5 751262512 751553192 751993484 752623138 753410492 754262619 755087891 755848770 756548691 757181702 757716599
2323.2 757716599 758128433 758411407 758541641 758458328 758120728 757589951 757022095 756561203 756258545 756111526
2332.8 756111526 756152115 756442337 756976395 757615738 758144150 758380432 758244705 757766571 757080231 756382599
2342.5 756382599 755819092 755368881 754883423 754299850 753798828 753693771 754135971 754955597 755815353 756493759
2352.1 756493759 756995697 757429733 757861786 758305511 758784943 759314651 759803543 760024872 759740677 758882751
2361.8 758882751 757637177 756363907 755413132 754949265 754883652 754962158 754943390 754722443 754303665 753684387
2371.4 753684387 752809830 751662369 750365219 749152145 748210602 747559662 747077103 746623917 746131516
2380.1G46131516n34363n62287n81588n91584n80291n35126m51737l37677k16980j17187
2389.7G41622696m9133l510J8311j2284j23825k86102m06189m01154k85797j66702
2399.4G39906311j42212k11334k90146l10822k91366k95181l43094l84140l55606k52076
2409G37030334j22070j3046O1951J09024J26266J06201N1956k3727j09100j88980k29798
2419.6G36799011j96457r5596J3733O6452N3177J7776k136j6022n1727j04752j32980
2430.2G36350479j04523l6010K1896L1967j983m2649n3253k7924J221j2207q5220j83869
2441.8G35857925k47650k39486j77079j12610r1171j18027j61438j80816j62201j34812
2451.5G34232635j50527k31019l35388l92151l68957l08075k80991l12576l61557l73383
$$ plain form
2380.1 746131516 745597153 745034866 744453278 743861694 743281403 742746277 742294540 741956863 741739883 741622696
2389.7 741622696 741573563 741570053 741588364 741576080 741452255 741166153 740759964 740358810 740073013 739906311
2399.4 739906311 739764099 739552765 739262619 738951797 738660431 738365250 738022156 737638016 737282410 737030334
2409 737030334 736908264 736895218 736957169 737066193 737192459 737298660 737350616 737326889 737217789 737028809 736799011
2419.6 736799011 736602554 736506958 736520691 736587143 736640320 736658096 736655960 736639938 736588211 736483459 736350479
2430.2 736350479 736245956 736209946 736231842 736263809 736261826 736219177 736165924 736138000 736139221 736127014 736041794 735857925
2441.8 735857925 735610275 735370789 735193710 735081100 734989929 734871902 734710464 734529648 734367447 734232635
2451.5 734232635 734082108 733851089 733515701 733123550 732754593 732446518 732165527 731852951 731491394 731118011
2461.1G31118011l39050k89764k54364k31400k12402k04315k20185k43911k32392j59530
2470.7G28730698n5008J2359m730q2626j46790j39618o7749J5488P2021J12610J70594
2481.3G28617249K49328L07388L06855K58484K12783J98212J82266J07804l3188j68839
2491G30238342k05459j14289L7995J45950J49994P3929r384m3717k5177L967j144n1498
2502.6G30199509j11313j28250q0719n036L2654m043q5984j46179j42441r6283o6833
2513.2G29365082r6741j74942k51846k84195k64359k19726j82038j60904j47857j39847
2522.8G27442627j54190k07977k86255l41873l37983k86483k34681k13470k07520j83258
2532.5G24988937j38092j06430j24893j91574k69394l15247l06854k50168j74865j19477
$$ plain form
2461.1 731118011 730778961 730489197 730234833 730003433 729791031 729586716 729366531 729122620 728890228 728730698
2470.7 728730698 728675690 728688049 728683319 728600693 728453903 728314285 728246536 728262024 728334045 728446655 728617249
2481.3 728617249 728866577 729173965 729480820 729739304 729952087 730150299 730332565 730440369 730407181 730238342
2491 730238342 730032883 729918594 729956589 730102539 730252533 730326462 730317078 730273361 730248184 730252151 730251007 730199509
2502.6 730199509 730088196 729959946 729879227 729874191 729906845 729902802 729816818 729670639 729528198 729431915 729365082
2513.2 729365082 729268341 729093399 728841553 728557358 728292999 728073273 727891235 727730331 727582474 727442627
2522.8 727442627 727288437 727080460 726794205 726452332 726114349 725827866 725593185 725379715 725172195 724988937
2532.5 724988937 724850845 724744415 724619522 724427948 724158554 723843307 723536453 723286285 723111420 722991943
2542.1G22991943j04828j12838j02387m9667K3727P5989R2239R7580J24283J75171
2551.7G23211212K27051K57263K56958K16141J24206o103j23520j70517j38092p5607
2561.4G23778992m0284m1809m7073l5019l0975p6599j71585k66419l09830l01742k86179
2572G22171478k96554l19519l14789k68784k11334j85013k03476k47268k95258l46603
2581.6G19482880m08326m67681m88663m38233l12728j46103M196P8354M4555p4463
2591.3G17273788k01797k54517k07901j14517m4632j9073L280O1722J37787J70441
2600.9G16804581J26037L7384k8686l8223r919J6022K8992M7683Q9570J40457J67083
2611.5G17380981J48697R4529L0746k5101p5607j25580j66244j75324j36871o7368
$$ plain form
2542.1 722991943 722887115 722774277 722671890 722622223 722645950 722721939 722814178 722911758 723036041 723211212
2551.7 723211212 723438263 723695526 723952484 724168625 724292831 724286728 724163208 723992691 723854599 723778992
2561.4 723778992 723738708 723696899 723649826 723614807 723583832 723507233 723335648 723069229 722759399 722457657 722171478
2572 722171478 721874924 721555405 721240616 720971832 720760498 720575485 720372009 720124741 719829483 719482880
2581.6 719482880 719074554 718606873 718118210 717679977 717367249 717221146 717225342 717303696 717348251 717273788
2591.3 717273788 717071991 716817474 716609573 716495056 716450424 716431351 716434631 716496353 716634140 716804581
2600.9 716804581 716930618 716968002 716939316 716901093 716891174 716907196 716936188 716983871 717073441 717213898 717380981
2611.5 717380981 717529678 717624207 717654953 717629852 717554245 717428665 717262421 717087097 716950226 716882858
2621.2G16882858j3809k3651j03378k08130k77405k87323k64511k45514k29340j84173
2630.8G15045624r7275m349M7760N8594O8741R6359J00327K9449r7809j94397j91116
2641.4G14861908j08337k7314L281M349J5793L2882J4038n8899j44882j80206j33362
2652G14279251k6245R5139J90124K35825K20871J44119J9531j19400k28653k73514
2661.7G14537048k50015j89209j30081q9493n6610k2659o104l8910j25656k30102l03421
2672.3G13094788l22419k94647k37121j64414r8572o6909q3466j30310j75018k03400
2681.9G11318512k26593k50931k59628k30484j67313r9106m6844j0452J1901M044n7449
2692.5G09985657j61515k60772l02887k73056j95771j08489l9368o87J0376N798n111
$$ plain form
2621.2 716882858 716869049 716845398 716742020 716533890 716256485 715969162 715704651 715459137 715229797 715045624
2630.8 715045624 714948349 714944000 714991760 715050354 715119095 715215454 715315781 715345230 715247421 715053024 714861908
2641.4 714861908 714753571 714726257 714729538 714733887 714749680 714782562 714796600 714737701 714592819 714412613 714279251
2652 714279251 714253006 714348145 714538269 714774094 714994965 715139084 715158615 715039215 714810562 714537048
2661.7 714537048 714287033 714097824 713967743 713878250 713821640 713798981 713792877 713753967 713628311 713398209 713094788
2672.3 713094788 712772369 712477722 712240601 712076187 711977615 711910706 711827240 711696930 711521912 711318512
2681.9 711318512 711091919 710840988 710581360 710350876 710183563 710084457 710037613 710027161 710039062 710043106 709985657
2692.5 709985657 709824142 709563370 709260483 708987427 708791656 708683167 708643799 708643112 708653488 708659286 708654175
2703.1G08654175l0289r3613k04010l29818m13742m17252l52020k63825j92794j56327
2712.8G06200485j62277k21939l36227m75541n84716o19126n69153m51202k79541o4316
2722.4G02436447J54038K90832K61841O7749j76239l16086k81067j37710j4801J6403
2732.1G02301407r537j9150J2207L8758O256q6746j91117k58865k85111k97851l18146
2742.7G00892105l28674k92511j98288r2621n4398j32141k95028m55704n35889n20248
2752.3F97986603m45328l56216k78473k24915k10876k45667l21731m12064m89273n36346
2762F94465714n44510n06363m21524l01743j75552q1101n1498r6665j85089k57568
2771.6F91844101k67639k23847j79672j73111j82037j51367o3019L3188O4773R384
$$ plain form
2703.1 708654175 708623886 708530273 708326263 707996445 707582703 707165451 706813431 706549606 706356812 706200485
2712.8 706200485 706038208 705816269 705480042 705004501 704419785 703800659 703231506 702780304 702500763 702436447
2722.4 702436447 702590485 702881317 703143158 703210907 703034668 702718582 702437515 702299805 702285004 702301407
2732.1 702301407 702291870 702272720 702284927 702323685 702329941 702243195 702052078 701793213 701508102 701210251 700892105
2742.7 700892105 700563431 700270920 700072632 699980011 699925613 699793472 699498444 699042740 698506851 697986603
2752.3 697986603 697541275 697185059 696906586 696681671 696470795 696225128 695903397 695491333 695002060 694465714
2762 694465714 693921204 693414841 692993317 692691574 692516022 692434921 692383423 692286758 692101669 691844101
2771.6 691844101 691576462 691352615 691172943 690999832 690817795 690666428 690603409 690636597 690701370 690710754
2781.3F90710754r5367j96610k70462l20434l50113l61252l64227l70102l65753l15705
2790.9F87700729k08282r3994n3711j20773k43454l30964l36227k82211k18506j68381
2800.5F85644226j24741q6975q1024j37939k55890l87116m70275m72641m14429l54462
2810.2F82858734l44162l91693m63104n16892n40771n57022n99137o85424q11768r62067
2819.8F76986694j117859j269226j422500j609116j874084k251664k737045l282394
2827.6F61422806l820877m291458m648514m864350m939880m918899m859391m740982
2835.3F24338455m371834l415794j598663J016502L916435O324654P595138P541619
2843F41346512O470947M939041L437729K220078J322708O80542K25067q9035k93579
$$ plain form
2781.3 690710754 690615387 690418777 690148315 689827881 689477768 689116516 688752289 688382187 688016434 687700729
2790.9 687700729 687492447 687398453 687344742 687223969 686980515 686649551 686313324 686031113 685812607 685644226
2800.5 685644226 685519485 685432510 685351486 685213547 684957657 684570541 684100266 683627625 683213196 682858734
2810.2 682858734 682514572 682122879 681659775 681142883 680602112 680045090 679445953 678760529 677948761 676986694
2819.8 676986694 675868835 674599609 673177109 671567993 669693909 667442245 664705200 661422806
2827.6 661422806 657601929 653310471 648661957 643797607 638857727 633938828 629079437 624338455
2835.3 624338455 619966621 616550827 614952164 615968666 619885101 626209755 633804893 641346512
2843 641346512 647817459 652756500 656194229 658414307 659737015 660417557 660642624 660553589 660260010
2851.7F60260010m18396m86832n03082m49829l13111j15432P3013J71890J53351O8893
2861.3F58440475K137p477J4191K8305L9901Q6975J75477K54287K59781J79215M9820
2871.9F59523087r2011k33154l59574m34341m28085l66974l23181l47138m25033n10102
2881.6F56003494n85708o79627q21838j000519j170120j288300j345138j365509j393967
2890.2F46352768j468048j589279j722565j832657j926803k039567k175750k273484
2897.9F31324615k248153k079125j846923j672211j624375j682815j781654j876565
2905.7F16512794j964569k052459k117653k111893k000732j787834j497040j136360
2913.4F01844254p02248k25220K06185N00755O56929P77206R70650J234589J447601
$$ plain form
2851.7 660260010 659841614 659354782 658851700 658401871 658088760 657973328 658046341 658218231 658371582 658440475
2861.3 658440475 658442612 658435135 658449326 658477631 658517532 658604507 658779984 659034271 659294052 659473267 659523087
2871.9 659523087 659431076 659197922 658838348 658404007 657975922 657608948 657285767 656938629 656513596 656003494
2881.6 656003494 655417786 654738159 653916321 652915802 651745682 650457382 649112244 647746735 646352768
2890.2 646352768 644884720 643295441 641572876 639740219 637813416 635773849 633598099 631324615
2897.9 631324615 629076462 626997337 625150414 623478203 621853828 620171013 618389359 616512794
2905.7 616512794 614548225 612495766 610378113 608266220 606265488 604477654 602980614 601844254
2913.4 601844254 601142006 600916786 601122971 601623726 602280655 603057861 604028511 605263100 606710701
2922.1F06710701J484337J324272J049728P49703M51469J31455k32582o26831j001130
2930.7F10041122j282196j394310j294021r97429n64995n9471M71954R72634J352691
2939.4F07245979J528550J481437J268654R56192N64079R6054l79142p16439p86247
2948.1F11259117n86853k50244N8365K39143K77710K01378L8795j83410m43573p40013
2957.7F09870415j087418j476440j829186k008018j894341j470184q34084j36795M98619
2966.4E99632568J019822J438293J797180K139321K479209K784615K990761L042946
2974.1F17324715K940406K737389K492561K223359J908760J535453J128884P41119
2981.8F33032646M11797J51481m7149j97106l17535m35295n70297p25022q88672j057014
$$ plain form
2922.1 606710701 608195038 609519310 610569038 611318741 611770210 611901665 611669083 611042252 610041122
2930.7 610041122 608758926 607364616 606070595 605073166 604508171 604448700 604920654 605893288 607245979
2939.4 607245979 608774529 610255966 611524620 612480812 613044891 613140945 612761803 612045364 611259117
2948.1 611259117 610672264 610422020 610480385 610719528 610997238 611198616 611237411 611054001 610610428 609870415
2957.7 609870415 608782997 607306557 605477371 603469353 601575012 600104828 599270744 599133949 599632568
2966.4 599632568 600652390 602090683 603887863 606027184 608506393 611291008 614281769 617324715
2974.1 617324715 620265121 623002510 625495071 627718430 629627190 631162643 632291527 633032646
2981.8 633032646 633444443 633595924 633548775 633351669 633034134 632598839 632028542 631303520 630414848 629357834
2991.5F29357834j231156j404800j558609j682320j786460j880837j941223j916695
2999.2F15955734j786918j616478j521798j568870j680908j655999j304817o09932
3006.9F04210014K19193Q56781J062507Q17681L03993k42844o68563r36928j082268
3015.6F04539566j158562j206131j232757j203919j078796q78487p12661o93932q05283
3024.3E95569038q58001o20842j3581Q17986J608047K153855K405243K423515K285461
3033F05770721K034989J696548J299401Q81347M76456J10359j97182m29534n74151
3041.6F11068954o21223n60989l90969j27601J93138N30319Q50639J124001J311874
3050.3F13378143J377144J312905J159400R76143P95441O13136M19846K41127J26228
$$ plain form
2991.5 629357834 628126678 626721878 625163269 623480949 621694489 619813652 617872429 615955734
2999.2 615955734 614168816 612552338 611030540 609461670 607780762 606124763 604819946 604210014
3006.9 604210014 604429207 605285988 606348495 607166176 607470169 607227325 606558762 605621834 604539566
3015.6 604539566 603381004 602174873 600942116 599738197 598659401 597780914 597068253 596374321 595569038
3024.3 595569038 594711037 594090195 594076614 594894600 596502647 598656502 601061745 603485260 605770721
3033 605770721 607805710 609502258 610801659 611683006 612159462 612269821 612072639 611643105 611068954
3041.6 611068954 610447731 609886742 609495773 609368172 609561310 610091629 610942268 612066269 613378143
3050.3 613378143 614755287 616068192 617227592 618203735 618999176 619612312 620032158 620273285 620399513
3059F20399513J02005J50528K39868L62397N27877P16401Q55674Q65212P21817M76227
3068.6F25417519K06871l5553k38228m01535n15862n65681n44815m63524l52020k61765
3078.3F22245407k47726l37105n08881p07779q71429r34830q19549m61121J15585P49550
3087.9F18222122J207047J330452J134834P69806L99742J19743m8370j30768j89705
3096.6F22814903k95562m76723o85044q44917r34524j002694j089630j159858j140290
3105.3F15185661j022796q95424q53806r02748r66148r83773r75074j001282j084709
3114F06499901j191673j276360j324921j344108j330757j268769j155204j015740q89053
3122.6E95703316p96356p33796o78444o03370m93851l63541k63404k54860l58620n20935
$$ plain form
3059 620399513 620501518 620652046 620891914 621254311 621782188 622498589 623354263 624219475 624941292 625417519
3068.6 625417519 625624390 625588837 625350609 624949074 624433212 623867531 623322716 622859192 622507172 622245407
3078.3 622245407 621997681 621660576 621151695 620443916 619572487 618637657 617818108 617356987 617472572 618222122
3087.9 618222122 619429169 620759621 621894455 622664261 623064003 623183746 623135376 623004608 622814903
3096.6 622814903 622519341 622042618 621357574 620512657 619578133 618575439 617485809 616325951 615185661
3105.3 615185661 614162865 613267441 612413635 611510887 610544739 609560966 608585892 607584610 606499901
3114 606499901 605308228 604031868 602706947 601362839 600032082 598763313 597608109 596592369 595703316
3122.6 595703316 594906960 594173164 593494720 592891350 592397499 592033958 591770554 591515694 591157074 590636139
3132.3E90636139o42281o51817n61676m51164m03214m47922n53245o55365o96106o55556
3141.9E84917793n61599m70620m21905m03824l61786k54097r4452N2948J18294P4654
3151.6E82595406m8562j79443k38342j79558k4643J42021K21901J74141M8142n3978
3161.2E82457085o2332K288N0888J1177j04293k15645k56920k36931k21825k66342
3170.9E81157150l69796m88396n73921n95742n51452m75426m28734m54330n28908n73082
3180.5E76117363n28870m21867l38440l38173l98521m51660m58832m47693m81415n98678
3190.1E71653214p73621r23386r57565q51440o81420n79872o31218q02193r83276j097259
3199.8E63371964j167527j274833j455384j653213j778221j803398j794854j838150
$$ plain form
3132.3 590636139 589993858 589342041 588780365 588329201 587925987 587478065 586924820 586269455 585573349 584917793
3141.9 584917793 584356194 583885574 583463669 583059845 582698059 582443962 582349510 582402458 582520752 582595406
3151.6 582595406 582546844 582367401 582129059 581949501 581924858 582066879 582288780 582462921 582511063 582457085
3161.2 582457085 582394753 582397041 582447929 582459106 582354813 582139168 581882248 581645317 581423492 581157150
3170.9 581157150 580787354 580298958 579725037 579129295 578577843 578102417 577673683 577219353 576690445 576117363
3180.5 576117363 575588493 575166626 574828186 574490013 574091492 573639832 573181000 572733307 572251892 571653214
3190.1 571653214 570879593 569956207 568998642 568147202 567465782 566885910 566254692 565452499 564469223 563371964
3199.8 563371964 562204437 560929604 559474220 557821007 556042786 554239388 552444534 550606384
3207.5E50606384j938514k010727j974373j851197j744995j717376j712494j626015
3215.2E36030693j440124j256600j173591j162148j097717r11789o75164n09529m40635
3223.9E27363396l70980j98974O8626L30620N01251N77431O07796O25686O30608O24428
3233.5E30759888O42433P31735R01604J101265J250000J300964J274109J232223J216965
3242.2E40411186J215821J189231J124611J050759J004066R91097R98420J024819J082840
3250.9E50092850J164360J218719J185074J047897Q55637O84586N91240N89065O50597
3259.6E58080025P20901P41005O82144N66025M45709L60833L15551K94342K88048K86980
3269.2E62781563K63481J74065R53k20337m15496n22156n33829n05333n21812o47087
$$ plain form
3207.5 550606384 548667870 546657143 544682770 542831573 541086578 539369202 537656708 536030693
3215.2 536030693 534590569 533333969 532160378 530998230 529900513 528988724 528313560 527804031 527363396
3223.9 527363396 526992416 526793442 526862068 527192688 527693939 528271370 528879166 529504852 530135460 530759888
3233.5 530759888 531402321 532134056 533035660 534136925 535386925 536687889 537961998 539194221 540411186
3242.2 540411186 541627007 542816238 543940849 544991608 545995674 546986771 547985191 549010010 550092850
3250.9 550092850 551257210 552475929 553661003 554708900 555564537 556249123 556840363 557429428 558080025
3259.6 558080025 558800926 559541931 560224075 560790100 561235809 561596642 561912193 562206535 562494583 562781563
3269.2 562781563 563045044 563219109 563220062 562999725 562584229 562062073 561528244 561022911 560501099 559854012
3278.9E59854012q79822j152573j381798j528663j607895j638336j596680j434403
3286.6E48633842j142425p89375m90837l38936l54233m88091o64558q28705r73472
3295.3E42563210j123391j289405j443100j544381j594505j641731j728554j846466
3303E30351677j962471k079163k235450k440415k630119k719689k700843k658577k681313
3311.7E08243637k772713k863998k900810k898407k911568k976570l093643l251076
3319.4D84574852l438721l639030l825035l979035m102707m201202m259834m250374
3327.1D52878914m160881l998566l760910l409386k891159k188034j335830m03138
3334.8D30731010N43290J454239K303657L090439L828506M510804N081214N465851
$$ plain form
3278.9 559854012 558974190 557821617 556439819 554911156 553303261 551664925 550068245 548633842
3286.6 548633842 547491417 546702042 546211205 545872269 545518036 545029945 544365387 543536682 542563210
3295.3 542563210 541439819 540150414 538707314 537162933 535568428 533926697 532198143 530351677
3303 530351677 528389206 526310043 524074593 521634178 519004059 516284370 513583527 510924950 508243637
3311.7 508243637 505470924 502606926 499706116 496807709 493896141 490919571 487825928 484574852
3319.4 484574852 481136131 477497101 473672066 469693031 465590324 461389122 457129288 452878914
3327.1 452878914 448718033 444719467 440958557 437549171 434658012 432469978 431134148 430731010
3334.8 430731010 431274300 432728539 435032196 438122635 441951141 446461945 451543159 457009010
3342.5D57009010N645943N693054N713310N755082N781250N727958N570031N323905
3350.2E02219543N006257M622917M198112L791695L469353L254470L113861K986451
3357.9E32662659K817611K581063K287178J976204J694145J462555J281738J151314
3365.7E47914467J073036J022110R33456P53289N11932L11508K26555K22283J99050
3374.3E53167686J11657J5182j7586M387N036n8556j41830j75400j53465j43128k06070
3384.9E52407913l37448m77219n64651n76744n35660m89731m87594n37720n96237o04668
3394.6E47200241n47142m65546m12674m03289m19808m49486m94194n48057n85671n87730
3404.2E42286644n66216n46608n35621n24407n18913n41839n93071o25763n90096m95338
$$ plain form
3342.5 457009010 462654953 468348007 474061317 479816399 485597649 491325607 496895638 502219543
3350.2 502219543 507225800 511848717 516046829 519838524 523307877 526562347 529676208 532662659
3357.9 532662659 535480270 538061333 540348511 542324715 544018860 545481415 546763153 547914467
3365.7 547914467 548987503 550009613 550943069 551696358 552208290 552519798 552746353 552968636 553167686
3374.3 553167686 553279343 553294525 553276939 553281326 553286362 553227806 553085976 552910576 552757111 552613983 552407913
3384.9 552407913 552070465 551593246 551028595 550451851 549916191 549426460 548938866 548401146 547804909 547200241
3394.6 547200241 546653099 546187553 545774879 545371590 544951782 544502296 544008102 543460045 542874374 542286644
3404.2 542286644 541720428 541173820 540638199 540113792 539594879 539053040 538459969 537834206 537244110 536748772
3413.9E36748772m06342l74298l85895l93829l83072l84636m19884m55131m26903l14941
3423.5E32803841j78261j09406j49345k52457l35655l58925l48053l39165l17115k43683
3433.2E30171776j40228j03302j96763l45191l80745k24457J9836J80512K15149K33230
3442.8E29429817L19557L97530L27415J17836m0473J6174K26822L75137L36952K07367
3452.5E31714134J56670K18773K74772K30942J46752J56593K98843M67835N26161M36630
3462.1E34628105K71568J31836Q1063J31378K53715L84484M53682M32090L51868K76718
3471.7E37396507K50435K81334L58429M62532N61409O12450N84984M76722L10555J31492
3481.4E41426849J0186K3231J95389M53873O68945P52258P13654O19125N17807M29154
$$ plain form
3413.9 536748772 536342430 535968132 535582237 535188408 534805336 534420700 534000816 533545685 533118782 532803841
3423.5 532803841 532625580 532516174 532366829 532114372 531778717 531419792 531071739 530732574 530415459 530171776
3433.2 530171776 530031548 529928246 529731483 529386292 529005547 528781090 528800926 528981438 529196587 529429817
3442.8 529429817 529749374 530146904 530474319 530592155 530551682 530567856 530794678 531169815 531506767 531714134
3452.5 531714134 531870804 532089577 532364349 532595291 532742043 532898636 533197479 533665314 534191475 534628105
3462.1 534628105 534899673 535031509 535112572 535243950 535497665 535882149 536335831 536767921 537119789 537396507
3471.7 537396507 537646942 537928276 538286705 538749237 539310646 539923096 540508080 540984802 541295357 541426849
3481.4 541426849 541437035 541460266 541655655 542109528 542778473 543530731 544244385 544863510 545381317 545810471
3491E45810471L77426L94592M73824N48172N48362M72832L86543L50342L62282L72124
3500.7E50096970L39660K83242K77671L93639O13937Q09365Q31527O57730M29612L15284
3510.3E55048637L46871M16832M29649M07028M23546M89273N50881N88531O45142P34520
3520E60080910P74498O70089M43726K42806J99890L14712M76647N77316N87425N54123
3529.6E64922142N53818O31904P52182Q08182P18231N25475L80745M00886N56527P15293
3539.2E70965385P79992P60879P13158O46438N24674L48511K07748K29492M65698Q17757
3548.9E76459732J082954J100274Q84285O18324M96673N62897P06368Q00361Q13141
3557.6E83525009P74841O93245N65987M67529N35736P99485J053314R99222N68466
$$ plain form
3491 545810471 546187897 546582489 547056313 547604485 548152847 548625679 549012222 549362564 549724846 550096970
3500.7 550096970 550436630 550719872 550997543 551391182 552005119 552814484 553646011 554303741 554733353 555048637
3510.3 555048637 555395508 555812340 556241989 556649017 557072563 557561836 558112717 558701248 559346390 560080910
3520 560080910 560855408 561525497 561969223 562212029 562411919 562726631 563203278 563780594 564368019 564922142
3529.6 564922142 565475960 566107864 566860046 567668228 568386459 568911934 569292679 569693565 570250092 570965385
3539.2 570965385 571745377 572506256 573219414 573865852 574390526 574739037 574946785 575176277 575641975 576459732
3548.9 576459732 577542686 578642960 579527245 580145569 580642242 581205139 581911507 582711868 583525009
3557.6 583525009 584299850 584993095 585559082 586026611 586562347 587361832 588415146 589414368 589982834
3566.2E89982834O7787o4583L27416R66034J406898J429482J162719Q82416P57218
3574.9E96918221P94792R39750J133576J276665J238365R88426P03125O52656R21021
3583.6F05566597J256294J266709Q10279J82381j11542K01531R25636J570397J751022
3592.3F13419304J452370R60846O05506N43633P21703R57946J061402R45282O92291
3601F21360283N11055N69916Q33854J075058J071091Q07991N00412M09737O21147R53407
3610.6F28713951J086617Q49113M43077L34091P90902J494255J740455J163140K11486
3619.3F36827087k57034J19743Q66013J310196J378059J495285J773911J677322P37992
3628F45928574n99900j240387o17599O42319J413192J252823O79398L79944M62188
$$ plain form
3566.2 589982834 590050621 589986038 590313454 591279488 592686386 594115868 595278587 596161003 596918221
3574.9 596918221 597713013 598652763 599786339 601063004 602301369 603289795 603992920 604645576 605566597
3583.6 605566597 606822891 608089600 608899879 609082260 608970718 609172249 610097885 611668282 613419304
3592.3 613419304 614871674 615832520 616438026 616981659 617703362 618661308 619722710 620667992 621360283
3601 621360283 621871338 622441254 623275108 624350166 625421257 626229248 626729660 627139397 627760544 628713951
3610.6 628713951 629800568 630649681 631092758 631426849 632217751 633712006 635452461 636615601 636827087
3619.3 636827087 636570053 636689796 637555809 638866005 640244064 641739349 643513260 645190582 645928574
3628 645928574 645328674 644088287 643470688 644113007 645526199 646779022 647458420 647838364 648300552
3636.6F48300552N79758N08270L42636K29950J96915K75116N54886R65423J169281
3645.3F53122787Q74863K06986m16565p49054q50296p44477k39181O85959J497192
3654F53388214J496887O66199j72424k47956K95945O72531M68063M3717j01471K8076
3663.6F56537781J60446L23028O94199R64661M40140q86765j784897r42840J285095
3672.3F56790848K839584K047653m86602k461472k286682n51605R33380J122284M69513
3681F58416901j0453J12305N46188Q51059Q17871M25873k18734q32291j049042p18002
3690.6F58341675n5390N59082Q81195Q78678O33011L01056J07269J89819M00467L81317
3700.3F62618179m0512n94787q01468m66385J35269N67551O39877M55322J51215k73285
$$ plain form
3636.6 648300552 648880310 649388580 649731216 649961166 650158081 650433197 650988083 651953506 653122787
3645.3 653122787 653997650 654204636 653788071 653039017 652188721 651444244 651205063 651891022 653388214
3654 653388214 654885101 655551300 655378876 655130920 655426865 656099396 656567459 656611176 656509705 656537781
3663.6 656537781 656698227 657021255 657715454 658680115 659120255 658233490 656448593 655505753 656790848
3672.3 656790848 659630432 661678085 661191483 658730011 656443329 655891724 656825104 657947388 658416901
3681 658416901 658406448 658518753 659064941 659916000 660733871 661159744 660941010 660108719 659059677 658341675
3690.6 658341675 658286285 658845367 659726562 660605240 661238251 661539307 661646576 661836395 662236862 662618179
3700.3 662618179 662577667 661982880 661181412 660715027 660850296 661417847 662057724 662513046 662664261 662390976
3709.9F62390976q17795j261520j234284n88379L39966R58557R64203N97458L02124
3718.6F61651306K04621P8735k04926m19540l16315m9972j1292k50702l53088r003
3728.3F60319824N11246O85425M02908J755l12805p18384j296005j632233j254349
3736.9F56707382l21274N08423R11255J182785J514588J404953K83432j401978k286911
3745.6F58502655j541214R8801J073074O43692n01862j214370j064301m37317J92719
3754.3F55751877O93283J040955J031646M78287l94440r64126p48368Q0719P81708
3763F57751541P37229Q5220m12369k14233L66516N29251k6703p02820p28454r6283
3772.6F57288895M96826N61676L30276K35901K18888j11313p39975j088791p26776
$$ plain form
3709.9 662390976 661573181 660311661 659077377 658488998 658828964 659787521 660751724 661349182 661651306
3718.6 661651306 661855927 661934662 661729736 661310196 660993881 660943909 660932617 660681915 660328827 660319824
3728.3 660319824 660831070 661516495 661919403 661921158 661608353 660889969 659593964 657961731 656707382
3736.9 656707382 656386108 656894531 657805786 658988571 660503159 661908112 662191544 660789566 658502655
3745.6 658502655 656961441 657060242 658133316 658777008 658275146 657060776 655996475 655559158 655751877
3754.3 655751877 656445160 657486115 658517761 658996048 658601608 657637482 656889114 656969833 657751541
3763 657751541 658488770 658573990 658161621 657947388 658313904 658843155 658816452 658113632 657385178 657288895
3772.6 657288895 657785721 658347397 658677673 658913574 659132462 659021149 658281174 657192383 656465607
3781.3F56465607K6245M49066K51312j76849l09143n7907K51236K89459J7624l20816
3790.9F56885834l96729r4986K76184K12403l57743p70416k96860P97959J236496J29318
3800.6F57621460j736984k483521j193695R48563J890487R31092o64521j264877o13937
3809.3F53434067K89535O67801P03812P67822N81360k97318j401977j517258k12326
3817.9F53015518J266632J211777m95453k092972j904983k29874J121597R67102p4539
3826.6F52784805o10809j81046M57840N06897N6305k59323j49002R8801J08642j59454
3836.3F52653656m88815o60935n50079j55029L21426N33218L00827j54724m17556l10059
3845.9F51071930o638K73438M99954O58875N10482k21023j381073k287369k264175
$$ plain form
3781.3 656465607 656491852 656940918 657192230 657015381 656706238 656648331 656899567 657189026 657206650 656885834
3790.9 656885834 656489105 656394119 656670303 656882706 656524963 655754547 655457687 656255646 657492142 657621460
3800.6 657621460 655884476 653400955 652207260 653155823 655046310 655977402 655312881 654048004 653434067
3809.3 653434067 653723602 654391403 655095215 655863037 656444397 656147079 654745102 653227844 653015518
3817.9 653015518 654282150 655493927 654998474 652905502 651000519 650770645 651892242 652859344 652784805
3826.6 652784805 652173996 651992950 652450790 652957687 653013992 652754669 652605667 652704468 652813110 652653656
3836.3 652653656 652164841 651503906 650953827 650798798 651120224 651653442 651954269 651799545 651381989 651071930
3845.9 651071930 651065292 651338730 651838684 652497559 653008041 652787018 651405945 649118576 646854401
3854.6F46854401j275635K5558Q71582R92356P12280N26276N90133N97992J87683n11627
3864.2F49570999q38699k73285Q22525J362839O44455p76368j577606j106872r3766
3872.9F47734222K59858k62070o88171j68992Q71659J215591L75137p50732r13925
3881.6F47672577J6098R14841P12738m10309j270065r84650J36795R89227P99332k01264
3891.2F48375320j107635j202393n02777L95966Q86612P77282L06473j36184l00675
3899.9F47491989k08435r2468j90659n12314p80792o68793j45568M30832O26449L37677
3909.6F46287918j30920l83759k76871K8534K69776K84195O5918k58255m90799m61502
3919.2F44934235j44043K95791N78079M75083k2202o44683r77479p64007j44653M29916
$$ plain form
3854.6 646854401 645578766 645604324 646475906 647468262 648180542 648706818 649296951 649894943 650082626 649570999
3864.2 649570999 648732300 648459015 649281540 650644379 651288834 650512466 648934860 647827988 647734222
3872.9 647734222 647994080 647732010 647043839 646874847 647746506 648962097 649337234 648586502 647672577
3881.6 647672577 647688675 648603516 649316254 648905945 647635880 646651230 646788025 647777252 648576584 648375320
3891.2 648375320 647267685 646065292 645562515 645958481 646845093 647622375 647928848 647792664 647491989
3899.9 647491989 647283554 647191086 647000427 646488113 645707321 645038528 644892960 645323792 645950241 646287918
3909.6 646287918 646156998 645773239 645496368 645524902 645794678 646078873 646144791 645886536 645395737 644934235
3919.2 644934235 644790192 645085983 645664062 646139145 646116943 645472260 644494781 643730774 643586121 644016037
3928.8F44016037N80597K97470j32294m27780m87213l48358j13602P2174R9945K0981
3938.5F43577957m043M9362j0147k94342n59235m38690L1586L65600K12479j95236
3948.1F42735291l64380j86234L739l5248j45874r9030K9526J4038j46637k47726k06681
3958.7F41350784j42212j31759j11237n9509p2022j59072j74027p1640m2725k04696
3968.4F40181885l35312j86920O5307K6856l01628n07279m24881l75023n40771n65415
3978F37036819j84402J45760j38817p02400p13883k31056k22321r11331j184463m41361
3987.7F32452545J6823j100884k517623j952057l10746j356163n466041o939316k403030
3996.3F10423508j446762k2066613o9734382j22936440
$$ plain form
3928.8 644016037 644596634 644894104 644761810 644334030 643846817 643498459 643384857 643457031 643556976 643577957
3938.5 643577957 643573914 643623276 643613129 643318787 642759552 642320862 642352448 642718048 642930527 642735291
3948.1 642735291 642370911 642184677 642188416 642153168 642007294 641908264 641937790 641951828 641805191 641557465 641350784
3958.7 641350784 641208572 641076813 640965576 640906067 640834045 640674973 640500946 640429306 640386581 640181885
3968.4 640181885 639846573 639659653 639724960 639751816 639450188 638942909 638518028 638143005 637602234 637036819
3978 637036819 636852417 636998177 636859360 636156960 635443077 635212021 634989700 634078369 632893906 632452545
3987.7 632452545 632469368 631368484 628850861 626898804 626588058 625231895 619765854 612826538 610423508
3996.3 610423508 608976746 586910133 517175751 394239311
4000.2C94239311
$$ plain form
4000.2 394239311
##END=$$ End of the data block
