##TITLE=$$ Begin of the data block
##JCAMP-DX=5.00 $$ ACD/SpecManager v 10.08
##SPECTROMETER/DATA SYSTEM=Varian
##DATE=30 Apr 2013 14:47:38
##DATA TYPE=INFRARED SPECTRUM
##DATA CLASS=XYDATA
##ORIGIN=
##OWNER=
##NPOINTS=3735
##FIRSTX=399.26403809
##LASTX=4000.35498047
##MAXX=4000.35498047
##MINX=399.26403809
##MAXY=68.48789978
##MINY=3.02759075
##XFACTOR=1.0000000000
##YFACTOR=0.000000100000000
##FIRSTY=35.26379776
##DELTAX=0.96440572
##XUNITS=1/CM
##YUNITS=TRANSMITTANCE
##XYDATA=(X++(Y..Y))
399.3 352637978 464818573 527820511 544939156 540563698 535994530 536620407 537816582 536369629
407 536369629 533675766 531422691 528804207 524628563 519613304 515107956 510739517 504917412 497549820
415.7 497549820 491190338 489195938 493157997 502040024 513084602 523293953 530744591 535291252
423.4 535291252 538106766 540253754 541715584 541975479 541283226 540785446 541265526 542176819 542261086
432.1 542261086 540939217 538791733 536782875 535350533 534258842 532982330 531048965 528265572
439.8 528265572 524938240 521848984 519735260 518615913 517644005 515662003 511924896 506402702 499586945
448.4 499586945 492076988 484187546 475724640 466058655 454517479 440934677 426149788 412322998
456.2 412322998 402817841 401262665 409807281 427514343 450254173 472553329 490220909 501906357
463.9 501906357 508712044 512584381 514889946 516010818 515814285 514333115 512077522 509791679 507907143
472.6 507907143 506184807 503889465 500363350 495494041 489693756 483468781 476982651 469924583
480.3 469924583 461712227 451883659 440519524 428536873 417677841 410088387 407605782 411082306
488 411082306 420087700 433112564 448106880 463054008 476364326 487048912 494734001 499558372
495.7 499558372 501967659 502465134 501454926 499259338 496220551 492674599 488730354 484072990 478100891
504.4 478100891 470380478 460963745 450170937 438091583 424611435 410341072 397605896 390067444
512.1 390067444 390621338 399126320 412095757 424803543 433955688 438674965 439442406 436624184
519.8 436624184 430130386 420055885 407087021 392153587 376055908 359861679 345745163 337148056
527.5 337148056 337666817 349270897 371076279 399483910 429579315 456989822 479226456 495906906
535.2 495906906 507969666 516583481 522502060 526091385 527691612 527854004 527273560 526538963 525921822
543.9 525921822 525351486 524598198 523526573 522208366 520803337 519371643 517850227 516215935 514597244
552.6 514597244 513166313 511923981 510645294 509056473 507058258 504787560 502507401 500452614
560.3 500452614 498730316 497295418 495993385 494644928 493113213 491296463 489089050 486414032
568 486414032 483350449 480220871 477476044 475401611 473869858 472376633 470380211 467692299 464592438
576.7 464592438 461557579 458842850 456304131 453608856 450576401 447269096 443774147 439988976
584.4 439988976 435677986 430687866 425021400 418708687 411698380 403880043 395065575 384853554
592.1 384853554 372738762 358861961 345032082 334868240 332270470 338944550 352885628 369192276
599.9 369192276 382686043 390354347 391974602 388948860 382723312 374067535 363331985 350865936
607.6 350865936 336948166 321492348 304360733 286560478 271370983 263904858 268621216 286201420
615.3 286201420 312149391 338390465 356920700 363243637 357939301 346209068 336009598 335201645
623 335201645 348220367 373709526 405034561 434021111 455429382 468617477 475363121 476674881
630.7 476674881 472302284 463276978 453923798 450069580 454565010 464649277 474033852 477705269
638.4 477705269 474908333 468140373 460109749 451821060 442744980 431846123 418467789 403278351
646.2 403278351 389241714 381325150 383965034 397689209 417959747 437709923 451577072 458314323
653.9 458314323 459890862 458923035 456970901 454544983 451824455 448993301 446151581 443294792 440459518
662.5 440459518 437721825 434979630 431873207 428090096 423779602 419570694 416087570 413409233
670.3 413409233 410997047 408144836 404517326 400303383 395923920 391634293 387387848 383003387
678 383003387 378387451 373583946 368663902 363624153 358386459 352854042 346968460 340785637 334564514
686.7 334564514 328757172 323798218 319792404 316380997 312927589 308841820 303727684 297325916
694.4 297325916 289548168 280791454 272229729 265528679 261893692 261132030 261606293 261219959 258638878
703.1 258638878 253784542 247389011 240225239 232712116 225018768 217313595 209846058 202875824
710.8 202875824 196603794 191172962 186693382 183264713 180993023 179976444 180235500 181642113 183934174
719.5 183934174 186803436 189946747 193024426 195627213 197378445 198131447 198086700 197724266 197642078
728.1 197642078 198449345 200725937 204920330 211116772 218772755 226630039 232924309 235863190 234246216
736.8 234246216 228065224 218888397 209771557 204506321 206314735 216531334 234006252 255626431
744.5 255626431 277649727 297037010 312088757 322295952 327839012 329197121 326993141 321935616
752.2 321935616 314725704 305971127 296203136 285996017 276071472 267273788 260436611 256260300
760 256260300 255287056 257911301 264299946 274212875 286888828 301157131 315717335 329359741
767.7 329359741 340992928 349588509 354236488 354365997 350040283 342243347 333105087 325879097
775.4 325879097 324363213 331684151 348923302 374422989 404320641 434061813 460018349 480366974
783.1 480366974 494979019 504709511 510684090 513931541 515298462 515418816 514655266 513121147 510826759
791.8 510826759 507799797 504036331 499390259 493613777 486494408 477815666 467188263 454294586
799.5 454294586 439863777 426610641 418737144 419614944 429243469 443786545 457832260 467540092
807.2 467540092 472155151 473114662 472133636 470069275 467038765 462984123 457899361 451709938 444198570
815.9 444198570 435109749 424255219 411516991 396851540 380368156 362340622 342973518 322019196
823.6 322019196 298701935 272414608 244094028 217277603 197463341 189359360 193616581 205870628
831.3 205870628 219622097 231162777 242470455 259381084 286518898 323369560 364575806
838.1 364575806 403456688 435228920 457767906 470851135 475893784 476365318 477233086 482574692
845.8 482574692 492968979 505156860 514438515 517650261 514289017 505470352 492313156 475207443
853.5 475207443 454119492 429438362 403070335 379393234 365030937 366519585 386641846 422027893
861.2 422027893 464256172 503976021 535087090 556222153 569294777 577043877 581499176 583778458
868.9 583778458 584486961 584035912 582776718 581073875 579308891 577764854 576497040 575356293 574161758
877.6 574161758 572842979 571427269 569943848 568384476 566756363 565141754 563680000 562483444
885.3 562483444 561566391 560840530 560171127 559439392 558566666 557510605 556266899 554890976 553498459
894 553498459 552202454 551020126 549838943 548494987 546904068 545129433 543331909 541662521 540191307
902.7 540191307 538907013 537751007 536644096 535510025 534301109 533020935 531716614 530442696
910.4 530442696 529224167 528042183 526840210 525543175 524094124 522497749 520829544 519179268
918.1 519179268 517570114 515948067 514260483 512522125 510755234 508863373 506623764 503847427
925.8 503847427 500506477 496613884 491997147 486382942 479929924 473709145 469413605 468241501
933.6 468241501 469844818 472374802 473688011 472680550 469659233 465686531 461774292 458678360
941.3 458678360 457138252 457876472 461097221 466013756 471056404 474720917 476331177 476089935 474526329
949.9 474526329 471965218 468434982 463875961 458296623 451820869 444854736 438406487 434162903
957.7 434162903 433890152 438343277 446514664 455967026 464110641 469463768 471997871 472531929 471902466
966.3 471902466 470583115 468795013 466704597 464443855 462051506 459508667 456821404 453993607
974.1 453993607 450929794 447488670 443757401 440266418 437813301 436928101 437425575 438464127 439075546
982.7 439075546 438727913 437493782 435781631 433929901 432003174 429882660 427480278 424850006 422126999
991.4 422126999 419407425 416697388 413938217 411035004 407866402 404325333 400387115 396120720
999.1 396120720 391601410 386836090 381813889 376590118 371192398 365359306 358475609 350026207
1006.8 350026207 340338058 330873070 323521957 319190102 316728420 313224430 305759697 293568497
1014.6 293568497 278983135 266207600 258556728 256153564 255879097 253559151 246534328 234661407
1022.3 234661407 219491234 203015537 187289658 174782963 168341637 170232506 180982723 199089336
1030 199089336 221821747 246394386 270723610 293596401 314519577 333466110 350560226 365793915
1037.7 365793915 378960915 389857254 398531990 405319977 410637932 414775887 417878380 420080681
1045.4 420080681 421604195 422706261 423550682 424142342 424382172 424170074 423463364 422274704 420657692
1054.1 420657692 418710175 416564026 414334602 412061920 409704742 407186928 404436264 401382980
1061.8 401382980 397960625 394145966 389990883 385574303 380903969 375889015 370434074 364539528
1069.5 364539528 358265343 351587639 344305840 336079521 326521797 315327873 302591171 289374466
1077.2 289374466 278139839 272327118 274830837 286175461 303787746 323108368 339826393 351643486
1085 351643486 358510590 361622620 362274246 361353188 359410629 356827011 353830528 350483093 346775970
1093.6 346775970 342770195 338627243 334507256 330455322 326395416 322227478 317913380 313427219
1101.4 313427219 308593655 303034725 296470299 289287510 282854691 279052048 279128036 282727871 287949162
1110 287949162 292438221 294654617 294373894 292258739 289078579 285242386 280837688 275905685 270601559
1118.7 270601559 265116863 259523487 253809147 248201313 243514767 241068001 241992416 246358051
1126.4 246358051 252856598 259382496 264088516 266121292 265617256 263202248 259516125 255016613
1134.1 255016613 249972095 244488106 238562870 232205563 225540104 218772144 212045040 205351067
1141.9 205351067 198604259 191775379 184922600 178102303 171306229 164518814 157804136 151278019
1149.6 151278019 144973307 138761082 132428827 125830660 118961620 111925411 104887285 98067980
1157.3 98067980 91744833 86223478 81810265 78812575 77528272 78197279 80982447 86041403 93574734
1166 93574734 103649693 115827122 128972845 141611137 152665653 161959496 169982986 177107162
1173.7 177107162 182913342 186169186 185415344 179747982 169441051 156276836 143467960 134916735
1181.4 134916735 133680363 140170860 151388578 162391376 169719028 174512596 182558823 200550785
1189.1 200550785 231089420 270348091 310258217 343311005 366147690 379694595 386790619
1195.9 386790619 389878426 390297661 388759766 385834656 381970139 377372665 372074013 366080971
1203.6 366080971 359394341 351941872 343616371 334422302 324565964 314397240 304303570 294669323
1211.3 294669323 285868187 278183193 271646576 265937881 260478268 254715347 248418484 241765118
1219 241765118 235140953 228806419 222692356 216468048 209780674 202451229 194516716 186164589 177633781
1227.7 177633781 169095688 160531654 151695690 142237616 131916456 120750341 109058104 97506247
1235.4 97506247 87215300 79745722 76708202 79042530 86408606 97172337 109053249 120024519
1243.1 120024519 128949080 135709887 140927353 145480232 150018396 154611855 158675327 161247845
1250.8 161247845 161534576 159442348 155778456 151932249 149146786 147783289 147042770 145360918 141246748
1259.5 141246748 134040937 124161663 112807970 101437054 91365833 83628035 79005399 78097162
1267.2 78097162 81345596 88989172 100951366 116730919 135400524 155770311 176646652 197043648
1274.9 197043648 216255665 233822060 249470444 263084679 274676552 284329834 292119961 298049984
1282.7 298049984 302028770 303898983 303493824 300706253 295551167 288199463 278961010 268219051
1290.4 268219051 256365585 243811874 231079502 218888664 208145447 199853516 195066261 194890919
1298.1 194890919 200352783 211919670 228825932 248715897 268104229 283598499 293205490 296889687
1305.8 296889687 296040363 292288170 286611729 279468002 271804333 265889378 264806194 270533829
1313.5 270533829 282007065 294951458 303999557 305646839 299857044 289311543 277249870 265721149
1321.2 265721149 255261860 245614967 236496639 227859306 219798393 212449970 205986786 200606995
1328.9 200606995 196468334 193632679 192083549 191782780 192700176 194815350 198133125 202726421 208752308
1337.6 208752308 216388664 225709839 236592712 248732700 261748505 275278111 288994446 302571144
1345.3 302571144 315684032 328066330 339544563 349994926 359268990 367195053 373682747 378823624
1353.1 378823624 382872696 386121445 388779259 390952682 392690582 394009514 394875793 395211105 394969368
1361.7 394969368 394235687 393238945 392242737 391413460 390798645 390425301 390388298 390803413 391665001 392778511
1371.4 392778511 393864365 394740448 395405273 395958786 396467934 396901207 397148628 397063942 396511154 395436630
1381 395436630 393941765 392255402 390568657 388856773 386875763 384372444 381323242 377972832 374632874
1389.7 374632874 371426849 368210220 364729233 360863571 356729965 352554550 348450127 344328804
1397.4 344328804 340046463 335614052 331222038 327031250 322971802 318807373 314418907 309987717
1405.1 309987717 305860195 302242126 299055328 296080914 293188896 290394897 287740536 285197144
1412.8 285197144 282728233 280425396 278550282 277417126 277192669 277736378 278577747 279078197 278717060
1421.5 278717060 277331810 275138569 272524109 269789639 267026348 264147930 260992260 257435398
1429.2 257435398 253498230 249369583 245248566 241079502 236460514 230919571 224369831 217314453
1437 217314453 210620289 205148563 201615582 200645161 202635422 207312641 213416500 219067059 222734528
1445.6 222734528 224039631 223682022 222622852 221325798 219675617 217411270 214432507 210673542
1453.3 210673542 205888481 199844475 192869644 186132984 181166954 178911037 179111023 180616169
1461.1 180616169 182279415 183673840 185141735 187361221 190893478 195926189 202132473 208628750
1468.8 208628750 214199009 217823391 219177837 218667049 216964951 214522724 211480942 207922935
1476.5 207922935 204063129 200147419 196263123 192344379 188358669 184417896 180678768 177180462
1484.2 177180462 173801003 170332165 166545734 162235279 157312450 151935482 146487703 141311941
1491.9 141311941 136405401 131397362 125873356 119730463 113216076 106661491 100232086 93941679
1499.6 93941679 87829247 82030678 76654768 71649437 66851797 62170591 57676096 53490515
1507.3 53490515 49638915 46083560 42935114 40577145 39491417 39896407 41533842 43792477 46011271
1516 46011271 47670798 48396988 47955298 46362572 43985281 41411605 39128442 37289803 35777979
1524.7 35777979 34445412 33266201 32290814 31534581 30954945 30519986 30275908 30344634 30848727 31810930
1534.3 31810930 33127613 34702961 36658070 39355989 43112626 47855897 53157582 58654194
1542.1 58654194 64360204 70483785 77013216 83667078 90277891 97036276 104221096 111832924
1549.8 111832924 119725866 128052025 137250662 147439299 158100510 168767757 179991856 193158722
1557.5 193158722 208975773 226248913 242505512 255964203 266789284 276413898 285865364 294885139
1565.2 294885139 302450581 307826042 311150169 313428078 316236076 321185226 329119568 339487762
1572.9 339487762 350527802 360254059 367402382 371572990 372701530 370595284 364952812 355637894
1580.6 355637894 342835388 327051392 309125309 290247765 271806087 255008659 240496216
1587.4 240496216 228225842 217757645 208842049 201971169 198445835 199730568 206417561 217545929
1595.1 217545929 230818710 243521442 253412571 259052467 259669456 255013390 245430279 231987896
1602.8 231987896 216391373 200683060 186967697 177340794 173899956 178503513 192114162 214047470
1610.5 214047470 241791363 271805611 300933094 327462807 351134109 372277145 390968513
1617.3 390968513 406889839 419778709 429826469 437590866 443587303 448040886 451021271 452733116
1625 452733116 453593674 454026642 454241905 454252739 454041672 453588943 452697144 450900345 447732582 443183289
1634.6 443183289 437855148 432588997 427867851 423527412 418976479 413680840 407514725 400722389
1642.4 400722389 393498993 385512352 375913620 364090843 350565529 336894302 324202957 311631546
1650.1 311631546 296557446 276860619 253146133 228552494 206191292 186788883 168830738
1656.8 168830738 150764904 132797337 116646357 104013643 95582628 91238089 90721140 93886843
1664.5 93886843 100675478 111237345 126032476 145358658 168480148 193363209 217628498 239951992
1672.3 239951992 260509243 280086575 298981342 316921749 333853188 350374336 367194176
1679 367194176 384380264 401464195 418278580 435345497 453179512 471321983 488374443 503124771
1686.7 503124771 515551491 526659584 537437897 548087769 558168373 567267990 575448189 583161049
1694.4 583161049 590858269 598629761 606106606 612729454 618238678 622965012 627567825 632419701
1702.1 632419701 637272835 641563110 644986191 647695541 649992523 651971283 653524017 654558868
1709.9 654558868 655058823 654949341 654078522 652442856 650402451 648597717 647655792 647997055 649845657
1718.5 649845657 653243027 657926407 663237534 668323975 672564087 675834351 678356400 680324249
1726.3 680324249 681746063 682638321 683238907 683865128 684536819 684878998 684548111 683748779 683178940
1734.9 683178940 683361130 684074249 684552231 684241867 683277283 682189713 681269684 680320663 678980331
1743.6 678980331 677125473 674908295 672510757 669989395 667353058 664695511 662227478 660224457
1751.3 660224457 658938599 658460159 658589020 658908539 659113464 659294968 659813538 660835342 662061310
1760 662061310 663001328 663488770 663809738 664296875 664906311 665302887 665319824 665174408 665160675 665220413
1769.7 665220413 664957047 664089661 662801895 661579895 660751877 660245132 659762115 659088974 658203659
1778.3 658203659 657173843 656061935 654925232 653808365 652672043 651388626 649898300 648385696
1786 648385696 647218933 646642761 646527939 646462402 646109924 645476227 644837341 644447784 644328384 644294968
1795.7 644294968 644131393 643721390 643059845 642214508 641307144 640506287 639978294 639794960 639876785 640035782
1805.3 640035782 640077820 639860001 639268837 638206673 636665344 634818268 632977180 631386147 630031433
1814 630031433 628661079 626996078 624937515 622638893 620473328 618948860 618535347 619410210 621306915
1822.7 621306915 623675117 626058083 628310318 630434914 632284889 633555107 634104233 634189873 634272118
1831.4 634272118 634585266 634958382 635055656 634712334 634006386 633101540 632137604 631247940 630538826 629952240
1841 629952240 629214821 628056870 626523018 624998970 623868561 623157463 622547836 621716805 620600662
1849.7 620600662 619336243 618032646 616679344 615252380 613821411 612500610 611326828 610234528
1857.4 610234528 609148712 608060837 607001839 605976677 604961052 603940392 602885056 601657257
1865.1 601657257 599982414 597589493 594427605 590730247 586822319 582829628 578563805 573688011
1872.8 573688011 568029060 561813774 555722580 550774422 548070107 548418007 551953392 557982178
1880.6 557982178 565223961 572363319 578563232 583612823 587680359 590950470 593456573 595188522
1888.3 595188522 596279297 597029076 597715340 598382683 598838539 598873177 598485260 597890663 597329254 596885986
1897.9 596885986 596495438 596074486 595606613 595112228 594590683 594021416 593390770 592679024 591829987 590782509
1907.6 590782509 589550133 588240433 586970406 585787125 584702759 583783417 583133240 582761803 582517624
1916.2 582517624 582223091 581868172 581611938 581562653 581599197 581464081 581022186 580373573 579700546 579049568
1925.9 579049568 578303528 577333412 576112137 574673805 573030853 571194305 569265366 567449379 565959244
1934.6 565959244 564932861 564456558 564614525 565435333 566766930 568258934 569538116 570430031 571003723
1943.2 571003723 571408043 571690025 571778488 571604805 571188316 570593147 569835014 568865509 567648582 566240578
1952.9 566240578 564804077 563566017 562762718 562575111 563046646 564030304 565231552 566354256 567243767
1961.6 567243767 567907333 568408928 568759270 568913918 568866959 568714523 568602524 568607635 568675461 568682747 568552895
1972.2 568552895 568306732 568008118 567681847 567301826 566853027 566382027 565963440 565620537 565293770 564898567
1981.8 564898567 564401855 563833923 563238144 562633820 562037735 561489143 561017418 560580711 560070152 559411545
1991.5 559411545 558662148 557983742 557504463 557210884 556975212 556671371 556250534 555717888 555076447 554319420
2001.1 554319420 553464279 552560959 551652603 550737038 549783325 548785934 547788658 546848259 545980110 545147629
2010.7 545147629 544306831 543454323 542624512 541841850 541090355 540342064 539620018 539013100 538614540 538437767
2020.4 538437767 538400688 538395042 538367958 538329926 538300552 538261299 538164368 537967262 537640419 537145081 536424026
2031 536424026 535424385 534131699 532579308 530838928 529007072 527194405 525508499 524041214 522879562
2039.7 522879562 522132378 521929321 522363129 523415680 524941025 526730537 528605042 530454903 532219429
2048.4 532219429 533855133 535336113 536670189 537889709 539019203 540054665 540973930 541756287 542383194
2057 542383194 542830734 543086281 543176842 543167534 543109550 542992401 542761841 542393417 541939049 541487236 541080933
2067.6 541080933 540685616 540238228 539718857 539167671 538643227 538177719 537772903 537423401 537131729 536903877
2077.3 536903877 536734810 536601448 536466866 536294594 536066933 535790176 535475159 535111427 534664917 534109192
2086.9 534109192 533457527 532756195 532048683 531349945 530656395 529967041 529283485 528596344 527893181 527193069
2096.6 527193069 526567116 526108475 525875664 525865746 526041565 526368675 526816673 527333298 527841034 528278465
2106.2 528278465 528641891 528975105 529312744 529637299 529889755 530017815 530012016 529900742 529727135 529526863
2115.9 529526863 529316750 529094391 528850365 528586121 528322029 528079910 527857971 527630043 527374268 527099113
2125.5 527099113 526836929 526614990 526441231 526313629 526231499 526186981 526149254 526070404 525912361 525669975
2135.1 525669975 525369568 525051537 524752007 524487000 524241447 523973274 523641548 523239899 522800903 522360840
2144.8 522360840 521921196 521447792 520906601 520296059 519643745 518981018 518326454 517695541 517115784 516628685
2154.4 516628685 516276207 516086121 516067314 516211052 516491508 516862526 517259903 517613640 517869835 518008003
2164.1 518008003 518037491 517977715 517842751 517647743 517425117 517222481 517070923 516950836 516794510 516532364
2173.7 516532364 516143723 515668831 515177422 514726524 514336662 513995552 513674545 513345566 512997017 512638779
2183.4 512638779 512291756 511969795 511671333 511388817 511124573 510891953 510698662 510529747 510351105 510126991
2193 510126991 509839516 509494896 509119606 508750725 508418961 508131599 507863617 507570152 507213554 506787643
2202.6 506787643 506322975 505873680 505497360 505236816 505105705 505080910 505102577 505092621 504986229 504762611
2212.3 504762611 504451065 504101486 503737030 503330956 502833519 502231865 501579933 500961304 500412369 499883881
2221.9 499883881 499284821 498566628 497766113 496968117 496235008 495570793 494939728 494299164 493614311 492864189
2231.6 492864189 492058640 491257553 490557861 490047989 489772873 489737663 489934349 490343170 490907822 491528702
2241.2 491528702 492105560 492591133 492998276 493353348 493652802 493870811 493996735 494046860 494039497 493973007
2250.9 493973007 493840904 493658180 493458748 493264694 493069763 492859459 492637024 492417831 492200890 491963959
2260.5 491963959 491690674 491391716 491085205 490760460 490376472 489906006 489374313 488846054 488371353 487947693
2270.2 487947693 487526169 487046509 486471062 485807190 485113182 484475822 483956833 483546600 483175926 482788696
2279.8 482788696 482404594 482104950 481951141 481921501 481930008 481901436 481825943 481749229 481725082 481777077 481895561
2290.4 481895561 482052841 482221375 482384491 482535439 482663879 482739792 482714272 482544708 482224731 481791458
2300 481791458 481299591 480782242 480230637 479608994 478889465 478078308 477212334 476325226 475415230 474443245
2309.7 474443245 473375244 472252617 471236763 470581017 470518265 471128769 472284164 473722496 475191917
2318.4 475191917 476541595 477699966 478604355 479192162 479466553 479539719 479570312 479641418 479698372 479601974
2328 479601974 479241638 478613892 477833824 477094078 476583900 476393738 476463699 476629219 476734962 476710243
2337.7 476710243 476547928 476249542 475821152 475311432 474805069 474356537 473953705 473576355 473274269 473147316
2347.3 473147316 473237686 473470459 473722267 473925362 474086494 474228134 474354706 474473038 474582291 474605141
2356.9 474605141 474366341 473718376 472721558 471667213 470888939 470540581 470551300 470745163 470955620 471042976
2366.6 471042976 470896301 470496216 469970016 469518471 469250832 469100380 468918533 468633499 468295898 467980232
2376.2 467980232 467682037 467326317 466854057 466277809 465659142 465059547 464515305 464037170 463608437 463187561
2385.9 463187561 462731438 462232132 461730766 461292343 460964394 460752831 460628090 460547142 460473366 460381584
2395.5 460381584 460250130 460053444 459769249 459400063 458983269 458568687 458176651 457779121 457328453 456809692
2405.2 456809692 456265717 455770683 455383224 455120049 454969063 454915199 454947243 455045929 455175514 455298195
2414.8 455298195 455400124 455498085 455616684 455759506 455905151 456030235 456130981 456216354 456287117 456330147
2424.5 456330147 456335373 456310158 456269188 456214180 456134491 456026382 455901299 455765877 455599442 455362854 455033684
2435.1 455033684 454630013 454198380 453783302 453412285 453096237 452830582 452591972 452347031 452075348 451785088
2444.7 451785088 451496506 451207733 450884895 450492477 450035286 449565926 449144630 448787956 448452682 448070412
2454.3 448070412 447603798 447073822 446536636 446030045 445538712 445011215 444408188 443736343 443040276 442369156
2464 442369156 441754723 441210976 440742226 440345612 440011063 439727020 439483910 439272614 439080658 438901711
2473.6 438901711 438745422 438634109 438576622 438551636 438524590 438483047 438455582 438491478 438627968 438876114 439226646
2484.2 439226646 439661522 440157700 440694542 441262093 441859360 442472916 443060341 443562355 443938560 444192848
2493.9 444192848 444363670 444492798 444603424 444699745 444776840 444828644 444853020 444856300 444849777 444838066 444809875
2504.5 444809875 444744835 444631119 444474792 444288673 444075928 443827400 443537941 443220329 442899590 442594376
2514.1 442594376 442302170 442004204 441682625 441328659 440939026 440506248 440023994 439505043 438990288 438529968
2523.8 438529968 438146820 437813568 437470894 437066917 436588821 436062279 435530815 435034065 434593658 434209366
2533.4 434209366 433867683 433562355 433308907 433133087 433037376 432978859 432891655 432740707 432558670 432428474
2543.1 432428474 432426720 432574692 432833443 433137589 433435440 433706436 433951950 434176025 434373627 434533081
2552.7 434533081 434642487 434691887 434669495 434563675 434372292 434109573 433800507 433467827 433124390 432777519
2562.4 432777519 432433891 432100983 431783104 431478310 431175919 430853882 430484390 430050201 429563980 429064713
2572 429064713 428588715 428139038 427684860 427193451 426659355 426102905 425545044 424983673 424394035 423748360
2581.6 423748360 423033524 422257843 421444054 420617218 419801559 419027214 418335419 417765045 417320976 416953735
2591.3 416953735 416576691 416116142 415559044 414966278 414448776 414122658 414063454 414274940 414692001 415219154
2600.9 415219154 415779266 416334534 416870766 417374763 417837372 418271980 418711357 419175186 419642029 420063515
2610.6 420063515 420410080 420699005 420974846 421262360 421538811 421750450 421858673 421875877 421863480 421889915
2620.2 421889915 421983414 422118492 422247925 422347374 422429466 422518921 422622070 422723656 422805748 422858353 422872620
2630.8 422872620 422836685 422750206 422642097 422559509 422533112 422547569 422551651 422495461 422363930 422180939 421987457
2641.4 421987457 421813583 421664391 421525688 421382866 421237526 421103554 420989189 420881958 420754738 420587959
2651.1 420587959 420382652 420155754 419920120 419677582 419426956 419177895 418946800 418737907 418529701 418289108
2660.7 418289108 418002129 417689857 417390137 417122078 416873894 416626701 416383438 416164398 415972061 415769005
2670.4 415769005 415499115 415134201 414697227 414241867 413808670 413400459 412990150 412548447 412069054 411576233
2680 411576233 411108360 410689201 410307999 409929886 409529724 409121475 408750343 408458977 408254013 408102455
2689.6 408102455 407955246 407782516 407598534 407456970 407414436 407478981 407593079 407675362 407692299 407688217 407738533
2700.3 407738533 407869835 408030243 408134270 408132248 408034859 407882538 407707672 407528191 407358665 407210732
2709.9 407210732 407077484 406930389 406741753 406514587 406286697 406101036 405967979 405850830 405693550 405467377
2719.5 405467377 405199890 404951324 404754562 404573402 404325714 403954239 403474007 402951622 402444725 401968803
2729.2 401968803 401513023 401066933 400621758 400158806 399660339 399135628 398625069 398163528 397745819 397335396
2738.8 397335396 396904907 396462135 396037064 395653877 395317650 395014038 394712715 394379311 394004974 393627014
2748.5 393627014 393304253 393059540 392848167 392593689 392253189 391842499 391399498 390941124 390461884 389959755
2758.1 389959755 389444695 388924980 388402328 387890053 387418976 387011490 386648293 386278877 385872231 385448456
2767.8 385448456 385053062 384703178 384370308 384017410 383643074 383282661 382969055 382701912 382453842 382197914
2777.4 382197914 381923714 381632538 381331100 381035995 380774956 380564537 380379372 380152016 379818916 379378014
2787 379378014 378896980 378460464 378107491 377820892 377570686 377356300 377202415 377124252 377104187 377102432 377080002
2797.7 377080002 377010727 376881142 376688385 376434746 376117554 375725250 375252953 374725761 374194183 373695869
2807.3 373695869 373220367 372725372 372192383 371660690 371192818 370803337 370430260 369985123 369431152 368806458
2816.9 368806458 368170242 367531586 366838188 366028671 365087013 364040222 362909470 361673126 360280113
2825.6 360280113 358683472 356854782 354770699 352400398 349714432 346691856 343305511 339507217
2833.3 339507217 335261536 330646667 325971069 321814117 318928680 318012180 319436665 323064690
2841.1 323064690 328260040 334107094 339730301 344546242 348334007 351140289 353130684 354483757
2848.8 354483757 355355034 355877609 356164246 356305084 356364708 356381683 356370773 356328621 356241798 356095619
2858.4 356095619 355883026 355610237 355298500 354971886 354634285 354256935 353794861 353227158 352582512 351926346
2868.1 351926346 351320190 350787430 350311394 349853973 349376488 348854141 348281746 347669907 347031059 346367912
2877.7 346367912 345679474 344980469 344304276 343676186 343079453 342456169 341748161 340934944 340028419 339037361
2887.3 339037361 337952309 336771736 335532036 334294624 333097839 331931000 330761070 329580879
2895.1 329580879 328420563 327317429 326285248 325320091 324421997 323583336 322752609 321820602 320666771
2903.7 320666771 319233513 317556343 315727749 313843632 311992645 310288429 308883972 307923603
2911.4 307923603 307463875 307436409 307693214 308089123 308526173 308933201 309231758 309346981 309259129 309026737
2921.1 309026737 308731499 308385849 307896271 307123547 305982456 304480572 302670441 300578957 298193073
2929.8 298193073 295506935 292567730 289485874 286426182 283622646 281399422 280139866 280168533 281596298
2938.5 281596298 284226608 287588959 291090240 294202995 296603928 298207207 299099350 299434910 299360638
2947.1 299360638 299000587 298473873 297899208 297370014 296926174 296547184 296170578 295716877 295110416 294297466
2956.8 294297466 293250828 291950359 290347652 288359146 285913143 283016510 279774437 276337147
2964.5 276337147 272837124 269394207 266194954 263554554 261873722 261497021 262571888 265003452
2972.2 265003452 268508701 272712517 277222767 281680050 285795174 289379292 292347775 294692440
2979.9 294692440 296441650 297638702 298346119 298649864 298643036 298394871 297934875 297273788 296442032 295506897
2989.6 295506897 294545517 293598919 292651787 291656723 290577011 289402485 288129978 286745243 285238819
2998.2 285238819 283641987 282029133 280466442 278948402 277394276 275717697 273905354 272028141
3006 272028141 270174961 268373890 266571751 264677830 262624817 260395775 258014832 255531254 253024063
3014.6 253024063 250626030 248536415 246991997 246194801 246224480 246985378 248216248 249566154 250709496
3023.3 250709496 251457348 251818371 251969547 252146969 252524185 253160229 254032574 255095119 256290741
3032 256290741 257519875 258633232 259484100 259998741 260194721 260138950 259901600 259549885 259166279 258848305
3041.6 258848305 258678989 258697853 258891449 259197063 259517117 259753876 259864483 259895573 259955349 260136662
3051.3 260136662 260461731 260900745 261437664 262102795 262930679 263882008 264822063 265595036 266147652 266591263
3060.9 266591263 267135544 267935600 268977299 270102978 271143093 272026920 272775192 273412399 273913002
3069.6 273913002 274230995 274354134 274307213 274110241 273761330 273262558 272630939 271859493 270874538 269563713
3079.2 269563713 267861233 265798359 263481483 261065502 258790436 257027264 256199493 256562386 258002434
3087.9 258002434 260049534 262108860 263725414 264699593 265037041 264847832 264281483 263490105 262584667
3096.6 262584667 261596298 260486450 259209576 257774563 256246796 254696751 253146286 251566486
3104.3 251566486 249927025 248247414 246590557 245006275 243484001 241977158 240476246 239040737
3112 239040737 237738838 236555538 235378952 234094086 232684402 231232147 229822483 228463612 227105274
3120.7 227105274 225721397 224358749 223106518 222030373 221133842 220367165 219656200 218927803 218128357
3129.4 218128357 217235241 216259918 215235424 214198856 213177891 212184582 211215305 210256138 209295235
3138.1 209295235 208338776 207419701 206588154 205886879 205326157 204878578 204502583 204176865 203919106 203769054
3147.7 203769054 203754463 203868294 204075470 204338913 204639378 204977226 205358791 205778923 206215343 206644154
3157.4 206644154 207066193 207514915 208024693 208585758 209135895 209606667 209979267 210289173 210578384 210853062
3167 210853062 211089401 211263847 211367226 211398621 211368256 211308537 211256065 211201649 211075172 210813408 210452423
3177.6 210452423 210124912 209939690 209867020 209767971 209538040 209205208 208877926 208621902 208414040 208206921
3187.3 208206921 208003445 207845039 207744904 207654591 207493324 207193985 206722412 206081505 205312748 204474220
3196.9 204474220 203587570 202597542 201403656 199947033 198263016 196441822 194548016 192584839 190529346
3205.6 190529346 188382778 186186275 184009628 181938629 180054588 178395519 176929970 175584240
3213.3 175584240 174311771 173134499 172113800 171289177 170654564 170183792 169858704 169674549 169638062
3222 169638062 169775047 170123615 170694370 171439648 172284813 173204632 174259357 175544758 177109241
3230.7 177109241 178930607 180957661 183149776 185470695 187871838 190310936 192789993 195355320
3238.4 195355320 198054276 200897274 203863068 206921444 210037632 213169556 216286221 219394855
3246.1 219394855 222528305 225691833 228832455 231883316 234835987 237750607 240680904 243603172
3253.8 243603172 246436253 249127655 251700935 254214954 256693726 259117641 261473541 263786316
3261.5 263786316 266081944 268334713 270479565 272488747 274418221 276359425 278342342 280307198
3269.2 280307198 282180500 283971043 285771732 287660484 289610691 291513195 293284302 294943485
3276.9 294943485 296581631 298258419 299938278 301526909 302963562 304276676 305552769 306857166
3284.7 306857166 308185215 309482346 310701866 311837463 312908115 313927937 314899387 315824051 316702118
3293.3 316702118 317513580 318220234 318810120 319341984 319924545 320631142 321431999 322223434 322927399 323559265
3303 323559265 324195442 324887505 325617332 326328545 326982117 327573280 328115616 328637161 329206352 329938316
3312.6 329938316 330942459 332241478 333744202 335315666 336879005 338448105 340060883 341693001
3320.3 341693001 343254433 344669495 345943604 347140465 348299828 349395409 350376816 351231575 351993446
3329 351993446 352697716 353351746 353955536 354532814 355121613 355734596 356344872 356915283 357433891 357913399
3338.7 357913399 358363533 358773003 359114723 359357033 359471588 359453087 359348106 359258270 359287148 359456825
3348.3 359456825 359676514 359803886 359755173 359564171 359340782 359168930 359043694 358898735 358691330 358450928
3357.9 358450928 358239937 358069115 357868309 357558403 357152824 356764030 356490936 356302338 356055412 355643921
3367.6 355643921 355114136 354619598 354258995 353980255 353646774 353182755 352636299 352108536 351648102 351227455
3377.2 351227455 350807037 350394630 350033302 349739494 349464417 349120827 348650589 348080292 347519417 347098007
3386.9 347098007 346877556 346797905 346704597 346449242 345989571 345413399 344863930 344428711 344087982 343757896
3396.5 343757896 343379250 342963409 342556076 342173843 341787415 341364594 340914421 340478516 340087700 339741821
3406.2 339741821 339427490 339133110 338832893 338471146 337996826 337428474 336870575 336440163 336168251 335974960
3415.8 335974960 335744820 335420532 335029488 334637985 334293518 334001961 333735313 333451462 333124237 332772636
3425.5 332772636 332461586 332248726 332117424 331971664 331719513 331370049 331035995 330828056 330746269 330687523
3435.1 330687523 330561104 330381813 330238342 330174370 330128059 330004425 329800110 329624825 329580765 329634171
3444.7 329634171 329634628 329476967 329231529 329093018 329193230 329474411 329744301 329846115 329768105 329610519
3454.4 329610519 329480362 329425812 329444122 329513741 329611092 329712677 329800529 329865646 329902916 329906960 329878883
3465 329878883 329830475 329772491 329706383 329641876 329625931 329730759 329985161 330319481 330594826 330707741 330669174
3475.6 330669174 330586929 330570717 330650330 330770302 330854225 330884552 330932732 331105804 331443672 331858368 332186317
3486.2 332186317 332314796 332264481 332151489 332081375 332087250 332149849 332243118 332344513 332427864 332479668 332535286
3496.8 332535286 332678986 332982903 333421974 333844795 334050217 333941956 333644295 333451462 333599625 334053192
3506.5 334053192 334531021 334780731 334824600 334905739 335195236 335600319 335882301 335926170 335841255 335818596
3516.1 335818596 335952606 336224747 336590805 337010384 337403336 337659187 337738838 337737160 337797699 337963753
3525.7 337963753 338140869 338212471 338169289 338118706 338189583 338440170 338832512 339259071 339596558 339771385
3535.4 339771385 339810638 339828568 339946251 340208817 340577583 340988083 341396980 341759109 341981583 341952057
3545 341952057 341660690 341297722 341175232 341481972 342090416 342639580 342856026 342801018 342784424 343044167
3554.7 343044167 343540688 344064445 344478149 344801712 345101624 345402603 345743523 346215706 346821213 347291756
3564.3 347291756 347194710 346351089 345147934 344334030 344432487 345343056 346515694 347461014 348057137 348430786
3574 348430786 348682098 348810387 348846664 348928795 349187393 349610977 350094872 350615997 351279755 352134285
3583.6 352134285 352965355 353361092 353060265 352265854 351590347 351631622 352530060 353880272 355059853
3592.3 355059853 355683441 355821457 355853043 356134987 356761780 357562828 358274803 358732109 358964157 359171257
3601.9 359171257 359603119 360387802 361400871 362286720 362677803 362496681 362081375 361954193 362365913
3610.6 362365913 363042679 363452644 363391647 363261909 363658676 364654198 365600815 365760345 365093918 364311028
3620.3 364311028 364135132 364675179 365597038 366708946 368060303 369414635 369975357 369024658 366874695
3628.9 366874695 364903717 364420052 365515938 367132797 368181992 368446770 368439713 368648186 369101257
3637.6 369101257 369543571 369777946 369793739 369740219 369888611 370495720 371527061 372513657 372814369 372085571
3647.3 372085571 370481567 368467712 366604538 365517082 365762405 367368317 369487000 370833702
3655 370833702 370737877 369717712 368871422 368751984 369006424 369061699 368854790 368735771 368909378 369303703
3664.6 369303703 369907837 370811386 371737556 371910133 370853691 369282532 368698654 369794617 371470375
3673.3 371470375 371812248 370089264 367533951 366070900 366486206 367982101 369294090 369897270 370128441
3682 370128441 370499496 371168404 371951180 372540855 372628250 372002068 370726547 369224472 368085289 367720680
3691.6 367720680 368156509 369074097 370006142 370574074 370688934 370585937 370591850 370782700 370892105 370620193
3701.3 370620193 370025635 369546585 369605904 370228119 371063919 371730080 372052689 371995735 371484795 370446396
3710.9 370446396 369054413 367830582 367349739 367771873 368696747 369526329 369951630 370055046 370010834
3719.6 370010834 369842110 369524727 369176903 368966026 368845367 368581581 368130493 367843971 368135033 368977623
3729.2 368977623 369894333 370436935 370509720 370166435 369311562 367845802 366060257 364640007 364164696
3737.9 364164696 364696159 365878563 367240448 368253288 368320389 367154236 365327377 364154930 364626122
3746.6 364626122 366348648 367721291 367305641 365059814 362282753 360488167 360367928 361622162 363447838
3755.3 363447838 365049324 365870628 365688362 364716148 363595428 363081360 363516006 364537849 365385551
3763.9 365385551 365585785 365333405 365134659 365128212 364920692 364153938 363072548 362337914 362315903 362753601
3773.6 362753601 363208351 363570786 363970413 364306335 364203949 363540840 362782974 362560921 362956123 363397751
3783.2 363397751 363303375 362686768 362069511 361905479 362189598 362570610 362736816 362691803 362717590 363043709
3792.9 363043709 363491898 363526764 362839279 361891212 361608047 362303963 363053017 362510567 360490379 358444138
3802.5 358444138 358063393 359464531 361051979 361231232 359997101 358679008 358394737 359123764 360208397
3811.2 360208397 361226501 362041817 362332458 361691895 360350533 359323044 359377213 359959297 359618301
3819.9 359618301 357689018 355264626 354175072 355079269 356859550 357930412 357841682 357404938 357481766
3828.6 357481766 358039856 358448601 358367920 358071976 357982826 358141441 358198662 357782097 356799736 355496025
3838.2 355496025 354319649 353670883 353634720 353933182 354212418 354388199 354651260 355148239 355794487 356455917
3847.8 356455917 357158279 357896767 358254471 357486076 355233536 352159920 349682999 348929100 349901924
3856.5 349901924 351644897 353144226 354035797 354526596 354812317 354727936 354018707 352880974 352068100
3865.2 352068100 352272530 353339539 354228249 353958931 352645683 351437187 351311722 352034988 352510033
3873.9 352510033 352147598 351609573 351979561 353327866 354440727 354117393 352543411 351122169 350958138
3882.6 350958138 351726570 352164154 351533661 350400543 349952393 350710220 352014465 352702751 352179604
3891.2 352179604 350852432 349675369 349361305 349940720 350891304 351589966 351711464 351343422 350804482
3899.9 350804482 350326080 349853706 349148064 348119164 347067795 346543274 346887589 347896652 348957367
3908.6 348957367 349550552 349631577 349534416 349550018 349642754 349562454 349162216 348551598 347963982 347550201
3918.2 347550201 347333221 347306023 347466736 347725143 347849579 347625809 347110901 346667595 346663818 347114296
3927.9 347114296 347651863 347857971 347602882 347079468 346583328 346310616 346302376 346469040 346642647 346691132
3937.5 346691132 346645241 346661415 346797447 346875801 346674728 346248360 345933914 345973167 346211662 346264954
3947.2 346264954 345936546 345367279 344801712 344351044 344027557 343870087 343896408 343987732 343963623 343793526
3956.8 343793526 343632431 343613281 343686905 343711128 343620720 343442612 343215904 342987633 342841606 342818260
3966.5 342818260 342813568 342670784 342389297 342136269 342009354 341908913 341716347 341478806 341297035 341132851
3976.1 341132851 340902634 340695267 340670853 340743256 340630875 340306740 340099258 340140495 340017395 339350967
3985.7 339350967 338501244 338122559 338052979 337389908 335953941 334815178 334557762 333784447 330927200
3994.4 330927200 327380676 326177826 325220108 313057480 275582924 210093670
4000.2 210093670
##END=$$ End of the data block
