##TITLE=$$ Begin of the data block
##JCAMP-DX=5.00 $$ ACD/SpecManager v 10.08
##SPECTROMETER/DATA SYSTEM=Varian
##DATE=30 Apr 2013 14:32:38
##DATA TYPE=INFRARED SPECTRUM
##DATA CLASS=XYDATA
##ORIGIN=
##OWNER=
##NPOINTS=3735
##FIRSTX=399.26403809
##LASTX=4000.35498047
##MAXX=4000.35498047
##MINX=399.26403809
##MAXY=76.64199066
##MINY=9.83494568
##XFACTOR=1.0000000000
##YFACTOR=0.000000100000000
##FIRSTY=44.86681747
##DELTAX=0.96440572
##XUNITS=1/CM
##YUNITS=TRANSMITTANCE
##XYDATA=(X++(Y..Y))
$$ plain form
399.3 448668175 589449463 671685257 699282684 701130981 702631683 710109787 717362823 719670868
407 719670868 718636780 717286301 715764313 712935181 709553909 707902374 709115219 712324448 716246948
415.7 716246948 720449066 724860153 728957520 731977615 733527374 733646469 732665176 731427689 731273651
424.3 731273651 733057556 736068954 738425217 738798676 737509384 735796967 734408493 733256302 732169266
433 732169266 731384430 731176605 731380539 731489410 731011200 729603195 727226028 724585876 723253632
441.7 723253632 724694595 728754654 733250122 735416870 733973541 729887619 725347137 722132950
449.4 722132950 720737762 720511169 720306549 719127274 716573639 712976379 709141464 705820618 703191681
458.1 703191681 700628738 696883316 690577850 680642166 666320801 646933136 622187004 593503609
$$ packed form
399.3D48668175J40781288Q2235794K7597427J848297J500702P478104P253036K308045
407G19670868j034088j350479j521988k829132l381272j651535J212845L209229L922500
415.7G16246948M202118M411087M097367L020095J549759J19095r81293j237487j54038
424.3G31273651J783905L011398K356263L73459j289292j712417j388474j152191j087036
433G32169266p84836k07825K03934J08871m78210j408005k377167k640152j332244
441.7G23253632J440963M060059M495468K166748j443329m085922m540482l214187
449.4G22132950j395188k26593k04620j179275k553635l597260l834915l320846k628937
458.1G03191681k562943l745422o305466r935684j4321365j9387665k4746132k8683395
$$ plain form
465.8 593503609 565380898 544911156 538743057 549301834 573242645 603400459 632584915 656400986
473.5 656400986 673706970 685447693 693303909 698851700 703132706 706479187 708665237 709373245
481.2 709373245 708670654 707160950 705726395 705055923 705250778 705735626 705545654 703841019 700362244
489.9 700362244 695591125 690531921 686181946 682922592 680219803 676936111 672059860 665174866
497.6 665174866 656213531 644850006 630288048 611562843 587727318 557721252 520914764 479196358
505.3 479196358 439255409 411854248 406581726 425241089 459751320 497344360 529186935 555107689
513.1 555107689 580730476 610419388 642812729 672355347 694237442 707707596 715438004 720685654
520.8 720685654 725215683 729154892 731899261 732925110 732192688 730284119 728238831 727014694 726899872
$$ packed form
465.8E93503609k8122711k0469742o168099J0558777K3940811L0157814K9184456K3816071
473.5F56400986J7305984J1740723P856216N547791M281006L346481K186050P08008
481.2G09373245p02591j509704j434555o70472J94855M84848j89972j704635l478775
489.9G00362244m771119n059204m349975l259354k702789l283692m876251o884994
497.6F65174866q961335j1363525j4561958j8725205k3835525l0006066l6806488m1718406
505.3D79196358l9940949k7401161n272522J8659363L4510231L7593040L1842575K5920754
513.1E55107689K5622787K9688912L2393341K9542618K1882095J3470154P730408N247650
520.8G20685654M530029L939209K744369J025849p32422j908569k045288j224137j14822
$$ plain form
529.5 726899872 727401810 727714005 727292480 726063843 724266052 722244110 720364456 718950272 718151550
538.1 718151550 717854385 717748566 717496796 716863327 715756760 714240417 712530365 710932846 709717865
546.8 709717865 709008713 708744125 708684769 708448334 707631912 706042938 703891525 701724396 700080795
555.5 700080795 699121552 698528290 697720184 696191940 693762665 690648956 687358780 684441681 682202606
564.2 682202606 680566711 679209366 677829895 676309204 674627075 672696609 670353546 667534637
571.9 667534637 664429550 661395416 658669815 656146088 653421173 650077438 645945587 641126251
579.6 641126251 635790825 629968224 623497620 616117058 607537880 597442207 585475502 571293945
587.3 571293945 554629555 535398254 514060020 492321548 473669090 462778969 463419914 475923691
$$ packed form
529.5G26899872N01938L12195m21525j228637j797791k021942j879654j414184p98722
538.1G18151550k97165j05819k51770o33469j106567j516343j710052j597519j214981
546.8G09717865p09152k64588n9356k36435q16422j588974k151413k167129j643601
555.5G00080795r59243n93262q08106j528244k429275l113709l290176k917099k239075
564.2F82202606j635895j357345j379471j520691j682129j930466k343063k818909
571.9F67534637l105087l034134k725601k523727k724915l343735m131851m819336
579.6F41126251n335426n822601o470604p380562q579178j0095673j1966705j4181557
587.3E71293945j6664390j9231301k1338234k1738472j8652458j0890121O40945J2503777
$$ plain form
595 475923691 496217194 517528305 533725357 541889153 542510948 537797623 529883156 520238533
602.8 520238533 510170975 501496696 496674538 498286858 508133202 526380653 551257706 579540825
610.5 579540825 607567139 632178993 651241837 663829651 670210953 671437073 668387146 660865784
618.2 660865784 647881851 629509277 609013557 592981529 588375893 598121758 618642006 641707458
625.9 641707458 659512177 668932648 671457748 669303207 662083435 647930832 628085632 609626579
633.6 609626579 602263641 611199799 632622833 656250305 672617111 678597412 677094650 672679443
641.3 672679443 667887650 662765427 656568298 649302979 642127380 636914597 635321617 637592621
649 637592621 641868515 644949417 644291916 639580154 632413368 624542770 616489525 607693367 597565765
$$ packed form
595D75923691K0293503K1311111J6197052Q163796O21795m713325p914467r644623
602.8E20238533j0067558q674279m822158J612320R846344J8247451K4877053K8283119
610.5E79540825K8026314K4611854J9062844J2587814O381302J226120l049927p521362
618.2F60865784j2983933j8372574k0495720j6032028m605636R745865K0520248K3065452
625.9F41707458J7804719R420471K525100k154541p219772j4152603j9845200j8459053
633.6F09626579p362938Q936158K1423034K3627472J6366806N980301j502762m415207
641.3F72679443m791793n122223o197129p265319p175599n212783j592980K271004
649F37592621M275894L080902o57501m711762p166786p870598q053245q796158j0127602
$$ plain form
657.7 597565765 586100349 573623962 560380440 546581383 532682762 519299965 506744003
664.5 506744003 494786797 483071899 471806602 461982613 454828415 450996933 450251122 451881256
672.2 451881256 455362244 460611420 467720108 476583099 486841354 498099403 510099487 522700119
679.9 522700119 535787010 549242706 562903252 576437798 589283791 600810280 610603790 618575096
687.6 618575096 624794540 629333038 632367821 634403305 636219482 638455963 641214371 644085159
695.3 644085159 646570663 648491211 650054550 651628036 653467407 655578766 657734070 659581833
703.1 659581833 660790558 661174011 660764847 659818115 658736877 657908936 657497101 657303391 656816940
711.7 656816940 655440063 652758102 648713989 643605270 637896729 631913986 625596466 618494987
$$ packed form
657.7E97565765j1465416j2476387j3243522j3799057j3898621j3382797j2555962
664.5E06744003j1957206j1714898j1265297r823989p154198l831482p45811J630134
672.2D51881256L480988N249176P108688Q862991J0258255J1258049J2000084J2600632
679.9E22700119J3086891J3455696J3660546J3534546J2845993J1526489R793510P971306
687.6F18575096O219444M538498L034783K035484J816177K236481K758408K870788
695.3F44085159K485504J920548J563339J573486J839371K111359K155304J847763
703.1F59581833J208725L83453m09164r46732j081238q27941m11835j93710m86451
711.7F56816940j376877k681961m044113n108719n708541n982743o317520p101479
$$ plain form
719.5 618494987 610010948 599635582 587005119 571934052 554756432 536941071 521371613 511647606
727.2 511647606 510497169 518245811 532420311 548819122 563383293 573705902 579339294 580945892
734.9 580945892 579141197 573919754 564791412 551035957 531732025 506181984 475510864 444748993
742.6 444748993 423023376 420089836 440643387 480645790 528981361 573456764 606607780 627415428
750.3 627415428 638924789 644823380 647670441 648972549 649702148 650342484 650745850 650362778 648768845
759 648768845 645983429 642372894 638385544 634398651 630662079 627209587 623769073 619832191 614904289
767.7 614904289 608747444 601425285 593140373 584004898 573851776 562125778 547971268 530742226
775.4 530742226 510970573 491260452 476150932 470414734 476513786 492937927 514762955 536100426
$$ packed form
719.5F18494987q484039j0375366j2630463j5071067j7177620j7815361j5569458r724007
727.2E11647606j150437P748642J4174500J6398811J4564171J0322609N633392J606598
734.9E80945892j804695n221443r128342j3755455j9303932k5550041l0671120l0761871
742.6D44748993k1725617k933540K0553551M0002403M8335571M4475403L3151016K0807648
750.3F27415428J1509361N898591K847061J302108P29599O40336M03366l83072j593933
759F48768845k785416l610535l987350l986893l736572l452492l440514l936882m927902
767.7F14904289o156845p322159q284912r135475j0153122j1725998j4154510j7229042
775.4E30742226j9771653j9710121j5109520n736198O099052J6424141K1825028K1337471
$$ plain form
783.1 536100426 552664108 562825394 566994057 566412048 562390366 556125565 548660812 540745087
790.8 540745087 532733231 524656868 516384773 507761726 498772163 489718018 481193161 473704071
798.5 473704071 467269554 461601601 456951218 454803352 457428551 466300240 480631599 497374535
806.2 497374535 512753639 524012642 529985085 530341759 524576111 511740570 490903282 461560440
814 461560440 423680000 378003731 327306633 278053722 240542412 225929909 240845356 282773991
821.7 282773991 339712219 395021057 434828835 453596916 454933624 448053894 442725945 445483513
829.4 445483513 458102417 477900047 499321556 516647644 527137375 532778931 538864288 549821014
837.1 549821014 565469437 581106300 591654892 596286926 599319000 606625366 620961952 640324020
$$ packed form
783.1E36100426J6563682J0161286M168663n82009m021682o264801p464753p915725
790.8E40745087q011856q076363q272095q623047q989563r054145q524857p489090
798.5D73704071o434517n667953m650383k147866K625199Q871689J4331359J6742936
806.2D97374535J5379104J1259003N972443L56674n765648j2835541k0837288k9342842
814D61560440l7880440m5676269n0697098m9252911l7511310j4612503J4915447M1928635
821.7B82773991N6938228N5308838L9807778J8768081J336708o879730n327949K757568
829.4D45483513J2618904J9797630K1421509J7326088J0489731N641556O085357J0956726
837.1E49821014J5648423J5636863J0548592M632034L032074P306366J4336586J9362068
$$ plain form
844.8 640324020 660239487 677226105 690203552 699400330 704839706 706152725 703221207 696113358
852.5 696113358 684255524 666582642 643732758 620514603 605386429 605965233 623738060 652618256
860.3 652618256 682824860 706827087 722590561 732339172 739099045 744404449 748369827 750844955
868 750844955 752050018 752416534 752317963 752086105 752081375 752561646 753501282 754613571 755543213 756021271
877.6 756021271 755917282 755285950 754413681 753737106 753604431 754058914 754829254 755506134 755733795 755325851
887.3 755325851 754321289 752983780 751699753 750786819 750348358 750279236 750378113 750436172 750258942 749695206
896.9 749695206 748718567 747489700 746306915 745450516 745032578 744946060 744937134 744747925 744253387 743514481
906.5 743514481 742714081 742028046 741532135 741203384 740973206 740760803 740472794 740012741 739330368 738471985
$$ packed form
844.8F40324020J9915467J6986618J2977447R196778N439376J313019k931518p107849
852.5F96113358j1857834j7672882k2849884k3218155j5128174N78804J7772827K8880196
860.3F52618256L0206604K4002227J5763474R748611O759873N305404L965378K475128
868G50844955J205063L66516r8571k31858m730M80271R39636J112289R29642M78058
877.6G56021271j03989o31332q72269o76575j32675M54483P70340O76880K27661m07944
887.3G55325851j004562j337509j284027r12934m38461o9122R8877N8059j77230n63736
896.9G49695206r76639j228867j182785q56399m17938q6518q926j89209m94538p38906
906.5G43514481q00400o86035m95911l28751k30178k12403k88009m60053o82373q58383
$$ plain form
916.2 738471985 737575684 736799088 736228638 735832443 735488129 735061874 734476013 733719330 732809525 731765823
925.8 731765823 730614624 729394684 728131790 726811142 725397949 723874512 722212448 720297699
933.6 720297699 717946701 715067215 711778259 708245010 704327469 699506149 693368454 686283798
941.3 686283798 679495468 674356003 671370316 670022812 669596863 670129318 672479019 677403488 684545288
949.9 684545288 692281265 698545837 701930542 702298584 700687866 698739395 697988663 699246902 702260284
958.6 702260284 705825958 708396606 708909836 707376633 704862747 702869949 702502899 703927994 706416931
967.3 706416931 708881226 710498428 711036072 710744019 710016403 709128647 708209534 707358627 706704941
976 706704941 706320724 706090393 705709610 704862823 703442459 701614761 699688339 697917328 696403198
$$ packed form
916.2G38471985q96301p76596n70450l96195l44314m26255n85861p56683r09805j043702
925.8G31765823j151199j219940j262894j320648j413193j523437j662064j914749
933.6G20297699k350998k879486l288956l533249l917541m821320o137695p084656
941.3F86283798o788330n139465k985687j347504m25949N32455K349701M924469P141800
949.9F84545288P735977O264572L384705L68042j610718j948471p50732J258239L013382
958.6G02260284L565674K570648N13230j533203k513886j992798l67050J425095K488937
967.3G06416931K464295J617202N37644k92053p27616q87756r19113q50907o53686
976G06704941l84217k30331l80783q46787j420364j827698j926422j771011j514130
$$ plain form
984.7 696403198 695130005 694029999 693011475 691973877 690869675 689772339 688857422 688287735 688118439
993.3 688118439 688316345 688833694 689598999 690415955 690929947 690789948 689899368 688512573 687057114
1002 687057114 685836411 684864197 683929596 682768555 681160660 678900833 675757446 671551971 666346893
1010.7 666346893 660487747 654197998 646822128 636454849 620877953 599812317 576944275 559559479
1018.4 559559479 555074463 566462021 590024261 617427559 640517960 655275726 662334518 664585876
1026.1 664585876 664490509 663109207 660746613 657789536 654797058 652093582 649565659 646894226 643895950
1034.8 643895950 640655060 637461586 634718170 632857399 632214241 632871704 634592018 636899338 639259872
1043.5 639259872 641258011 642710190 643692551 644478836 645395050 646651306 648227234 649865341 651174393
$$ packed form
984.7F96403198j273193j100006j018524j037598j104202j097336r14917n69687j69296
993.3F88118439J97906N17349P65305Q16956N13992j39999q90580j386795j455459
1002F87057114j220703r72214r34601j161041j607895k259827l143387m205475n205078
1010.7F66346893n859146o289749p375870j0367279j5576896k1065636k2868042j7384796
1018.4E59559479m485016J1387558K3562240K7403298K3090401J4757766P058792K251358
1026.1F64585876r5367j381302k362594k957077k992478k703476k527923k671433k998276
1034.8F43895950l240890l193474k743416j860771o43158O57463J720314K307320K360534
1043.5F39259872J998139J452179R82361P86285R16214J256256J575928J638107J309052
$$ plain form
1052.2 651174393 651799545 651579895 650608368 649165802 647583847 646119080 644871674 643748093 642484512
1060.9 642484512 640760345 638361511 635276260 631653633 627694130 623574905 619397354 615085449
1068.6 615085449 610291901 604477272 597167244 588123398 577259026 564596748 550746918 537755394
1076.3 537755394 529301834 529339027 539658737 558240128 579952202 599273071 612974968 620911636
1084 620911636 624822006 626580048 627257690 627197418 626429558 624903259 622565880 619501801 616071701
1092.7 616071701 612816200 610116615 607919998 605805283 603316498 600252647 596718292 593011284
1100.4 593011284 589504509 586553307 584373245 582916908 581862564 580741997 579089851 576522598
1108.1 576522598 572808075 567989655 562436218 556614418 550670013 544220924 536598320 527230301
$$ packed form
1052.2F51174393O25152k19650r71527j442566j581955j464767j247406j123581j263581
1060.9F42484512j724167k398834l085251l622627l959503m119225m177551m311905
1068.6F15085449m793548n814629p310028r043846j0864372j2662278j3849830j2991524
1076.3E37755394q453560L7193J0319710J8581391K1712074J9320869J3701897P936668
1084F20911636L910370J758042O77642o0272p67860j526299k337379l064079l430100
1092.7F16071701l255501k699585k196617k114715k488785l063851l534355l707008
1100.4E93011284l506775k951202k180062j456337j054344j120567j652146k567253
1108.1E76522598l714523m818420n553437n821800n944405o449089p622604r368019
$$ plain form
1115.8 527230301 515705795 501637650 485010834 467230644 451861687 443674774 446016655 458451767
1123.5 458451767 476822701 495803261 511752129 523634186 531878052 536886940 538656387 537317352
1131.2 537317352 533488503 527937050 521072693 512907028 503399239 492685394 480994034 468503876
1139 468503876 455362091 441752930 427839432 413643799 399060669 384010849 368549843 352830734
1146.7 352830734 337010574 321221962 305596542 290283108 275474968 261478672 248756447
1153.4 248756447 237847347 229211655 223157196 219922333 219817390 223295040 230927811 243298149
1161.1 243298149 260767498 283159447 309577370 338575935 368607368 398384666 426947746
1167.9 426947746 453575287 477762680 499233894 517830734 533372574 545745735 555175171
$$ packed form
1115.8E27230301j1524506j4068145j6626816j7780190j5368957q186913K341881J2435112
1123.5D58451767J8370934J8980560J5948868J1882057Q243866N008888J769447j339035
1131.2E37317352l828849n551453o864357q165665r507789j0713845j1691360j2490158
1139D68503876j3141785j3609161j3913498j4195633j4583130j5049820j5461006j5719109
1146.7C52830734j5820160j5788612j5625420j5313434j4808140j3996296j2722225
1153.4B48756447j0909100q635692o054459l234863j04943L477650P632771J2370338
1161.1B43298149J7469349K2391949K6417923K8998565L0031433K9777298K8563080
1167.9D26947746K6627541K4187393K1471214J8596840J5541840J2373161R429436
$$ plain form
1174.6 555175171 562256393 567550583 571166267 572815933 572140694 568668633 561420670 549023170
1182.4 549023170 530762367 507613029 481933403 456151924 432328529 413480453 404797478
1189.1 404797478 412045288 437354202 476174011 518905640 556333313 584249611 603697548
1195.9 603697548 617698021 628169250 635411072 639348679 640452652 639562759 637380829 634365311
1203.6 634365311 630852203 626965828 622409859 616538773 608751450 598869286 587297707 575067101
1211.3 575067101 563788719 555319481 551051445 551207161 554701767 559711609 564499626 567931480
1219 567931480 569506836 569123306 566842003 562738495 556812668 548977776 539212341 527889481 516107025
1227.7 516107025 505681953 498594475 496067886 497865410 502345238 507257347 510700645 511618423
$$ packed form
1174.6E55175171P081222N294190L615684J649666o75239l472061p247963j2397500
1182.4E49023170j8260803k3149338k5679626k5781479k3823395j8848076q682975
1189.1D04797478P247810K5308914L8819809M2731629L7427673K7916298J9447937
1195.9F03697548J4000473J0471229P241822L937607J103973q89893k181930l015518
1203.6F34365311l513108l886375m555969n871086p787323r882164j1571579j2230606
1211.3E75067101j1278382q469238m268036J55716L494606N009842M788017L431854
1219E67931480J575356l83530k281303m103508n925827p834892r765435j1322860j1782456
1227.7E16107025j0425072p087478k526589J797524M479828M912109L443298R17778
$$ plain form
1235.4 511618423 509716301 505158730 498392334 490090408 481015015 471743965 462441559 452844620
1243.1 452844620 442445068 430735474 417445259 402768364 387519455 373058701 360884933
1249.9 360884933 352032127 346599846 343701363 341847839 339530067 335694809 329945755 322477379
1257.6 322477379 313877087 304981213 296943893 291497555 291095676 298505936 315731888 342781105
1265.3 342781105 377171516 414687462 450982170 483002319 509453583 530350838 546287994
1272 546287994 557973175 566108627 571404572 574566765 576243668 576951103 576975708 576303139 574670944
1280.7 574670944 571772881 567491455 561986694 555586662 548587227 541104698 533041039 524135437
1288.4 524135437 514069252 502599640 489687424 475549545 460603943 445407791 430759468
$$ packed form
1235.4E11618423j902122m557571o766396q301926r075393r271050r302406r596939
1243.1D52844620j0399552j1709594j3290215j4676895j5248909j4460754j2173768
1249.9C60884933q852806n432281k898483j853524k317772l835258n749054p468376
1257.6C22477379q600292q895874q037320n446338m01879P410260J7225952K7049217
1265.3C42781105L4390411L7515946L6294708L2020149K6451264K0897255J5937156
1272E46287994J1685181Q135452N295945L162193J676903P07435K4605o72569j632195
1280.7E74670944k898063m281426n504761o400032o999435p482529q063659q905602
1288.4E24135437j0066185j1469612j2912216j4137879j4945602j5196152j4648323
$$ plain form
1295.2 430759468 417998505 409200592 406792374 412452240 425888405 444482002 464274559 481690140
1302.9 481690140 494778214 503262634 507745476 508920708 507232590 502826385 495642128 485822182
1310.6 485822182 474452171 463991013 457554283 457136765 462105293 469371872 475254288 477525749
1318.3 477525749 476106300 472210274 467048721 461193275 454748192 447739487 440234642 432233009
1326 432233009 423608971 414217606 404036903 393208580 381973991 370581551 359209824 347912521
1333.8 347912521 336579628 324924698 312527637 298960686 283979931 267688274 250542946
1340.5 250542946 233177605 216179333 200014782 185144081 172145538 161630726 153953133
1347.3 153953133 148943729 145924797 144013472 142507029 141136189 140141659 140242319 142518730 148172865
$$ packed form
1295.2D30759468j2760963q797913k408218N659866J3436165J8593597J9792557J7415581
1302.9D81690140J3088074Q484420M482842J175232j688118m406205p184257r819946
1310.6D85822182j1370011j0461158o436730m17518M968528P266579N882416K271461
1318.3D77525749j419449l896026n161553n855446o445083p008705p504845q001633
1326D32233009q624038r391365j0180703j0828323j1234589j1392440j1371727j1297303
1333.8C47912521j1332893j1654930j2397061j3566951j4980755j6291657j7145328
1340.5B50542946j7365341j6998272j6164551j4870701j2998543j0514812p677593
1347.3A53953133n009404l018932j911325j506443j370840r94530J00660K276411N654135
$$ plain form
1355.9 148172865 158189716 173073006 192822227 217094250 245288086 276391029 308784313
1362.7 308784313 340402985 369381943 394806290 416971741 436933212 455724068 473860207
1369.4 473860207 491370888 508079071 523730583 537927017 550148354 560044060 567749443 573821754
1377.2 573821754 578755302 582550278 584854584 585623703 585638275 586276016 588637848 592786179 597766838
1385.8 597766838 602362442 605888863 608397751 610254440 611595268 612165565 611607552 609866028 607319374
1394.5 607319374 604535446 601879120 599312057 596518593 593188744 589175797 584446602 579022255
1402.2 579022255 573114624 567366447 562848167 560621033 561122208 563863602 567696915 571410217
1409.9 571410217 574219093 575904427 576671066 576901512 576905174 576734695 576174507 574949493 573003235
$$ packed form
1355.9A48172865J0016851J4883290J9749221K4272023K8193836L1102943L2393284
1362.7C08784313L1618672K8978958K5424347K2165451J9961471J8790856J8136139
1369.4D73860207J7510681J6708183J5651512J4196434J2221337R895706P705383O072311
1377.2E73821754M933548L794976K304306P69119J4572O37741K361832M148331M980659
1385.8E97766838M595604L526421K508888J856689J340828N70297n58013j741524k546654
1394.5F07319374k783928k656326k567063k793464l329849m012947m729195n424347
1402.2E79022255n907631n748177m518280k227134N01175K741394L833313L713302
1409.9E71410217K808876J685334P66639K30446L662j70479n60188j225014j946258
$$ plain form
1418.6 573003235 570584145 568053703 565629425 563338089 561195259 559351768 557992096 557075081
1426.3 557075081 556211929 554852104 552641792 549658127 546332245 543130455 540247040 537540016
1434.1 537540016 534741898 531741562 528670158 525711899 522848740 519831467 516425323 512668381
1441.8 512668381 508850822 505226631 501759872 498158646 494142380 489670830 484962616 480360947
1449.5 480360947 476209335 472797585 470326767 468856239 468281059 468404503 469068527 470225410 471869659
1458.2 471869659 473889694 475982437 477718277 478692589 478637657 477451210 475209541 472200012 468876343
1466.8 468876343 465626144 462478561 459057350 454927483 450037231 444789619 439644432 434693642
1474.6 434693642 429679260 424390182 418931198 413556404 408325653 403025856 397412415 391419411
$$ packed form
1418.6E73003235k419090k530442k424278k291336k142830j843491j359672r17015
1426.3E57075081q63152j359825k210312k983665l325882l201790k883415k707024
1434.1E37540016k798118l000336l071404k958259k863159l017273l406144l756942
1441.8E12668381l817559l624191l466759l601226m016266m471550m708214m601669
1449.5D80360947m151612l411750k470818j470528n75180J23444O64024J156883J644249
1458.2D71869659K020035K092743J735840R74312n4932j186447k241669l009529l323669
1466.8D68876343l250199l147583l421211m129867m890252n247612n145187m950790
1474.6D34693642n014382n289078n458984n374794n230751n299797n613441n993004
$$ plain form
1482.3 391419411 385099640 378452950 371412430 363968468 356196442 348139763 339760628 331078720
1490 331078720 322287521 313591766 304882851 295658531 285373592 273902016 261642132 249189053
1497.7 249189053 236943703 225017490 213410206 202206345 191678905 182401047 175339088 171593494
1505.4 171593494 171539993 173847027 175515652 173650913 168045883 162292061 161806412 169807892 184482861
1514.1 184482861 199884014 209835052 211470070 205700855 195071697 181657314 166789246 151909885
1521.8 151909885 138808746 128777380 121839027 117088757 113717060 111514568 110447969 110067167
1529.5 110067167 109556017 108308907 106311455 103967152 101701298 99801025 98545818 98349457 99715090
1538.2 99715090 103025961 108307743 115098877 122533913 129641848 135673838 140215082 143040609
$$ packed form
1482.3C91419411o319771o646690p040520p443962p772026q056679q379135q681908
1490C31078720q791199q695755q708915r224320j0284939j1471576j2259884j2453079
1497.7B49189053j2245350j1926213j1607284j1203861j0527440r277858p061959l745594
1505.4A71593494n3501K307034J668625j864739n605030n753822m85649Q001480J4674969
1514.1A84482861J5401153R951038J635018n769215j0629158j3414383j4868068j4879361
1521.8A51909885j3101139j0031366o938353m750270l371697k202492j066599l80802
1529.5A10067167n11150j247110j997452k344303k265854j900273j255207j96361J365633
1538.2I9715090L310871N281782O791134P435036P107935O031990M541244K825527
$$ plain form
1545.9 143040609 143943586 142778645 139689589 135259724 130387735 125946617 122469997 120107384
1553.6 120107384 118907127 119215546 121788101 127369204 136020889 146905899 158944311 171859264
1561.4 171859264 186552677 204281273 225319080 248399887 271498013 293203735 313455467
1568.1 313455467 333136787 353112793 373574257 393993111 413395767 430614624 444477959
1574.9 444477959 454024963 458697281 458380051 453315620 444042473 431421165 416597939 400755692
1582.6 400755692 384744720 368860970 352926407 336565895 319472370 301563339 283052750
1589.3 283052750 264439201 246360435 229352741 213690643 199462013 186810722 176116791
1596.1 176116791 167970276 163013115 161794701 164662476 171610584 182086143 194890823 208298969
$$ packed form
1545.9A43040609R02977j164941l089056m429865m871989m441118l476620k362613
1553.6A20107384j200257L08419K572555N581103Q651685J0885010J2038412J2914953
1561.4A71859264J4693413J7728596K1037807K3080807K3098126K1705722K0251732
1568.1C13455467J9681320J9976006K0461464K0418854J9402656J7218857J3863335
1574.9D44477959R547004M672318l17230n064431r273147j2621308j4823226j5842247
1582.6D00755692j6010972j5883750j5934563j6360512j7093525j7909031j8510589
1589.3B83052750j8613549j8078766j7007694j5662098j4228630j2651291j0693931
1596.1A76116791q146515m957161j218414K867775O948108J0475559J2804680J3408146
$$ plain form
1603.8 208298969 220405750 229662266 235547504 239162617 243259964 251278038 265627384 286307850
1611.5 286307850 310979366 336536865 360937500 383831482 405710182 426654968 445952034
1618.2 445952034 462762222 476939621 489110413 500055695 510151405 519380302 527705116 535267677
1626 535267677 542240067 548625908 554301758 559209480 563402672 566887589 569503860 571064644 571627808
1634.6 571627808 571576004 571392403 571368561 571544914 571892662 572484894 573461189 574865913 576546211 578182831
1644.3 578182831 579394455 579892006 579680977 579143448 578734627 578340988 576904373 572937927 565698090
1653 565698090 555879173 544966850 533807945 521905785 508182411 492241364 474634018 455959511
1660.7 455959511 436119385 414748154 392181358 369593811 348118515 328194847 310046501
$$ packed form
1603.8B08298969J2106781R256516N885238L615113M097347Q018074J4349346K0680466
1611.5B86307850K4671516K5557499K4400635K2893982K1878700K0944786J9297066
1618.2D45952034J6810188J4177399J2170792J0945282J0095710R228897Q324814P562561
1626E35267677O972390O385841N675850M907722M193192L484917K616271J560784N63164
1634.6E71627808n1804j83601k3842J76353L47748N92232R76295J404724J680298J636620
1644.3E78182831J211624M97551k11029n37529m08821l93639j436615l966446p239837
1653E65698090r818917j0912323j1158905j1902160j3723374j5941047j7607346j8674507
1660.7D55959511j9840126k1371231k2566796k2587547k1475296j9923668j8148346
$$ plain form
1667.4 310046501 294557838 283237267 277269325 276969395 282341938 293783932 311717834 335544472
1675.1 335544472 363456535 393582840 425059814 457648888 490528641 522087212 551174240
1681.9 551174240 578148041 604150543 629327240 652171402 670855331 685021439 696049271
1688.6 696049271 705685272 714662857 722593842 728826141 733169632 735973511 737852859 739436569
1696.4 739436569 741198730 743358536 745935822 748908997 752231979 755634384 758538742 760401611
1704.1 760401611 761228180 761650696 762392807 763656387 765053864 766058960 766419907 766176529 765465012
1712.8 765465012 764444733 763362198 762537460 762210922 762423553 763043976 763848419 764549637 764847031
1721.4 764847031 764605103 764038925 763643341 763819275 764525909 765321274 765754166 765684738 765220718 764433212
$$ packed form
1667.4C10046501j5488663j1320571n967942k99930N372543J1441994J7933902K3826638
1675.1C35544472K7912063L0126305L1476974L2589074L2879753L1558571K9087028
1681.9E51174240K6973801K6002502K5176697K2844162J8683929J4166108J1027832
1688.6F96049271R636001Q977585P930985O232299M343491K803879J879348J583710
1696.4G39436569J762161K159806K577286K973175L322982L402405K904358J862869
1704.1G60401611Q26569M22516P42111J263580J397477J005096L60947k43378p11517
1712.8G65465012j020279j082535q24738l26538K12631O20423Q04443P01218K97394
1721.4G64847031k41928n66178l95584J75934P06634P95365M32892o9428m64020p87506
$$ plain form
1731.1 764433212 763280106 761865540 760670471 760329895 761059570 762319870 763149185 762903214 761701202
1739.8 761701202 760202484 759027481 758409119 758277893 758488998 758887787 759247437 759297256 758884354
1748.4 758884354 758090744 757187271 756493073 756250458 756521454 757106247 757585678 757559967 756935959 755983963
1758.1 755983963 755100708 754546890 754422302 754803391 755747910 757099762 758379822 759019699 758776550
1766.8 758776550 757908020 756926727 756208038 755832748 755718079 755780487 755928955 755981979 755698853 754947433
1776.4 754947433 753833084 752650375 751711273 751190109 751064453 751127777 751057739 750550156 749495010
1785.1 749495010 748076324 746689911 745713348 745295868 745323410 745545959 745733032 745741272 745505295 745028305
1794.7 745028305 744399033 743782425 743340149 743118362 742996826 742755585 742208557 741303787 740136871
$$ packed form
1731.1G64433212j153106j414566j195069l40576P29675J260300Q29315k45971j202012
1739.8G61701202j498718j175003o18362j31226K11105L98789L59650M9819m12902
1748.4G58884354p93610r03473o94198k42615K70996N84793M79431k5711o24008r51996
1758.1G55983963q83255n53818j24588L81089R44519J351852J280060O39877k43149
1766.8G58776550q68530r81293p18689l75290j14669O2408J48468N3024k83126p51420
1776.4G54947433j114349j182709r39102n21164j25656O3324p0038n07583j055146
1785.1G49495010j418686j386413r76563m17480K7542K22549J87073Q240k35977m76990
1794.7G45028305o29272o16608m42276k21787j21536k41241n47028r04770j166916
$$ plain form
1803.4 740136871 738897324 737802658 737041473 736722412 736838150 737275772 737881775 738537369 739189987
1812.1 739189987 739840775 740534363 741361618 742429504 743764496 745219345 746496353 747298965 747488632
1820.8 747488632 747123871 746402664 745609894 745078583 745078125 745619278 746355972 746768112 746529922 745738068
1830.4 745738068 744788361 744052124 743677750 743639832 743860626 744228134 744551926 744606628 744268036 743574371
1840.1 743574371 742648468 741603012 740564270 739735794 739326324 739342422 739481964 739307709 738575668
1848.7 738575668 737412186 736188049 735249405 734747009 734641418 734777985 734936600 734877090 734427338
1857.4 734427338 733586197 732549210 731622238 731071472 730998077 731288147 731647720 731718903 731237488 730168762
1867.1 730168762 728736572 727323914 726293106 725821915 725833664 726045380 726102905 725736313 724860992
$$ packed form
1803.4G40136871j239547j094666p61185l19061J15738M37622O06003O55594O52618
1812.1G39189987O50788O93588Q27255J067886J334992J454849J277008Q02612J89667
1820.8G47488632l64761p21207p92770n31311m58N41153P36694M12140k38190p91854
1830.4G45738068r49707p36237l74374l7918K20794L67508L23792N4702l38592o93665
1840.1G43574371r25903j045456j038742q28476m09470J6098J39542j74255p32041
1848.7G38575668j163482j224137r38644n02396j05591J36567J58615n9510m49752
1857.4G34427338q41141j036987r26972n50766p3395K90070L59573P1183m81415j068726
1867.1G30168762j432190j412658j030808m71191J1749K11716N7525l66592q75321
$$ plain form
1875.7 724860992 723591919 722182922 720932083 720083542 719736862 719795532 720001373 720062866 719804535
1884.4 719804535 719226608 718440247 717569733 716723099 716022949 715584488 715396194 715217056 714653702 713411407
1894.1 713411407 711508942 709259796 707039337 705057144 703312454 701716385 700236893 698963394
1901.8 698963394 698091049 697851028 698410187 699765091 701704712 703877106 705913544 707521820 708510513
1910.4 708510513 708797607 708432922 707602386 706561356 705532150 704654007 704005356 703621826 703442993
1919.1 703442993 703252869 702745209 701726913 700304108 698873596 697915878 697754059 698441849 699795303
1927.8 699795303 701486969 703144684 704459991 705301056 705759506 706076584 706487503 707096863 707860718
1936.5 707860718 708639450 709250565 709506073 709283905 708629684 707807159 707198486 707087631 707483292 708120880
$$ packed form
1875.7G24860992j269073j408997j250839q48541l46680N8670K05841O1493k58331
1884.4G19804535n77927p86361q70514q46634p00150m38461j88294j79138n63354j242295
1894.1G13411407j902465k249146k220459j982193j744690j596069j479492j273499
1901.8F98963394q72345k40021N59159J354904J939621K172394K036438J608276R88693
1910.4G08510513K87094l64685q30536j041030j029206q78143o48651l83530j78833
1919.1G03442993j90124n07660j018296j422805j430512r57718j61819O87790J353454
1927.8F99795303J691666J657715J315307Q41065M58450L17078M10919O09360P63855
1936.5G07860718P78732O11115K55508k22168o54221q22525o08673j10855L95661O37588
$$ plain form
1946.1 708120880 708636398 708771057 708472366 707864990 707157440 706554108 706192703 706103363 706194687 706284027
1955.8 706284027 706173172 705742645 705019379 704178162 703470078 703103714 703144608 703484268 703897781 704146805
1965.4 704146805 704074631 703654175 702985764 702252350 701647644 701299973 701221619 701307220 701376495 701247101
1975.1 701247101 700809555 700084991 699230576 698477783 698018417 697910690 698059006 698275833 698369141 698203354
1984.7 698203354 697727203 696987152 696124496 695332413 694770737 694487762 694405899 694379425 694273911 694017639
1994.3 694017639 693615417 693143539 692728424 692503662 692546692 692829666 693217392 693513031 693533096 693184204
2004 693184204 692517624 691727371 691069336 690728149 690715866 690878143 691002808 690941544 690657883 690195847
2013.6 690195847 689631882 689058533 688587341 688325500 688315582 688484879 688662643 688669662 688422318 687977600
$$ packed form
1946.1G08120880N15518J34659k98691o07376p07550o03332l61405q9340R1324Q9340
1955.8G06284027j10855m30527p23266q41217p08084l66364M0894L39660M13513K49024
1965.4G04146805p2174m20456o68411p33414o04706l47671p8354Q5601O9275j29394
1975.1G01247101m37546p24564q54415p52793m59366j07727J48316K16827R3308j65787
1984.7F98203354m76151p40051q62656p92083n61676k82975q1863k6474j05514k56272
1994.3F94017639m02222m71878m15115k24762M3030K82974L87726K95639K0065l48892
2004F93184204o66580p90253o58035l41187j2283J62277J24665o1264k83661m62036
2013.6F90195847n63965n73349m71192k61841r918J69297J77764P019k47344m44718
$$ plain form
2023.3 687977600 687493591 687139664 687018356 687136612 687415543 687718353 687882996 687772141 687335892 686652298
2032.9 686652298 685904007 685294189 684943619 684837799 684849319 684813995 684613800 684224548 683716507 683212357
2042.6 683212357 682830963 682645798 682671585 682866745 683139801 683360291 683395691 683176117 682749710 682276840
2052.2 682276840 681945648 681861801 681984558 682151489 682168198 681902771 681341019 680585937 679807510 679164886
2061.9 679164886 678735199 678490829 678334274 678161469 677903519 677529449 677035065 676448364 675847168 675349579
2071.5 675349579 675063019 675020447 675153580 675322495 675381546 675240936 674902649 674456329 674033890 673740768
2081.1 673740768 673600388 673552017 673500519 673372269 673139191 672809753 672425461 672067642 671849823 671862793
2090.8 671862793 672101974 672442245 672696152 672715683 672460175 671995850 671450577 670968094 670672302 670630722
$$ packed form
2023.3F87977600m84009l53927j21308J18256K78931L02810J64643j10855m36249o83594
2032.9F86652298p48291o09818l50570j05820J1520l5324k00195l89252n08041n04150
2042.6F83212357l81394j85165K5787J95160K73056K20490L5400k19574m26407m72870
2052.2F82276840l31192q3847J22757J66931J6709k65427n61752p55082p78427o42624
2061.9F79164886m29687k44370j56555j72805k57950l74070m94384n86701o01196m97589
2071.5F75349579k86560m2572J33133J68915N9051j40610l38287m46320m22439k93122
2081.1F73740768j40380m8371n1498j28250k33078l29438l84292l57819k17819J2970
2090.8F71862793K39181L40271K53907J9531k55508m64325n45273m82483k95792m1580
$$ plain form
2100.4 670630722 670819473 671122971 671383057 671473618 671351089 671059799 670708237 670432205 670346603 670481644
2110.1 670481644 670749207 670978012 671013565 670809021 670433807 670005798 669620132 669328995 669159470 669116974
2119.7 669116974 669165726 669221649 669189682 669019470 668734665 668415451 668159103 668040390 668079376 668222351
2129.4 668222351 668354492 668356628 668171387 667829971 667419205 667026291 666709137 666494141 666375732 666306076
2139 666306076 666198883 665969925 665588684 665094147 664563293 664063721 663635712 663296661 663045959 662852859
2148.6 662852859 662656174 662394409 662051849 661680145 661371155 661201935 661194382 661312332 661485062 661635818
2158.3 661635818 661701126 661642761 661459579 661192627 660915833 660706329 660606842 660604248 660635452 660617905 660486221
2168.9 660486221 660215683 659829559 659386902 658958206 658600006 658338013 658164291 658042145 657915497 657724457
$$ packed form
2100.4F70630722J88751L03498K60086R0561j22529k91290l51562k76032q5602J35041
2110.1F70481644K67563K28805L5553k04544l75214m28009l85666k91137j69525m2496
2119.7F69116974M8752N5923l1967j70212k84805l19214k56348j18713L8986J42975
2129.4F68222351J32141K136j85241l41416m10766l92914l17154k14996j18409o9656
2139F66306076j07193k28958l81241m94537n30854m99572m28009l39051k50702j93100
2148.6F62852859j96685k61765l42560l71704l08990j69220p553J17950J72730J50756
2158.3F61635818O5308n8365j83182k66952k76794k09504r9487k594L1204j7547j31684
2168.9F60486221k70538l86124m42657m28696l58200k61993j73722j22146j26648j91040
$$ plain form
2178.5 657724457 657427063 657022629 656556931 656100693 655717392 655441437 655274353 655184860 655108795 654959030
2188.2 654959030 654665680 654225006 653718872 653276215 652996521 652889633 652872009 652822266 652651825 652348404
2197.8 652348404 651967850 651588211 651264343 651012878 650828857 650698471 650594101 650465317 650256195 649946671
2207.5 649946671 649574661 649212112 648909836 648667755 648450623 648221588 647956161 647629089 647201843 646634903
2217.1 646634903 645916214 645083542 644220276 643419724 642734299 642140198 641555405 640907364 640203400 639543571
2226.8 639543571 639065437 638869095 638979492 639355164 639915810 640564041 641205673 641775131 642250977 642647171
2236.4 642647171 642987442 643287888 643560638 643818817 644065475 644279251 644417114 644441528 644350204 644184189
2246 644184189 644009857 643889542 643854370 643888931 643934021 643913040 643769608 643497772 643142395 642769623 642428513
$$ packed form
2178.5F57724457k97394m04434m65698m56238l83301k75955j67084q9493p6065j49765
2188.2F54959030k93350m40674n06134m42657k79694j06888j7624m9743j70441l03421
2197.8F52348404l80554l79639l23868k51465j84021j30386j04370j28784k09122l09524
2207.5F49946671l72010l62549l02276k42081k17132k29035k65427l27072m27246n66940
2217.1F46634903p18689q32672q63266q00552o85425n94101n84793o48041p03964o59829
2226.8F39543571m78134j96342J10397L75672N60646O48231O41632N69458M75846L96194
2236.4F42647171L40271L00446K72750K58179K46658K13776J37863K4414r1324j66015
2246F44184189j74332j20315l5172L4561M5090k0981j43432k71836l55377l72772l41110
$$ plain form
2256.7 642428513 642131042 641863632 641616211 641392670 641192245 640980377 640696411 640307312 639858360 639461632
2266.3 639461632 639215736 639131317 639128647 639105110 639001083 638807106 638532104 638184814 637789574 637398415
2275.9 637398415 637070999 636831398 636649971 636467743 636236725 635945091 635612869 635276566 634974289 634733543
2285.6 634733543 634558182 634423561 634285851 634101868 633843002 633497047 633064613 632559128 632010880 631460228
2295.2 631460228 630934143 630425568 629898911 629325600 628716545 628116951 627565308 627057076 626553497 626025009
2304.9 626025009 625481644 624955902 624455757 623940277 623353348 622695122 622072449 621677246 621689491 622166595
2314.5 622166595 622996635 623955116 624818420 625447502 625791702 625851402 625665703 625337715 625029755 624884567
2324.2 624884567 624921532 625012360 624973679 624694405 624185944 623536949 622849579 622219772 621748123 621517334
$$ packed form
2256.7F42428513k97471k67410k47421k23541k00425k11868k83966l89099m48952l96728
2266.3F39461632k45896q4419k670k3537j04027j93977k75002l47290l95240l91159
2275.9F37398415l27416k39601j81427j82228k31018k91634l32222l36303l02277k40746
2285.6F34733543j75361j34621j37710j83983k58866l45955m32434n05485n48248n50652
2295.2F31460228n26085n08575n26657n73311o09055n99594n51643n08232n03579n28488
2304.9F26025009n43365n25742n00145n15480n86929o58226o22673l95203J2245M77104
2314.5F22166595Q30040R58481Q63304O29082L44200N9700j85699l27988l07960j45188
2324.2F24884567L6965R0828l8681k79274n08461o48995o87370o29807m71649k30789
$$ plain form
2333.8 621517334 621536903 621710472 621882439 621936302 621867599 621770172 621742287 621791115 621822014 621740723 621584282
2344.4 621584282 621541214 621799278 622345848 622927322 623244286 623201523 622950134 622672653 622351303 621788216
2354.1 621788216 620863419 619736595 618758049 618173218 617930412 617780190 617538872 617236519 617021561
2362.7 617021561 616957550 616937218 616792412 616470375 616096001 615862923 615865784 616030807 616200142 616274033
2372.4 616274033 616272163 616273346 616319199 616394386 616487617 616639023 616902313 617263794 617623596 617866859 617950172
2383 617950172 617911987 617814407 617693748 617568741 617472420 617450829 617526436 617674065 617835922 617957230 618006287
2393.6 618006287 617979088 617898712 617812347 617768211 617777290 617790375 617721748 617503014 617126923 616649628 616156273
2404.2 616156273 615719185 615366173 615071030 614767723 614384575 613884506 613285027 612643547 612028122 611493225
$$ packed form
2333.8F21517334J9569J73569J71967N3863o8703r7427k7885M8828L0899q1291j56441
2344.4F21584282m3068K58064N46570N81474L16964m2763k51389k77481l21350n63087
2354.1F21788216r24797j126824r78546n84831k42806j50222k41318l02353k14958
2362.7F17021561o4011k0332j44806l22037l74374k33078K861J65023J69335P3891
2372.4F16274033j870J183M5853P5187R3231J51406K63290L61481L59802K43263Q3313
2383F17950172l8185r7580j20659j25007r6321k1591P5607J47629J61857J21308M9057
2393.6F18006287k7199q0376q6365m4136R079J3085o8627k18734l76091m77295m93355
2404.2F16156273m37088l53012k95143l03307l83148n00069n99479o41480o15425n34897
$$ plain form
2413.8 611493225 611074181 610783958 610598030 610446815 610238419 609915352 609500771 609090042 608790169 608659248
2423.5 608659248 608694229 608858795 609105148 609371490 609582367 609680519 609671249 609623985 609619789 609690971 609814720
2434.1 609814720 609950829 610071259 610144463 610111465 609907990 609527168 609055138 608627968 608340225 608186798
2443.7 608186798 608085403 607947044 607725220 607412605 607016640 606557083 606084328 605681419 605418816 605292015
2453.4 605292015 605204430 605024872 604682121 604214363 603739128 603372383 603169479 603120193 603178635 603282242
2463 603282242 603353233 603305473 603079224 602690620 602246208 601898842 601759415 601832123 602022476 602212868
2472.7 602212868 602339668 602407265 602439804 602436028 602381516 602295647 602240982 602267914 602346153 602366829 602222786
2483.3 602222786 601893387 601451569 600999641 600602341 600273361 600003891 599784050 599592857 599379997 599074135
$$ packed form
2413.8F11493225m19044k90223j85928j51215k08396l23067m14581m10729k99873j30921
2423.5F08659248L4981J64566K46353K66342K10877R8152r270m7264m196P1182J23749
2434.1F09814720J36109J20430P3204l2998k03475l80822m72030m27170k87743j53427
2443.7F08186798j01395j38359k21824l12615l95965m59557m72755m02909k62603j26801
2453.4F05292015q7585j79558l42751m67758m75235l66745k02904m9286N8442J03607
2463F03282242P0991m7760k26249l88604m44412l47366j39427P2708J90353J90392
2472.7F02212868J26800O7597L2539l776n4512q5869n4665K6932P8239K0676j44043
2483.3F02222786l29399m41818m51928l97300l28980k69470k19841j91193k12860l05862
$$ plain form
2492.9 599074135 598624420 598041496 597402687 596808205 596323662 595952606 595661659 595426941 595252800 595146523
2502.6 595146523 595090370 595053139 595031815 595072060 595229759 595511436 595854454 596168365 596392555 596514130
2512.2 596514130 596548996 596523094 596477852 596472359 596555405 596722755 596902618 596994743 596929512 596701965 596360092
2522.8 596360092 595978737 595637054 595405960 595326042 595383034 595504684 595592880 595578117 595456886 595285378
2532.5 595285378 595137367 595057831 595040169 595040398 595008507 594916229 594762077 594561272 594336433 594117508 593938789
2543.1 593938789 593823776 593763847 593713074 593609581 593412209 593124657 592793503 592483215 592243614 592085571
2552.7 592085571 591979485 591873360 591720619 591493988 591184273 590798645 590370483 589963646 589644547 589433784
2562.4 589433784 589283638 589114799 588879852 588588905 588272972 587939644 587577667 587201347 586866493 586623573
$$ packed form
2492.9E99074135m49715n82924o38809n94482m84543l71056k90947k34718j74141j06277
2502.6E95146523n6153l7231k1324M0245J57699K81677L43018L13911K24190J21575
2512.2E96514130L4866k5902m5242n493Q3046J67350J79863R2125o5231k27547l41873
2522.8E96360092l81355l41683k31094p9918N6992J21650Q8196j4763j21231j71508
2532.5E95285378j48011p9536j7662K29l1891r2278j54152k00805k24839k18925j78719
2543.1E93938789j15013n9929n0773j03493j97372k87552l31154l10288k39601j58043
2552.7E92085571j06086j06125j52741k26631l09715l85628m28162m06837l19099k10763
2562.4E89433784j50146j68839k34947k90947l15933l33328l61977l76320l34854k42920
$$ plain form
2572 586623573 586454582 586262703 585936890 585430260 584789467 584119682 583522148 583048592 582688866 582389297
2581.6 582389297 582082138 581712265 581250610 580698128 580088806 579484062 578950119 578518333 578161469 577809219
2591.3 577809219 577397842 576914520 576404305 575943108 575601425 575418930 575394516 575491753 575656815 575840721
2600.9 575840721 576011505 576153870 576269608 576383820 576544113 576795120 577140732 577528839 577884293 578162613
2610.6 578162613 578375282 578565025 578758621 578948784 579116821 579264755 579416847 579587784 579754486 579862251
2620.2 579862251 579862747 579747925 579553146 579334335 579143486 579013100 578945808 578913383 578873863 578807106 578735771
2630.8 578735771 578701134 578709335 578706856 578620872 578426247 578168983 577919121 577706032 577504921 577280655 577035675
2641.4 577035675 576811104 576649666 576556702 576492615 576395798 576218719 575954514 575634270 575297470 574961090
$$ packed form
2572E86623573j68991j91879l25813n06630o40793o69785n97534m73556l59726k99569
2581.6E82389297l07159l69873m61655n52482o09322o04744n33943m31786l56864l52250
2591.3E77809219m11377m83322n10215m61197l41683j82495k4414R7237J65062J83906
2600.9E75840721J70784J42365J15738J14212J60293K51007L45612L88107L55454K78320
2610.6E78162613K12669J89743J93596J90163J68037J47934J52092J70937J66702J07765
2620.2E79862251M96j14822j94779k18811j90849j30386o7292l2425l9520o6757p1335
2630.8E78735771l4637Q201k479q5984j94625k57264k49862k13089k01111k24266k44980
2641.4E77035675k24571j61438r2964o4087r6817j77079k64205l20244l36800l36380
$$ plain form
2651.1 574961090 574625092 574302521 574032784 573846931 573719444 573567848 573313599 572945747 572524834 572130547
2660.7 572130547 571810646 571570244 571387749 571226501 571040497 570791359 570472755 570114059 569753914 569405632
2670.4 569405632 569055824 568691254 568323326 567984962 567705002 567482109 567275925 567024155 566682549 566264038
2680 566264038 565841713 565493622 565231934 564984169 564657288 564227562 563765678 563370934 563083458 562865334
2689.6 562865334 562660904 562463150 562313690 562246552 562244720 562256889 562248650 562228928 562229500 562265778 562325020 562383003
2701.2 562383003 562423859 562439423 562414207 562324181 562154160 561921616 561678009 561482811 561365738 561304550
2710.9 561304550 561237679 561102180 560876999 560595779 560327187 560131416 560026169 559977531 559918213 559783974
2720.5 559783974 559548721 559237976 558909187 558607178 558328094 558022881 557636948 557146759 556561394 555901871
$$ packed form
2651.1E74961090l35998l22571k69737j85853j27487j51596k54249l67852m20913l94287
2660.7E72130547l19901k40402j82495j61248j86004k49138l18604l58696l60145l48282
2670.4E69405632l49808l64570l67928l38364k79960k22893k06184k51770l41606m18511
2680E66264038m22325l48091k61688k47765l26881m29726m61884l94744k87476k18124
2689.6E62865334k04430j97754j49460o7138j832J2169q239j9722N72L6278N9242N7983
2701.2E62383003M0856J5564k5216r0026j70021k32544k43607j95198j17073o1188
2710.9E61304550o6871j35499k25181k81220k68592j95771j05247m8638n9318j34239
2720.5E59783974k35253l10745l28789l02009k79084l05213l85933m90189n85365o59523
$$ plain form
2730.2 555901871 555193596 554483643 553853035 553388519 553129730 553048668 553084450 553200417 553399887 553688278
2739.8 553688278 554031067 554357529 554606056 554756050 554818001 554796753 554674759 554430580 554073715 553661308
2749.4 553661308 553280449 553004036 552848511 552763977 552669296 552508125 552277946 552009773 551726341 551428528
2759.1 551428528 551121025 550835228 550610008 550440216 550258331 549977417 549559708 549050293 548547554 548145943
2768.7 548145943 547891884 547766800 547690048 547543755 547225990 546714096 546091766 545503693 545062675 544781113
2778.4 544781113 544578323 544351540 544041939 543651428 543214188 542766457 542341690 541979027 541715813 541560631
2788 541560631 541473427 541378136 541205292 540931664 540587845 540234032 539926834 539700356 539561691 539495468
2797.7 539495468 539465866 539422379 539310379 539090614 538759346 538356667 537954941 537624855 537396317 537235298
$$ packed form
2730.2E55901871p08275p09953o30608m64516k58789q1062L5782J15967J99470K88391
2739.8E53688278L42789L26462K48527J49994O1951k1248j21994k44179l56865m12407
2749.4E53661308l80859k76413j55525q4534r4681j61171k30179k68173k83432k97813
2759.1E51428528l07503k85797k25220j69792j81885k80914m17709n09415n02739m01611
2768.7E48145943k54059j25084p6752j46293l17765n11894o22330n88073m41018k81562
2778.4E44781113k02790k26783l09601l90511m37240m47731m24767l62663k63214j55182
2788E41560631q7204r5291j72844k73628l43819l53813l07198k26478j38665o6223
2797.7E39495468k9602m3487j12000k19765l31268m02679m01726l30086k28538j61019
$$ plain form
2807.3 537235298 537059021 536781578 536361923 535817566 535197678 534548187 533901634 533294716 532774124 532366829
2816.9 532366829 532041817 531712379 531294746 530769920 530187302 529610252 529067001 528549881 528046188 527550201
2826.6 527550201 527046509 526505394 525907822 525273514 524645538 524046364 523451462 522808151 522071495 521217995
2836.2 521217995 520238647 519137573 517942581 516702881 515465431 514247894 513033142 511784706
2843.9 511784706 510466270 509063568 507610931 506197929 504929008 503854942 502947655 502155380 501482849
2852.6 501482849 500993805 500722618 500592537 500448494 500179825 499807930 499452057 499219437 499129753 499128914
2862.3 499128914 499144325 499121933 499033661 498883553 498717422 498613091 498641357 498826904 499143486 499540787
2871.9 499540787 499968719 500376892 500706673 500904083 500955849 500909882 500852356 500848122 500893097 500919266 500842819
$$ packed form
2807.3E37235298j76277k77443m19655n44357o19888o49491o46553o06918n20592m07295
2816.9E32366829l25012l29438m17633n24826n82618n77050n43251n17120n03693m95987
2826.6E27550201n03692n41115n97572o34308o27976n99174n94902o43311p36656q53500
2836.2E21217995r79348j101074j194992j239700j237450j217537j214752j248436
2843.9E11784706j318436j402702j452637j413002j268921j074066r07287p92275o72531
2852.6E01482849m89044k71187j30081j44043k68669l71895l55873k32620q9684q39
2862.3D99128914J5411k2392q8272j50108j66131j04331K8266J85547L16582L97301
2871.9D99540787M27932M08173L29781J97410N1766m5967n7526m234M4975K6169p6447
$$ plain form
2882.5 500842819 500615578 500240822 499755707 499206505 498635254 498075829 497547188 497049255 496563797 496064835
2892.2 496064835 495524292 494914742 494216156 493426933 492569923 491674156 490744743 489744339 488614159
2900.8 488614159 487315750 485862846 484312477 482719193 481090355 479375839 477499962 475411224
2908.6 475411224 473109589 470633163 468026314 465325890 462582283 459900055 457458801 455493240
2916.3 455493240 454231911 453820992 454266129 455423508 457049942 458888283 460738907 462480888 464046745
2925 464046745 465387535 466453438 467201271 467608833 467689056 467491989 467093582 466571007 465976601 465325394
2934.6 465325394 464603615 463790474 462882500 461909370 460930672 460008049 459171638 458411255 457712212 457102737
2944.2 457102737 456661301 456462822 456518707 456768684 457130966 457549057 457989044 458410530 458763046 459020462
$$ packed form
2882.5E00842819k27241l74756m85115n49202n71251n59425n28641m97933m85458m98962
2892.2D96064835n40543o09550o98586p89223q57010q95767r29413j000404j130180
2900.8D88614159j298409j452904j550369j593284j628838j714516j875877k088738
2908.6D75411224k301635k476426k606849k700424k743607k682228k441254j965561
2916.3D55493240j261329m10919M45137J157379J626434J838341J850624J741981J565857
2925D64046745J340790J065903P47833M07562Q0223j97067l98407n22575n94406o51207
2934.6D65325394p21779q13141r07974r73130r78698r22623q36411p60383o99043o09475
2944.2D57102737m41436j98479N5885K49977L62282M18091M39987M21486L52516K57416
$$ plain form
2953.9 459020462 459202576 459346466 459453583 459473190 459346237 459060860 458666725 458234253 457808647 457391205
2963.5 457391205 456954079 456463547 455898590 455263329 454593124 453943520 453365059 452878876 452471733 452111511
2973.2 452111511 451764336 451400032 450989113 450508003 449952545 449346504 448732109 448143044 447579460 447003784
2982.8 447003784 446361008 445613899 444772758 443897591 443062439 442299538 441569405 440784836 439877167 438844910
2992.5 438844910 437741776 436621132 435492477 434331856 433123550 431885986 430658302 429469528
3000.2 429469528 428320465 427189751 426051064 424888954 423709221 422530518 421360817 420176353
3007.9 420176353 418941116 417657661 416396599 415254784 414265060 413346062 412348671 411152496 409713669
3016.6 409713669 408028336 406072769 403804169 401216393 398374405 395384407 392339592 389317856
$$ packed form
2953.9D59020462J82114J43890J07117J9607j26953k85377l94135m32472m25606m17442
2963.5D57391205m37126m90532n64957o35261o70205o49604n78461m86183m07143l60222
2973.2D52111511l47175l64304m10919m81110n55458o06041o14395n89065n63584n75676
2982.8D47003784o42776p47109q41141q75167q35152p62901p30133p84569r07669j032257
2992.5D38844910j103134j120644j128655j160621j208306j237564j227684j188774
3000.2D29469528j149063j130714j138687j162110j179733j178703j169701j184464
3007.9D20176353j235237j283455j261062j141815r89724r18998r97391j196175j438827
3016.6D09713669j685333j955567k268600k587776k841988k989998l044815l021736
$$ plain form
3024.3 389317856 386425171 383811264 381605911 379827957 378371887 377106018 375996513 375134735
3032 375134735 374634628 374493217 374545479 374557686 374377823 374021797 373639679 373415985 373494949 373969688
3041.6 373969688 374896164 376281548 378051949 380046539 382060204 383908768 385471230 386708946
3049.4 386708946 387678146 388532944 389478607 390675468 392160263 393865814 395731583 397798157 400189896
3058 400189896 403001404 406201935 409641380 413138809 416570625 419898148 423137741 426312866 429417458
3066.7 429417458 432405281 435209122 437775726 440092697 442188187 444110794 445908089 447605553
3074.4 447605553 449185753 450579453 451699562 452512207 453090706 453590431 454151039 454806023 455471420
3083.1 455471420 456014938 456335106 456396027 456214294 455826950 455271111 454587364 453854713 453233986 452966957
$$ packed form
3024.3C89317856k892685k613907k205353j777954j456070j265869j109505q61778
3032C75134735n00107j41411N2262J2207j79863l56026l82118k23694P8964M74739
3041.6C73969688R26476J385384J770401J994590K013665J848564J562462J237716
3049.4C86708946R69200Q54798R45663J196861J484795J705551J865769K066574K391739
3058D00189896K811508L200531L439445L497429L431816L327523L239593L175125L104592
3066.7D29417458K987823K803841K566604K316971K095490J922607J797295J697464
3074.4D47605553J580200J393700J120109Q12645N78499M99725N60608O54984O65397
3083.1D55471420N43518L20168O0921j81733l87344n55839o83747p32651o20727k67029
$$ plain form
3092.7 452966957 453297386 454351768 456070480 458245354 460618286 462949677 465028801 466681328
3100.5 466681328 467818184 468480644 468807259 468932266 468914032 468764153 468521690 468264122 468042564 467831116
3110.1 467831116 467566605 467229195 466861687 466508331 466163177 465802040 465449753 465188141 465091133 465166626
3119.8 465166626 465372696 465675735 466072273 466566238 467149658 467815094 468565636 469386139 470209427 470934677
3129.4 470934677 471494598 471897964 472197800 472425995 472570763 472618256 472593002 472540054 472464180 472296867
3139 472296867 471932411 471308174 470456238 469488068 468526726 467640228 466825447 466040726 465248680 464430046
3148.7 464430046 463572693 462667694 461727676 460801544 459954453 459227867 458623390 458131371 457764587 457549210
3158.3 457549210 457477570 457481346 457468796 457396545 457305794 457280731 457365990 457516632 457621651 457582855 457383080
$$ packed form
3092.7D52966957L30429J054382J718712K174874K372932K331391K079124J652527
3100.5D66681328J136856O62460L26615J25007j8234j49879k42463k57568k21558k11448
3110.1D67831116k64511l37410l67508l53356l45154l61137l52287k61612r7008P5493
3119.8D65166626K06070L03039L96538M93965N83420O65436P50542Q20503Q23288P25250
3129.4D70934677N59921M03366K99836K28195J44768M7493k5254n2948p5874j67313
3139D72296867l64456o24237q51936r68170r61342q86498q14781p84721p92046q18634
3148.7D64430046q57353r04999r40018r26132q47091p26586o04477m92019l66784k15377
3158.3D57549210p1640L776j2550p2251r0751k5063Q5259J50642J05019l8796j99775
$$ plain form
3168.9 457383080 457093239 456819611 456640434 456578865 456619072 456729393 456861992 456941719 456881905 456635895
3178.6 456635895 456245232 455827217 455495262 455270462 455061531 454731941 454201241 453496513 452714691 451936150
3188.2 451936150 451171074 450381622 449543343 448677979 447825699 446996384 446155624 445259056 444296227 443304367
3197.9 443304367 442352333 441513824 440837173 440314026 439864845 439364738 438706589 437853661 436838303
3206.5 436838303 435722694 434565582 433421059 432338371 431336975 430376778 429371376 428248215
3214.3 428248215 427001991 425694122 424408684 423211899 422137527 421178322 420276260 419333725 418269043
3222.9 418269043 417081871 415865555 414744873 413796387 413019180 412366753 411791115 411256523 410734329
3231.6 410734329 410207939 409686890 409203072 408781891 408422012 408104172 407816887 407557068 407304687 407011833
$$ packed form
3168.9D57383080k89841k73628j79177o1569M0207J10321J32599P9727n9814k46010
3178.6D56635895l90663m18015l31955k24800k08931l29590n30700p04728p81822p78541
3188.2D51936150p65076p89452q38279q65364q52280q29315q40760q96568r62829r91860
3197.9D43304367r52034q38509o76651n23147m49181n00107o58149q52928j015358
3206.5D36838303j115609j157112j144523j082688j001396r60197j005402j123161
3214.3D28248215j246224j307869j285438j196785j074372r59205r02062r42535j064682
3222.9D18269043j187172j216316j120682r48486p77207o52427n75638n34592n22194
3231.6D10734329n26390n21049m83818m21181l59879l17840k87285k59819k52381k92854
$$ plain form
3241.3 407011833 406635551 406187363 405734215 405334740 404970474 404548340 403980751 403260536 402449875 401591110
3250.9 401591110 400641022 399503326 398130722 396585617 394990540 393417740 391830559 390135498
3258.6 390135498 388279495 386294327 384253426 382204933 380152588 378090477 376027641 373970871
3266.3 373970871 371888580 369707870 367358398 364817162 362118149 359323082 356485863 353634529
3274 353634529 350771332 347881927 344944954 341936607 338828468 335585709 332176933 328603935 324922295
3282.7 324922295 321224365 317589893 314051552 310615044 307310829 304215508 301412945 298943081
3290.4 298943081 296808987 295041943 293748322 293075085 293121662 293891125 295326405 297381401 300047626
3299.1 300047626 303321095 307166805 311523304 316326275 321505318 326956406 332537727 338114700
$$ packed form
3241.3D07011833l76282m48188m53148l99475l64266m22134n67589p20215q10661q58765
3250.9D01591110r50088j137696j372604j545105j595077j572800j587181j695061
3258.6C90135498j856003j985168k040901k048493k052345k062111k062836k056770
3266.3C73970871k082291k180710k349472k541236k699013k795067k837219k851334
3274C53634529k863197k889405k936973l008347l108139l242759l408776l572998l681640
3282.7C24922295l697930l634472l538341l436508l304215l095321k802563k469864
3290.4B98943081k134094j767044j293621o73237M6577P69463J435280K054996K666225
3299.1C00047626L273469L845710M356499M802971N179043N451088N581321N576973
$$ plain form
3306.8 338114700 343612289 349019127 354343796 359571228 364657822 369549828 374194450 378544426
3314.6 378544426 382576904 386315384 389821587 393146324 396285362 399193535 401840096 404243660
3322.3 404243660 406442680 408448601 410246277 411848488 413333740 414811363 416347504 417930832
3330 417930832 419512100 421064644 422595711 424103813 425542564 426838112 427942505 428866692 429664612
3338.7 429664612 430390244 431068726 431695213 432248268 432702179 433038750 433255882 433369484 433402710 433372192
3348.3 433372192 433282280 433131828 432914352 432609253 432180901 431607704 430927200 430246277 429683151 429280624
3357.9 429280624 428975296 428660927 428287468 427891769 427533188 427213783 426879387 426493874 426094322 425756302
3367.6 425756302 425519066 425361824 425257111 425223923 425313644 425545807 425874252 426218948 426519051 426755753
$$ packed form
3306.8C38114700N497589N406838N324669N227432N086594M892006M644622M349976
3314.6C78544426M032478L738480L506203L324737L139038K908173K646561K403564
3322.3D04243660K199020K005921J797676J602211J485252J477623J536141J583328
3330D17930832J581268J552544J531067J508102J438751J295548J104393R24187P97920
3338.7D29664612P25632O78482O26487N53055M53911L36571K17132J13602L3226l0518
3348.3D33372192q9912j50452k17476l05099m28352n73197o80504o80923n63126m02527
3357.9D29280624l05328l14369l73459l95699l58581l19405l34396l85513l99552l38020
3367.6D25756302k37236j57242j04713l3188Q9721K32163L28445L44696L00103K36702
$$ plain form
3377.2 426755753 426937675 427086258 427230682 427396889 427588387 427778931 427937431 428060112 428175545 428315201
3386.9 428315201 428481483 428640671 428742104 428748360 428660431 428519821 428375664 428238754 428066330 427810097
3396.5 427810097 427484665 427178078 426979523 426893387 426831360 426687927 426421089 426060753 425658913 425245171
3406.2 425245171 424824638 424402962 423999634 423637695 423318710 423007240 422647057 422210007 421742668 421351814
3415.8 421351814 421117249 421006927 420884323 420614853 420171814 419647560 419174728 418842583 418666420 418594666
3425.5 418594666 418530960 418372345 418072395 417683907 417329979 417115631 417060089 417102165 417150993 417127304
3435.1 417127304 416987267 416752396 416527214 416454582 416617012 416974792 417416840 417863655 418301620 418713989
3444.7 418713989 419023819 419147148 419100456 419016151 419025879 419142113 419276619 419363632 419432945 419553642 419729919
$$ packed form
3377.2D26755753J81922J48583J44424J66207J91498J90544J58500J22681J15433J39656
3386.9D28315201J66282J59188J01433O256q7929j40610j44157j36910j72424k56233
3396.5D27810097l25432l06587j98555q6136o2027j43433k66838l60336m01840m13742
3406.2D25245171m20533m21676m03328l61939l18985l11470l60183m37050m67339l90854
3415.8D21351814k34565j10322j22604k69470m43039n24254m72832l32145j76163p1754
3425.5D18594666o3706j58615k99950l88488l53928k14348n5542M2076M8828k3689
3435.1D17127304j40037k34871k25182p2632J62430L57780M42048M46815M37965M12369
3444.7D18713989L09830J23329m6692q4305R728J16234J34506Q7013O9313J20697J76277
$$ plain form
3455.3 419729919 419882812 419929771 419866142 419765244 419717140 419776306 419945030 420179253 420410118 420583611
3465 420583611 420700188 420811882 420970917 421180038 421404533 421625328 421860657 422124405 422381134 422570343
3474.6 422570343 422682991 422792664 422988091 423271255 423540306 423687820 423715439 423747139 423928413 424306831
3484.3 424306831 424798851 425255890 425564423 425707855 425760193 425830269 425992508 426247368 426534195 426781082
3493.9 426781082 426950989 427054672 427140541 427278366 427533379 427914963 428336372 428648262 428761597 428753586
3503.6 428753586 428827438 429136505 429640083 430150948 430525627 430790825 431075630 431446686 431839180 432145233
3513.2 432145233 432331924 432454414 432583923 432759171 433005867 433353157 433797646 434268837 434670868 434973297
3522.9 434973297 435238914 435543709 435884209 436186104 436405602 436600609 436889114 437343979 437935982 438565826
$$ packed form
3455.3D19729919J52893M6959o3629j00898m8104N9166J68724K34223K30865J73493
3465D20583611J16577J11694J59035K09121K24495K20795K35329K63748K56729J89209
3474.6D22570343J12648J09673J95427K83164K69051J47514K7619L1700J81274L78418
3484.3D24306831M92020M57039L08533J43432N2338P0076J62239K54860K86827K46887
3493.9D26781082J69907J03683Q5869J37825K55013L81584M21409L11890J13335q011
3503.6D28753586P3852L09067N03578N10865L74679K65198K84805L71056L92494L06053
3513.2D32145233J86691J22490J29509J75248K46696L47290M44489M71191M02031L02429
3522.9D34973297K65617L04795L40500L01895K19498J95007K88505M54865N92003O29844
$$ plain form
3532.5 438565826 439131622 439568863 439862366 440057640 440262184 440603294 441142426 441817093 442477303 442993011
3542.1 442993011 443334312 443553123 443707886 443832321 443974533 444226074 444661980 445241661 445803909 446202698
3551.8 446202698 446450539 446710129 447132187 447717400 448337669 448864250 449253349 449539642 449811974 450207520
3561.4 450207520 450857849 451749191 452624207 453104286 452995415 452497940 452086945 452162819 452797203 453775711
3571.1 453775711 454824562 455778008 456586723 457256660 457816772 458308983 458765678 459187660 459570351
3579.7 459570351 459958572 460463448 461201897 462193565 463290443 464203720 464655724 464597435 464326973 464343109
3589.4 464343109 464982834 466136932 467332802 468134308 468482819 468666725 468998222 469553337 470195389
3598.1 470195389 470773697 471254234 471702385 472213783 472870674 473695335 474580078 475289268 475620499 475625153
$$ packed form
3532.5D38565826N65796M37241K93503J95274K04544L41110N39132O74667O60210N15708
3542.1D42993011L41301K18811J54763J24435J42212K51541M35906N79681N62248L98789
3551.8D46202698K47841K59590M22058N85213O20269N26581L89099K86293K72332L95546
3561.4D50207520O50329Q91342Q75016M80079j08871m97475m10995P5874O34384R78508
3571.1D53775711J048851R53446Q08715O69937N60112M92211M56695M21982L82691
3579.7D59570351L88221N04876P38449R91668J096878R13277M52004n8289k70462J6136
3589.4D64343109O39725J154098J195870Q01506L48511J83906L31497N55115O42052
3598.1D70195389N78308M80537M48151N11398O56891Q24661Q84743P09190L31231M654
$$ plain form
3607.7 475625153 475644951 476053162 476900368 477828178 478389053 478496361 478535347 478979263 479871254 480735054
3617.4 480735054 481049995 480801392 480498123 480641861 481270142 482082748 482920761 483912315 485077057
3626 485077057 485970345 485982361 485057449 483948212 483593369 484254608 485363960 486194878 486549187 486749039
3635.7 486749039 487117424 487642784 488122673 488455734 488696251 488918037 489143143 489382973 489646111 489873352
3645.3 489873352 489925613 489665222 489030914 488074417 487037430 486413460 486743660 488112869 489835472
3654 489835472 490867043 490706673 489856071 489279175 489452286 490063171 490569687 490806274 490944290 491101875
3663.6 491101875 491282310 491618156 492299500 493098373 493266029 492297668 490781174 490086098 490942993
3672.3 490942993 492487106 493014565 491727448 489544258 488125000 488273277 489417648 490474701 490922203
$$ packed form
3607.7D75625153J9798M08211Q47206R27810N60875J07308L8986M43916Q91991Q63800
3617.4D80735054L14941k48603l03269J43738O28281Q12606Q38013R91554J164742
3626D85077057Q93288J2016r24912j109237l54843O61239J109352Q30918L54309J99852
3635.7D86749039L68385N25360M79889L33061K40517K21786K25106K39830K63138K27241
3645.3D89873352N2261k60391o34308r56497j036987o23970L30200J369209J722603
3654D89835472J031571j60370q50602n76896J73111O10885N06516K36587J38016J57585
3663.6D91101875J80435L35846O81344P98873J67656r68361j516494o95076Q56895
3672.3D90942993J544113N27459j287117k183190j419258J48277J144371J057053M47502
$$ plain form
3681 490922203 491002426 491177902 491641541 492278862 492838516 493028488 492600784 491539383 490198708 489156265
3690.6 489156265 488836937 489245567 490024567 490737915 491134224 491242714 491288757 491480637 491797523 491975708
3700.3 491975708 491770477 491264648 490873032 490975685 491559906 492269249 492786827 493078613 493216858 493075409
3709.9 493075409 492377396 491102066 489727783 488923874 488976021 489586601 490249863 490722427 491057625
3718.6 491057625 491283913 491248398 490834541 490197067 489634666 489264641 488964958 488663139 488543930 488849754
3728.3 488849754 489536324 490252647 490662651 490676117 490331802 489603615 488473701 487163887 486137772
3736.9 486137772 485797005 486217346 487180977 488336906 489240646 489390564 488519821 486989212 485733948
3745.6 485733948 485563507 486419601 487393723 487545509 486694794 485436630 484507256 484238815 484550667
$$ packed form
3681D90922203Q0223J75476M63639O37321N59654J89972m27704j061401j340675j042443
3690.6D89156265l19328M08630P79000P13348L96309J08490M6043J91880L16886J78185
3700.3D91975708k05231n05829l91616J02653N84221P09343N17578K91786J38245j41449
3709.9D93075409o98013j275330j374283q03909N2147O10580O63262M72564L35198
3718.6D91057625K26288l5515m13857o37474n62401l70025k99683l01819j19209L05824
3728.3D88849754O86570P16323M10004J3466l44315p28187j129914j309814j026115
3736.9D86137772l40767M20341R63631J155929R03740J49918q70743j530609j255264
3745.6D85733948j70441Q56094R74122J51786q50715j258164r29374k68441L11852
$$ plain form
3754.3 484550667 485227356 486040268 486671371 486761971 486206245 485376968 484909172 485151329 485833664 486337357
3763.9 486337357 486302605 485921440 485616837 485521011 485381432 484974174 484465179 484246368 484474487 484914970
3773.6 484914970 485260162 485455322 485601311 485641403 485357323 484730644 484140358 484034348 484419899 484808273
3783.2 484808273 484706421 484099197 483413849 483077965 483162918 483405151 483486023 483300591 483023109 482915154
3792.9 482915154 483017960 483048859 482710953 482131767 481842728 482160950 482669525 482560081 481585197 480477180
3802.5 480477180 480200043 480845833 481510620 481319351 480360947 479461479 479219894 479549675 480115585 480816536
3812.2 480816536 481590958 482011871 481547127 480329704 479301987 479253807 479811745 479741020 478365974
3820.8 478365974 476458969 475493431 476101913 477502327 478446045 478483429 478149147 478089905 478321075 478396912
$$ packed form
3754.3D84550667O76689Q12912O31103R0600n55726q29277m67796K42157O82335N03693
3763.9D86337357l4752l81165l04603r5826j39579m07258n08995k18811K28119M40483
3773.6D84914970L45192J95160J45989M0092k84080o26679n90286j06010L85551L88374
3783.2D84808273j01852o07224o85348l35884Q4953K42233Q0872j85432k77482j07955
3792.9D82915154J02806L0899l37906n79186k89039L18222N08575j09444r74884j108017
3802.5D80477180k77137O45790O64787j91269r58404q99468k41585L29781N65910P00951
3812.2D80816536P74422M20913m64744j217423j027717m8180N57938p0725j375046
3820.8D78365974j907005r65538O08482J400414R43718L7384l34282n9242K31170P5837
$$ plain form
3830.5 478396912 478083038 477639732 477469521 477644768 477841492 477664146 476991539 476061974 475282822 474926224
3840.1 474926224 474933357 474999962 474885330 474648628 474559364 474799118 475318146 475987358 476764183 477576103
3849.8 477576103 478070908 477683258 476128273 473844261 471828384 470921936 471210480 472099190 472927742
3858.4 472927742 473474655 473887482 474228249 474228897 473585358 472470741 471607704 471664085 472528877 473306389
3868.1 473306389 473168983 472211533 471339607 471265297 471740990 471928177 471460762 470906296 471042595 471829529
3877.7 471829529 472361107 471909790 470821953 470169525 470529099 471304474 471384659 470390434 469119263
3886.4 469119263 468722801 469538574 470788727 471358757 470783730 469520988 468437157 468129387 468626900
3895.1 468626900 469514351 470230827 470366821 469883614 469129143 468563843 468365440 468285522 467935638 467222862
$$ packed form
3830.5D78396912l13874m43306j70211J75247J96724j77346o72607r29565p79152l56598
3840.1D74926224P133O6605j14632k36702q9264K39754N19028O69212P76825Q11920
3849.8D77576103M94805l87650j554985k284012k015877r06448K88544Q88710Q28552
3858.4D72927742N46913M12827L40767O48o43539j114617q63037N6381Q64792P77512
3868.1D73306389j37406r57450q71926p4310M75693J87187m67415n54466J36299P86934
3877.7D71829529N31578m51317j087837o52428L59574P75375Q0185r94225j271171
3886.4D69119263l96462Q15773J250153N70030n75027j262742j083831l07770M97513
3895.1D68626900Q87451P16476J35994m83207p54471n65300j98403p9918l49884p12776
$$ plain form
3904.7 467222862 466473541 466120682 466299362 466768074 467186432 467419968 467571716 467772751 467995071 468071404
3914.4 468071404 467869339 467416840 466867294 466373901 466019249 465842018 465859795 466015129 466133957 466027946
3924 466027946 465689735 465351715 465290680 465563240 465953941 466174049 466078606 465712280 465230446 464816589
3933.7 464816589 464608765 464610825 464674835 464645462 464529381 464453430 464430733 464267731 463800659 463178101 462779312
3944.3 462779312 462816772 463109169 463297806 463220711 462998276 462815247 462731628 462708435 462700195 462659149 462519722
3954.9 462519722 462260132 461958160 461732483 461637421 461647263 461706161 461733856 461622086 461332550 461002655
3964.5 461002655 460843620 460885162 460924454 460803261 460632401 460612602 460706177 460674782 460439072 460187416
3974.2 460187416 460054550 459900322 459577103 459238510 459128342 459159164 459018211 458684387 458458748 458364410
$$ packed form
3904.7D67222862p49321l52859J78680M68712M18358K33536J51748K01035K22320P6333
3914.4D68071404k02065m52499n49546m93393l54652j77231J7777J55334J18828j06011
3924D66027946l38211l38020o1035K72560L90701K20108r5443l66326m81834m13857
3933.7D64816589k07824K060O4010k9373j16081p5951k2697j63002m67072o22558l98789
3944.3D62779312L7460K92397J88637p7095k22435j83029q3619k3193q240m1046j39427
3954.9D62519722k59590l01972k25677r5062R842N8898K7695j11770k89536l29895
3964.5D61002655j59035M1542L9292j21193j70860j9799R3575l1395k35710k51656
3974.2D60187416j32866j54228l23219l38593j10168L0822j40953l33824k25639r4338
$$ plain form
3983.8 458364410 457950134 457024498 456175423 455957413 455808067 454667473 452776299 451702766 451809998
3992.5 451809998 450859985 446955032 442343826 440933075 439346161 422159920 371185608 283436947
4000.2 283436947
$$ packed form
3983.8D58364410m14276r25636q49075k18010j49346j140594j891174j073533J07232
3992.5D51809998r50013l904953m611206j410751j586914j7186241n0974312q7748661
4000.2B83436947
##END=$$ End of the data block
