##TITLE=$$ Begin of the data block
##JCAMP-DX=5.00 $$ ACD/SpecManager v 10.08
##SPECTROMETER/DATA SYSTEM=Varian
##DATE=30 Apr 2013 10:23:48
##DATA TYPE=INFRARED SPECTRUM
##DATA CLASS=XYDATA
##ORIGIN=
##OWNER=
##NPOINTS=3735
##FIRSTX=399.26403809
##LASTX=4000.35498047
##MAXX=4000.35498047
##MINX=399.26403809
##MAXY=78.35638428
##MINY=27.04312325
##XFACTOR=1.0000000000
##YFACTOR=0.000000100000000
##FIRSTY=45.38696671
##DELTAX=0.96440572
##XUNITS=1/CM
##YUNITS=TRANSMITTANCE
##XYDATA=(X++(Y..Y))
399.3D53869667J38257179Q4611588L1371918K027587k709426K365188M564514K529526
407G16887741J261063K895431M502564L055420m61884k680054k004318J30539J568832
415.7G25155334J671067J074142L10898n12009j078262q42133R8572O48346k83127
424.3G26242828k496109m485244m702301k730713O03866L893280N835648N719070L777924
433G31658249J194992n46265o50177M98276J775665K212601J552506K11868j064377
441.7G36843338j595917j165542k68479J54801m94767j830368k721862k301712p67289
450.4G25852203Q00400J353455O16531q99048k377701l166503l012009k126465j092911
459.1G15947952n53131q06656j641617k555542l149490l352356l384781l602066m320526
$$ plain form
399.3 453869667 592126846 676738434 708110352 710137939 707428513 709793701 714358215 716887741
407 716887741 718148804 721044235 725546799 728602219 728140335 725460281 723455963 723586502 725155334
415.7 725155334 726826401 727900543 728211441 727699432 726621170 725779037 725877609 726525955 726242828
424.3 726242828 723746719 719261475 714559174 711828461 712432327 716325607 722161255 727880325 731658249
433 731658249 732853241 732306976 731656799 732155075 733930740 736143341 737695847 737907715 736843338
441.7 736843338 735247421 734081879 733813400 733968201 733473434 731643066 728921204 726619492 725852203
450.4 725852203 726652603 728006058 728622589 727723541 725345840 722179337 719167328 717040863 715947952
459.1 715947952 715394821 714588165 712946548 710391006 707241516 703889160 700504379 696902313 692581787
467.7F92581787n596161p011490p707290o819153m083710j40304L745575O338119P024384
476.4F78331757O036758M240570K599945J577606Q72803k06299j923523l578720l881683
485.1F84069214k037735J418838M865876O716613O421585M553223K123871q1787j672897
493.8G06376801k501603k611541k327805k204819k737045m128876o370010r386139
501.5F74108963j2853699j5752105j6343766j3068428n829925L515091J2083702J7586517
509.2F43446350J9295120J7771302J4020233R037475L906861j83106k408142k834167
516.9G02051926k335282j910248k100677l005676m596100o725693q803177r732132
524.6F62842941q523102n138092o99539L237992N721664O837845P283249P590713P723313
$$ plain form
467.7 692581787 686985626 679974136 672266846 665447693 661363983 661223679 664969254 671307373 678331757
476.4 678331757 684368515 688609085 691209030 692786636 693659439 693453140 691529617 687950897 684069214
485.1 684069214 682031479 683450317 688316193 695032806 701454391 706007614 708131485 708049698 706376801
493.8 706376801 703875198 701263657 698935852 696731033 693993988 689865112 683495102 674108963
501.5 674108963 661255264 645503159 629159393 616090965 610261040 613776131 625859833 643446350
509.2 643446350 662741470 680512772 694533005 703570480 707477341 707294235 704886093 702051926
516.9 702051926 699716644 697806396 695705719 692700043 688103943 681378250 672575073 662842941
524.6 662842941 654319839 649181747 648482208 651720200 657441864 664279709 671562958 679153671 686876984
533.3F86876984P269134N937195L908997J806411L47748p6675L67279J058883J307145
542G08803101P59964m07715j636963k337723k234726j507187o68716k63291n59082
550.7F99947662j403122k313156k749328k429123j526413o22406l81394j106949k483139
559.4F84932632l744049m195099l697052k733612k043991k154770l149414m720764
567.1F58493881o339721p413483p463570o347275m385643k238616n58014L31230M91485
575.8F24570274J86539l48511j015930j820831k779885l832359m805298n466957n660095
584.4E99026947n419731m967346m570237m372558m314308m149552l541221k219162
592.1E65472832j79482K205429M330635N729905O383552O662178O952477P332573P589874
$$ plain form
533.3 686876984 694146118 700083313 703992310 705798721 706146469 706069794 706437073 707495956 708803101
542 708803101 709563065 709155350 707518387 705180664 702945938 701438751 700770035 700506744 699947662
550.7 699947662 698544540 696231384 693482056 691052933 689526520 688904114 688522720 687415771 684932632
559.4 684932632 681188583 676993484 673296432 670562820 668518829 666364059 663214645 658493881
567.1 658493881 652154160 644740677 637277107 630929832 626544189 624305573 623747559 624078789 624570274
575.8 624570274 624756813 624408302 623392372 621571541 618791656 614959297 610153999 604687042 599026947
584.4 599026947 593607216 588639870 584069633 579697075 575382767 571233215 567691994 565472832
592.1 565472832 565293350 567498779 571829414 577559319 583942871 590605049 597557526 604890099 612479973
600.8F12479973P476196O897087N924263M788056L910408L757934M380036N023727
608.5F54637680M476852K168656r36051k765731j797867J512680M950714O248474M689484
617.2F73184891J251144k504501n498963p334594p961426p537003o551361n714760
624.9F31333427n471954n681457n890046n834121n432015m282608j547355L215560
632.7F00409431Q994256J3429794J4408951J1788635P528458M047241K376556J782532
640.4F64765854R44443o72531k517701l711242l885498l359909k737427k460938k651977
649F43713074l154145l631935l711509l195153k236824j293716q31261j008262j612931
657.7F23037338k275772k734985k925911k907715k806320k839394l259697m080658
$$ plain form
600.8 612479973 619956169 626853256 632777519 637565575 641475983 645233917 649613953 654637680
608.5 654637680 659114532 661283188 660347137 657581406 655783539 657296219 662246933 668495407 673184891
617.2 673184891 674436035 671931534 666432571 659097977 651136551 643599548 637048187 631333427
624.9 631333427 625861473 620180016 614289970 608455849 603023834 598741226 597193871 600409431
632.7 600409431 609403687 622833481 637242432 649031067 656559525 660606766 662983322 664765854
640.4 664765854 665710297 665037766 662520065 658808823 654923325 651563416 648825989 646365051 643713074
649 643713074 640558929 636926994 633215485 630020332 627783508 626489792 625658531 624650269 623037338
657.7 623037338 620761566 618026581 615100670 612192955 609386635 606547241 603287544 599206886
665.4E99206886m792442m495125k563820O78025L998298O109467O584015N980796N156937
674.1F15863037M546814M059219L405762K253838J11160l524590q485031j3379249
681.8F04850960j6105652j5321579j1513939o476555j632805L051338Q408471J4438018
689.6E79698257J9550477K1582794J9572448J4535599Q629227L667602L65525j361008
697.3F66240921j755829j017456M80270K082139L132553L374405L046569K612839K413101
705.9F80609512K497864K668686K610550K054748R61609l70254j418152j771698j451874
714.6F86390991r21173p56760j260147k306289l488846m383087m752579m646454m403305
723.3F59472351m515762n349427o876220q668595j0210075j1288071j2134323j3248482
$$ plain form
665.4 599206886 594414444 589919319 587355499 588033524 592031822 598141289 604725304 610706100 615863037
674.1 615863037 620409851 624469070 627874832 630128670 630239830 626715240 618230209 604850960
681.8 604850960 588745308 573423729 561909790 555433235 553800430 556851768 565260239 579698257
689.6 579698257 599248734 620831528 640403976 654939575 663568802 667236404 667601929 666240921
697.3 666240921 664485092 663467636 663947906 666030045 669162598 672537003 675583572 678196411 680609512
705.9 680609512 683107376 685776062 688386612 690441360 691402969 691032715 689614563 687842865 686390991
714.6 686390991 685469818 684713058 683452911 681146622 677657776 673274689 668522110 663875656 659472351
723.3 659472351 654956589 649607162 642730942 634062347 623852272 612564201 600429878 587181396
731E87181396j5096969j7866707k1268311k4363975k5632744k3538628j7471771q412819
738.7D33529472J316758R169616J3577461J4458504J2878533J0317993Q028908O655502
746.5E09932747O128693N900383N479469M900436M652596N064277N797768O105995
754.2E53962364N707360N343437O312179R295273J3590584J7481232J9384880J8770408
761.9F49847717J6198273J2717438R266510O449814M562912L615799L321685L176728
769.6G09156876K692108J654434K38647j088180j832047j773758j140670n04837m32129
778.3G06970444j105881k223282l241348l769074l792801l614349l608017l986359
786F81629333m668273n277100n285950m324417k498627m76913Q21533P72095n55039
$$ plain form
731 587181396 572084427 554217720 532949409 508585434 482952690 459414062 441942291 433529472
738.7 433529472 434846230 444015846 457593307 472051811 484930344 495248337 503277245 509932747
746.5 509932747 516061440 521961823 527441292 532341728 536994324 542058601 547856369 553962364
754.2 553962364 559669724 565013161 571325340 580620613 594211197 611692429 631077309 649847717
761.9 649847717 666045990 678763428 688029938 694479752 699042664 702658463 705980148 709156876
769.6 709156876 711848984 713503418 713742065 712653885 710821838 709048080 707907410 707402573 706970444
778.3 706970444 705864563 703641281 700399933 696630859 692838058 689223709 685615692 681629333
786 681629333 676961060 671683960 666398010 662073593 659574966 659098053 659919586 660691681 660136642
794.7F60136642k458572m075012m894562m973450m749565m669761m904251n297623
802.4F24113846n510292n212937m230308k600975n78156J450768L121986M276314N038338
811.1F19868584N703087O495895P381897Q072815Q208618P576981O258545M641647
818.8F74208069L285370K633667K701568K990570K808381J803283K54822j203156k182388
827.5F87300186k875824l773956n054093o258468o574478n429459k887039M14657L623124
836.1F58484650O053695P427521P906418P910538P794647P614136P186660O384964
843.9G16763229N335770M306030L414917K492981J219025o49338l112335n803757p862396
852.5G16104126q033066n294266K12250O760788J1790543J3477401J1867066Q596039
$$ plain form
794.7 660136642 657678070 653603058 648708496 643735046 638985481 634315720 629411469 624113846
802.4 624113846 618603554 613390617 609160309 606559334 605981178 607431946 610553932 614830246 619868584
811.1 619868584 625571671 632067566 639449463 647522278 655730896 663307877 669566422 674208069
818.8 674208069 677493439 680127106 682828674 685819244 688627625 690430908 690685730 689482574 687300186
827.5 687300186 684424362 680650406 675596313 669337845 662763367 657333908 654446869 654861526 658484650
836.1 658484650 664538345 671965866 679872284 687782822 695577469 703191605 710378265 716763229
843.9 716763229 722098999 726405029 729819946 732312927 733531952 732882614 729770279 723966522 716104126
852.5 716104126 708071060 702776794 702989044 709749832 721540375 735017776 746884842 755480881
860.3G55480881N497284L382110J961289O90689m90647j189880j124802n15518N7450
868.9G63748856R5291n00031j425628k196198k424087k042389j373978r57947j207352
877.6G51716537k123947l309631m266739m744263m857788m918976n143127n446701
885.3G16905365n445938m641266k709198K19727L456039N959244O841354N873642L597260
894G30056229Q89892j681289m106675o509552q474731q929138o893082k493439K786255
902.7F94644470O993103Q984070Q946152P776718O077881L820953R20029k057877l923111
911.4G32182388l688659j396943J808625M406967N396728M730683L131103J550522
919.1G48121414O45447N11780P56836Q31680M19769l69796j123810j449280j239853
$$ plain form
860.3 755480881 760978165 764360275 766321564 767012253 766521606 765331726 764206924 763691406 763748856
868.9 763748856 763844147 763344116 761918488 759722290 757298203 755255814 753881836 752923889 751716537
877.6 751716537 749592590 746282959 742016220 737271957 732414169 727495193 722352066 716905365
885.3 716905365 711459427 706818161 704108963 704328690 707784729 713743973 720585327 726458969 730056229
894 730056229 730946121 729264832 725158157 718648605 710173874 701244736 694351654 691858215 694644470
902.7 694644470 701637573 710621643 719567795 727344513 733422394 737243347 738163376 736105499 732182388
911.4 732182388 728493729 727096786 728905411 733312378 738709106 743439789 746570892 748121414
919.1 748121414 748766861 749278641 750035477 750867157 751286926 750917130 749793320 748344040 747104187
927.8G47104187p10754k18277m1581k59628p55768j298523j648635j669007j404266
936.4G39097748j074295r59854j233826j865387k659988l391648l902282m111329l990097
945.1G15909042l572311k976074k338867j666718p67593N82351K327423L997574M950333
953.8G16445160M828339L815460K469177J315460N83725K44904J85470K87323M04435
962.5G30579453L77426J42212j98975m71954o13327p41272j028366j522217k082825
971.2G24440155k471542k480545k009888j107102K289R44672J353149J093064L85513
979.8G20149765l16315o35833n31693k95486k93045o61393j218261j645584j764069
988.5G12788086j645279j484375j414032j476593j738205k312317l153915l841706
$$ plain form
927.8 747104187 746393433 746175156 746133575 745873947 745118179 743819656 742171021 740502014 739097748
936.4 739097748 738023453 737063599 735829773 733964386 731304398 727912750 724010468 719899139 715909042
945.1 715909042 712336731 709360657 707021790 705355072 704587479 705169830 707497253 711494827 716445160
953.8 716445160 721273499 725088959 727558136 728873596 729457321 729702225 729887695 730175018 730579453
962.5 730579453 730956879 731099091 730900116 730428162 729814835 729073563 728045197 726522980 724440155
971.2 724440155 721968613 719488068 717478180 716371078 716373367 717318039 718671188 719764252 720149765
979.8 720149765 719833450 719197617 718665924 718370438 718077393 717416000 716197739 714552155 712788086
988.5 712788086 711142807 709658432 708244400 706767807 705029602 702717285 699563370 695721664
996.2F95721664l716201k414475l45459J445999K008286J184997l55148j737289k528763
1004.9F89263611k859650l042526l180084l111496k652207j864776j196976j412506
1012.6F69943390l234558o703491j0630341j2773552j1027603m981232L395310J0695343
1020.3F34683266J4096107J2944794Q757858L842926j86691k889176m435272m882507
1028.1F61931305m051132j978302O91833K894974L788528L277512J988602P66983J35421
1036.7F69445724J07193L77732O42395P78580Q22143Q45184Q67997Q55560P61414N70068
1046.4F76073990L06091J6785k51846m62113n83725o10580n90744o40183q75168j302871
1056F71079636j765976k037964k016983j839524j791076k078934k678070l391266m043197
$$ plain form
996.2 695721664 692005463 689590988 689245529 690691528 692699814 693884811 693529663 691792374 689263611
1004.9 689263611 686403961 683361435 680181351 677069855 674417648 672552872 671355896 669943390
1012.6 669943390 666708832 660005341 649375000 636601448 625573845 620592613 623987923 634683266
1020.3 634683266 648779373 661724167 670482025 674324951 674138260 671249084 666813812 661931305
1028.1 661931305 657880173 655901871 656593704 659488678 663277206 666554718 668543320 669310303 669445724
1036.7 669445724 669552917 669930649 670573044 671351624 672173767 673018951 673886948 674742508 675503922 676073990
1046.4 676073990 676380081 676396866 676145020 675682907 675099182 674488602 673897858 673257675 672382507 671079636
1056 671079636 669313660 667275696 665258713 663419189 661628113 659549179 656871109 653479843 649436646
1064.7F49436646m605713n127755n559654n663757n142708l911018k293358r37767
1072.4F16194916m19388p84569j398811j315956L4866K360306M634476N778121N345688
1081.1F30429649L702317J631546k12098j561317k434845k921143l097114l077583
1088.8F22459412l041764l156166l471489l899612m276199m435730m255753l687096
1096.5E92235603k783661j702575o48194K03171P34596Q74863O00624j8883p95555
1105.2E88699989j504135k032699k455216k933006l544769m236298m942284n720253
1112.9E61331329o725921q073845r764786j1717377j3687973j4962730j4139023r572830
1120.6D72686844n98793J1291046K2510376K9073372K8883362K2890777J4248505O220016
$$ plain form
1064.7 649436646 644830933 639703178 634143524 628479767 623337059 619426041 617132683 616194916
1072.4 616194916 615775528 614990959 613592148 612276192 612311058 614671364 619305840 625083961 630429649
1081.1 630429649 634131966 635763512 635551414 633990097 631555252 628634109 625536995 622459412
1088.8 622459412 619417648 616261482 612789993 608890381 604614182 600178452 595922699 592235603
1096.5 592235603 589451942 587749367 587101173 587304344 588038940 588913803 589514427 589495544 588699989
1105.2 588699989 587195854 585163155 582707939 579774933 576230164 571993866 567051582 561331329
1112.9 561331329 554605408 546531563 536766777 525049400 511361427 496398697 482259674 472686844
1120.6 472686844 472088051 483379097 505889473 534962845 563846207 586736984 600985489 607205505
1128.4F07205505M94843l025360n278588p024726q509789r703789j0594673j1250381
1136.1E52313042j1746369j2143173j2495308j2812538j2988091j2806434j2055741
1142.8D65265388j0632705q551941n907555k867813L15666L391610O269569R062309
1150.5D56344528J1837578J4223938J5283928J3953590R871483L994866j550751m416123
1158.3E19543037l225021J704636Q524322J4772835J8508835J9061699J7062568J3839112
1166F09792023J0602455P934036N809403L979148K288437O83670r46350k754135m649238
1174.6F32739449o082459o302109n038376l012199j664124k138824m299355o640586
1182.4E97561417p294960n434838j995086R05075J495285k73896k644691l442764j920319
$$ plain form
1128.4 607205505 607700348 604674988 599396400 592371674 583861885 574158096 563563423 552313042
1136.1 552313042 540566673 528423500 515928192 503115654 490127563 477321129 465265388
1142.8 465265388 454632683 446080742 440173187 437305374 437621040 441012650 447282219 456344528
1150.5 456344528 468182106 482406044 497689972 511643562 521515045 525509911 523959160 519543037
1158.3 519543037 516318016 518022652 526546974 541319809 559828644 578890343 595952911 609792023
1166 609792023 620394478 628328514 634137917 638117065 640405502 641089172 640142822 637388687 632739449
1174.6 632739449 626656990 620354881 615316505 612304306 610640182 608501358 604202003 597561417
1182.4 597561417 590266457 584831619 582836533 583741608 585236893 584962997 582318306 578875542 576955223
1191E76955223N34744J586571J48430k354927k937584M63982P108802J3822365J7275925
1199.7F12603531J6203918J1847687O607437K327423m46624k064896l022919l582458
1207.4F40473099l831330l826828l610763l180008k541962j797790j127510o73485
1215.1F19883423m58412m27513n47104q44384j360702k093620k980843l918457m766502
1223.8F02485886n363121n576935n385895m912224m364128l924484l671608l582344
1231.5E65705147l578720l565979l450814l164901k706147k159652j663437j328392
1239.3E44087105j172219j122436j075974r67865q07457o72187o80390r47914j548653
1247.9E35092010k481727l680840n051880o515808q018493r507675j0913353j2145806
$$ plain form
1191 576955223 577489967 579076538 579224968 576870041 573932457 574396439 581505241 595327606 612603531
1199.7 612603531 628807449 640655136 647262573 649589996 649143372 647078476 644055557 640473099
1207.4 640473099 636641769 632814941 629204178 626024170 623482208 621684418 620556908 619883423
1215.1 619883423 619425011 618997498 618450394 617606010 616245308 614151688 611170845 607252388 602485886
1223.8 602485886 597122765 591545830 586159935 581247711 576883583 572959099 569287491 565705147
1231.5 565705147 562126427 558560448 555109634 551944733 549238586 547078934 545415497 544087105
1239.3 544087105 542914886 541792450 540716476 539748611 538941154 538268967 537588577 536640663 535092010
1247.9 535092010 532610283 528929443 523877563 517361755 509343262 499835587 488922234 476776428
1255.7D76776428j3089447j3556633j3219147j1609573q277626l080025L563004J0643806
1263.4D28150787J6863060K1113778K2888336K2387428K0300636J7430039J4394378
1270.1E63528442J1542130R039192O988106N465431M472962L879508L441506K907448
1277.8F11264725K139396J162796J13755q72765j741218k521515l276444m054222m870148
1286.5E97344360n708160o518135p219620p729034p988129p950211p523269o544533
1294.2E40163269m878311k606773j55259J801758K650795K159844N92193j457405l377609
1302.9E34892502m801636n681953o188202o537285o884499p309494p829437q353691
1310.6D81306305q611069q204345o889267m907456l006668j975594k016029k551536
$$ plain form
1255.7 476776428 463686981 450130348 436911201 425301628 417024002 413943977 417506981 428150787
1263.4 428150787 445013847 466127625 489015961 511403389 531704025 549134064 563528442
1270.1 563528442 575070572 584109764 591097870 596563301 601036263 604915771 608357277 611264725
1277.8 611264725 613404121 614566917 614680672 613807907 612066689 609545174 606268730 602214508 597344360
1286.5 597344360 591636200 585118065 577898445 570169411 562181282 554231071 546707802 540163269
1294.2 540163269 535284958 532678185 532522926 534324684 536975479 539135323 539727516 538270111 534892502
1302.9 534892502 530090866 524408913 518220711 511683426 504798927 497489433 489659996 481306305
1310.6 481306305 472695236 464490891 457601624 452694168 449687500 447711906 445695877 443144341
1318.3D43144341k741623k243882j450233r08470n28984N28869L052407O804885J0381241
1327D56038551J2112732J1241074Q348045M781189J691094n02243j968193l026314
1334.7D88715935l875427m606667n289726n969467o616211p148781p531395p824021
1342.4D39854240q130874q513413q971634r474639r954644j0232849r976883q798446
1350.2C65800858o466256l072166R85870N184365R070510J2351914J4885979J6642418
1357.9D15383492J7683105J8135109J8128662J7738075J6980820J5887413J4567909
1364.6E34504585J3204155J1965943J0931816J0076484R321595Q595619P852287P064171
1372.3F13516655O213493N298043M335823L365440K453766J701736J223183J078224
$$ plain form
1318.3 443144341 440402718 438158836 436708603 435800133 435271149 435800018 438852425 445657310 456038551
1327 456038551 468151283 479392357 487740402 492521591 494212685 493710442 491742249 488715935
1334.7 488715935 484840508 480233841 474944115 468974648 462358437 455209656 447678261 439854240
1342.4 439854240 431723366 423209953 414238319 404763680 394809036 384576187 374599304 365800858
1350.2 365800858 359334602 356262436 357248306 362432671 371503181 383855095 398741074 415383492
1357.9 415383492 433066597 451201706 469330368 487068443 504049263 519936676 534504585
1364.6 534504585 547708740 559674683 570606499 580682983 590004578 598600197 606452484 613516655
1372.3 613516655 619730148 625028191 629364014 632729454 635183220 636884956 638108139 639186363
1380.1F39186363J198387J388245J431885J231308Q50982M34418P1640k46277n70373
1388.7F44976578r19266j268387j584015j837692j990013k012100j948815j945076
1396.4F31471214k142372k528343k912788l099976l091736l101539l350182l862534
1404.2F07381744m456901m889031m963111m534951l516578j973000k10876J306953
1411.9E84144249K212524K417031K065162J352387M32319n24787j289292j685715j756668
1420.6E87367210j759834j948242k348137k758713k970772k987213l048820l449288
1428.3E66096191m285354n341759o246529o825790p344589q305130r842148j1245728
1436E06659164j1192550q640824l661842K500610Q102646J1646576J2247391R817314
$$ plain form
1380.1 639186363 640384750 641772995 643204880 644436188 645287170 645721588 645793228 645546951 644976578
1388.7 644976578 644057312 642788925 641204910 639367218 637377205 635365105 633416290 631471214
1396.4 631471214 629328842 626800499 623887711 620787735 617695999 614594460 611244278 607381744
1404.2 607381744 602924843 598035812 593072701 588537750 585021172 583048172 582837296 584144249
1411.9 584144249 586356773 588773804 590838966 592191353 592623672 592098885 590809593 589123878 587367210
1420.6 587367210 585607376 583659134 581310997 578552284 575581512 572594299 569545479 566096191
1428.3 566096191 561810837 556469078 550222549 543396759 536052170 527747040 517904892 506659164
1436 506659164 495466614 486825790 483163948 485664558 493767204 505413780 517661171 527478485
1443.7E27478485N367890J108322l51334K329330P927628J3156738J4896889J2360153
1451.4E84274101P343102K498245o35414k163086k900238l301163l307953k892036
1459.1E78915558k390251k249222k613182l280411l987083m593125n017090n164985
1466.8E49620209n054589m954223n243950o054726p093239p884903q188819q138009
1474.6D97007751p994804p849579p599144p160949o609040o072654n573006n032005
1482.3D43116570m445382l991623l942413m473953n565529p025414q568344r911003
1490C95192909j0899048j1585350j2074928j2135086j0986977p744903k393913L585662
1497.7C30958366P800141Q519859N940666J957054j313209k810326k520370n82581
$$ plain form
1443.7 527478485 532846375 533954697 533603363 535932693 543860321 557017059 571913948 584274101
1451.4 584274101 591617203 594115448 593480034 591316948 588416710 585115547 581807594 578915558
1459.1 578915558 576525307 574276085 571662903 568382492 564395409 559802284 554785194 549620209
1466.8 549620209 544565620 539611397 534367447 528312721 521219482 513334579 505145760 497007751
1474.6 497007751 489012947 481163368 473564224 466403275 459794235 453721581 448148575 443116570
1482.3 443116570 438671188 434679565 430737152 426263199 420697670 413672256 405103912 395192909
1490 395192909 384293861 372708511 360633583 348498497 337511520 329766617 327372704 330958366
1497.7 330958366 338758507 347278366 353219032 355176086 353862877 351052551 348532181 347949600
1505.4C47949600L156243Q538246J4301223J8318215J8898468J5890350J0506516M219436
1513.1D41778297k019920p633438j1986351j4549065j5510292j5865249j6567536j7556152
1520.8C40090294j7800865j6380062j3423767r923306o741295l993606j396161J024304
1528.6B71455536K794075L539429L471679L209915L201218L460217L878517M637050
1536.3B99647636O142579Q511447J1178494J3104019J3460770J2210884J0078392P964821
1544C82299042O314544M958687L503647J826325J79023j147957k157630l068238l954925
1552.7C88752518m616776m886284m975853n331878o061974o619110o218719m624100
1560.4C45417824k444267n99823M80651J134072K041778L649216N942917Q555603J0921059
$$ plain form
1505.4 347949600 351105843 359644089 373945312 392263527 411161995 427052345 437558861 441778297
1513.1 441778297 439758377 432124939 420138588 405589523 390079231 374213982 357646446 340090294
1520.8 340090294 322289429 305909367 292485600 282562294 275820999 271827393 270431232 271455536
1528.6 271455536 274249611 277789040 281260719 284470634 287671852 291132069 295010586 299647636
1536.3 299647636 305790215 314301662 325480156 338584175 352044945 364255829 374334221 382299042
1544 382299042 388613586 393572273 397075920 398902245 399081268 397933311 395775681 392707443 388752518
1552.7 388752518 384135742 379249458 374273605 368941727 362879753 356260643 350041924 345417824
1560.4 345417824 342973557 342373734 342854385 343988457 346030235 349679451 355622368 364177971 375099030
1569.1C75099030J2449417J2889290J2733230J3146744J5150452J8616447K2079353
1575.8D82163963K3699875K2597046J9352570J5319671J1504860Q059731M643211J047287
1583.5E88388214k603950o131821r592819j3221665j7122497k1062966k4540023k6999283
1591.2D67113190k8005028k7292214k4789619k0681839j5470009r933433m945069j205101
1599C34790878R79004J766129J681251J388283J424027K006301L018876M196815N382233
1607.6C56633797O625824Q018760R413834J0377846J0518722R930611R272728R302940
1615.4D30095062J0247345J1608124J2610817J2858849J2567672J2209854J1999398
1622.1E14197121J1743202J1141853J0141564Q969917P887459O978645O170921N379906
$$ plain form
1569.1 375099030 387548447 400437737 413170967 426317711 441468163 460084610 482163963
1575.8 482163963 505863838 528460884 547813454 563133125 574637985 582697716 587340927 588388214
1583.5 588388214 585784264 579652443 570059624 556837959 539715462 518652496 494112473 467113190
1591.2 467113190 439108162 411815948 387026329 366344490 350874481 340941048 335995979 334790878
1599 334790878 335769882 337536011 339217262 340605545 342029572 344035873 347054749 351251564 356633797
1607.6 356633797 363259621 371278381 380692215 391070061 401588783 411519394 420792122 430095062
1615.4 430095062 440342407 451950531 464561348 477420197 489987869 502197723 514197121
1622.1 514197121 525940323 537082176 547223740 556193657 564081116 571059761 577230682 582610588
1629.8E82610588M566650L686905K683602J585617N90172l9025k18696j88713l69263
1638.5E94907837j026726k050514l067246l805656m385681n233307o655197q437081
1646.2E60246429r878807j0312767r673385q549309p604790o889534n747299l469696
1653.9D98120842q7776L483772O089134P131615O806183N684624M193992K488976O66389
1662.6E34577751j081314k559891l723144m620133n201072n246811m532967l048515
1670.3E04563904j042099J112327L081894M655266N759125O435661O782608O887703
1678E38236389O866417O999245P765693R568596J2284279J5095749J6915474J7125588
1685.8F30857430J5981941J4315643J2848206J1755752J0787888R676742Q390503P089157
$$ plain form
1629.8 582610588 587177238 590864143 593547745 595133362 595723534 595684509 595465813 595277100 594907837
1638.5 594907837 593881111 591830597 588763351 584957695 580572014 575338707 568683510 560246429
1646.2 560246429 550367622 540054855 530381470 521832161 514227371 507337837 501590538 498120842
1653.9 498120842 498033066 501516838 507605972 514737587 521543770 527228394 531422386 533911362 534577751
1662.6 534577751 533496437 530936546 527213402 522593269 517392197 512145386 507612419 504563904
1670.3 504563904 503521805 504634132 507716026 512371292 518130417 524566078 531348686 538236389
1678 538236389 545102806 552102051 559867744 569436340 581720619 596816368 613731842 630857430
1685.8 630857430 646839371 661155014 674003220 685758972 696546860 706223602 714614105 721703262
1693.5G21703262N953369N086518M495392M098663L762131L392486L007813K687988
1701.2G54187622K442703K169037J780319J353074J084060J076431J205750J236496
1708.9G66535492J074676Q68073Q50983J102447J456146J628800J435470R27277L68805
1717.6G76248169O9199J59759M81567P03049O05545K67258m8599j80512k05307k66266
1727.2G77833862l34243k38953M5166K42615K0980n88302j107865j034088l42102M68903
1736.9G74965973Q40835O38657J75247j59988k32391j38703J5793K31628N10636P32422
1746.5G77580109P15179M07333n34j91955K9220N62592J062622J181793Q33969K64817
1756.2G82445145j37329j50834J21308L80325M21753K85339J38092O0044j3657j41067
$$ plain form
1693.5 721703262 727656631 732743149 737238541 741337204 745099335 748491821 751499634 754187622
1701.2 754187622 756630325 758799362 760579681 761932755 763016815 764093246 765298996 766535492
1708.9 766535492 767610168 768478241 769329224 770431671 771887817 773516617 774952087 775879364 776248169
1717.6 776248169 776317368 776477127 776958694 777661743 778267288 778534546 778485947 778305435 778100128 777833862
1727.2 777833862 777499619 777260666 777305832 777548447 777569427 776981125 775873260 774839172 774497070 774965973
1736.9 774965973 775806808 776445465 776620712 776460724 776228333 776089630 776105423 776337051 776847687 777580109
1746.5 777580109 778295288 778702621 778702087 778510132 778539352 779101944 780164566 781346359 782180328 782445145
1756.2 782445145 782307816 782156982 782278290 782658615 783080368 783365707 783503799 783563843 783550186 783409119
1765.8G83409119k41776j80588L3646J89590P5379k80609n99137n98602k42844K47269
1775.4G81811447N90592O36291M06647L2196l14636m81110m07715j87759j8006m4403
1785.1G82023544k41699m62646o02265o89010q02994r31015r51386p75680m75998k42233
1794.7G75848618k03782l17916m28086m15420k87018j38550o7367j16578k61230m17481
1804.4G73195190m73175l64151j42364M3106O9580l3569r6970M4022M01687Q21305
1814G73464661J097335J106110Q67386N17578K39258J63574K86026M61807N16053L90853
1823.7G79110641J87836N2796K1667N722p2174j65710j61591l8223P3929K0980k02331
1834.3G78833542m34342m99267l60031j25580M9667N6534j42517n00107q66699j032715
$$ plain form
1765.8 783409119 783167343 782986755 783020401 783209991 783285370 783004761 782405624 781807022 781564178 781811447
1775.4 781811447 782402039 783038330 783444977 783477173 783162537 782681427 782273712 782085953 782067947 782023544
1785.1 782023544 781781845 781319199 780716934 780027924 779224930 778293915 777342529 776566849 776090851 775848618
1794.7 775848618 775644836 775326920 774898834 774483414 774196396 774057846 773990479 773873901 773612671 773195190
1804.4 773195190 772722015 772357864 772215500 772258606 772328186 772294617 772197647 772241669 772643356 773464661
1814 773464661 774561996 775668106 776535492 777053070 777292328 777455902 777741928 778203735 778719788 779110641
1823.7 779110641 779298477 779351273 779372940 779378662 779306488 779140778 778979187 778940964 779014893 779035873 778833542
1834.3 778833542 778399200 777899933 777539902 777414322 777463989 777520523 777378006 776877899 776011200 774978485
1843.9G74978485q72116m76532j20316m9667k82135o12259q06122p81250o23092m70200
1853.6G69884796m18396n02014p05872r53445j114273j069031q04367m28696r1095
1862.2G63797607J16654J77994J05972q1024l19214m82636m54330k48718l7155k3499
1871.9G62551651k60773n91125p72171o74820l73078o1950J03302J02310K0599m0588
1881.5G60003357k3651P2708K06680K97318K47574J3504l33176o14395o67877m77753
1891.2G58724289j98135k9450o3782k32315l86200m15268k99530q9569J33286K78854
1900.8G57422180K79236J33133p3319k18658k37885j69982j18866j66779l26004n49622
1910.4G55973434p65152q97598r02023q09097p38373q25501j097183j410675j540146
$$ plain form
1843.9 774978485 774106369 773629837 773509521 773459854 773177719 772565460 771759338 770978088 770354996 769884796
1853.6 769884796 769466400 768964386 768258514 767305069 766190796 765121765 764317398 763888702 763797607
1862.2 763797607 763914261 764092255 764198227 764117203 763797989 763315353 762861023 762612305 762575150 762551651
1871.9 762551651 762290878 761699753 760927582 760252762 759879684 759817734 759921036 760023346 760043945 760003357
1881.5 760003357 759979706 760052414 760259094 760556412 760803986 760817490 760484314 759869919 759202042 758724289
1891.2 758724289 758526154 758496704 758432922 758200607 757814407 757399139 757099609 757010040 757143326 757422180
1900.8 757422180 757701416 757834549 757761230 757542572 757304687 757134705 757015839 756849060 756523056 755973434
1910.4 755973434 755208282 754310684 753408661 752599564 751861191 751035690 749938507 748527832 746987686
1919.1G46987686j343841q66013k90909J86234M51736M85382L31116Q0261j49460k62374
1928.8G45609818k38877j44958p7973r7046j94549l17230l98331l87650k82516j48010
1938.4G43322678r0485j78070l66516n18646n08118l19214m1504K17133M08020N29175
1948.1G42454453N78842N45578M51278L70942L80554M78058N69839N51376M05655K18354
1957.7G47004929J02005J04522J85089K57721K51618J40838n4855k76184m39911m71573
1967.3G46804199l53699j48391L1280R1019J3199j38169k63595k88696k01645n8365
1977G45487137M6158K8305j26190l38440m77600m51508k80838q5297R308l9825j77079
1987.6G43594131l14331l93295m02756l50265k51923j50222j11771j83411l34472m60587
$$ plain form
1919.1 746987686 745643845 744777832 744486923 744673157 745124893 745610275 745941391 746021652 745872192 745609818
1928.8 745609818 745370941 745225983 745148010 745050964 744856415 744539185 744140854 743753204 743470688 743322678
1938.4 743322678 743232193 743054123 742687607 742168961 741660843 741341629 741300125 741517258 741925278 742454453
1948.1 742454453 743033295 743578873 744030151 744401093 744781647 745259705 745829544 746380920 746786575 747004929
1957.7 747004929 747106934 747211456 747396545 747654266 747905884 748046722 747991867 747715683 747275772 746804199
1967.3 746804199 746450500 746302109 746333389 746424408 746437607 746299438 746035843 745747147 745545502 745487137
1977 745487137 745533295 745561600 745435410 745096970 744619370 744167862 743887024 743801727 743811035 743771210 743594131
1987.6 743594131 743279800 742886505 742483749 742133484 741881561 741731339 741619568 741436157 741101685 740641098
1997.2G40641098m58527l15246j21231j297k4567j64871l29132m17175l71933k07139
2006.9G38229980m272J27029J12915l4027k17590l24707l00674j81809o2866l2044
2016.5G37311935j15661k67945m01153m39835l66516k31170j17569r1248j62811k89612
2026.2G34828415m04511m49752m02756k89307j77765j42822k14996l53546m68598m89197
2035.8G31435165m14581l07312k42920k54593l25165m13665m84162n17654n05600m52271
2045.5G27517242l80554l32565l49960m42963n71289o59866o44227n18341l42559k09427
2055.1G23065491j81961k54364l57895m06952l55454k26593r9640n5465j18332k36664
2064.7G20772171l26691l40881k96478k35520j71127r6436m9591j30996m05426p61719
$$ plain form
1997.2 740641098 740182571 739867325 739746094 739744797 739720230 739555359 739226227 738809052 738437119 738229980
2006.9 738229980 738225708 738352737 738465652 738431625 738214035 737889328 737588654 737406845 737343979 737311935
2016.5 737311935 737196274 736928329 736527176 736087341 735720825 735489655 735372086 735280838 735118027 734828415
2026.2 734828415 734423904 733974152 733571396 733282089 733104324 732961502 732746506 732392960 731924362 731435165
2035.8 731435165 731020584 730713272 730470352 730215759 729890594 729476929 728992767 728475113 727969513 727517242
2045.5 727517242 727136688 726804123 726454163 726011200 725439911 724780045 724135818 723617477 723274918 723065491
2055.1 723065491 722883530 722629166 722271271 721864319 721508865 721282272 721182632 721127167 721008835 720772171
2064.7 720772171 720445480 720104599 719808121 719572601 719401474 719305038 719255447 719124451 718719025 717957306
2074.4G17957306r11865n96161J58233R92051J458892J362305Q77152L66439Q7128
2083.1G21751480M9133J05896J23139O2332m5242j51749k05688j63575k5406J39618
2092.7G21639938K31018J98670R1705J1215K0981J04599J97449K44827K24915J38855
2102.4G23104172J0528j08642j52359q8959L8681J36261J34430M4174o1035j14365
2112G22942886j05896o8740l5401j2054P782K3040K4186J2207M272K0981O0120R3460
2123.6G22966843Q5067J5870r9717k19192k89765k73361j72882l8986M8904K7695j02920
2134.2G21947556k70081l70026l40042k03933n7984j068o6452k01340l11126l23029
2143.8G19802475k29263q1559M8600J11160R5749K6855n6762j19706j40457j18789
$$ plain form
2074.4 717957306 717045441 716449280 716607513 717599564 719058456 720420761 721297913 721664352 721751480
2083.1 721751480 721800613 721906509 722029648 722091980 722046738 721894989 721689301 721525726 721500320 721639938
2092.7 721639938 721870956 722069626 722161331 722172546 722193527 722298126 722495575 722740402 722965317 723104172
2102.4 723104172 723114700 723006058 722853699 722764740 722803421 722939682 723074112 723118286 723057251 722942886
2112 722942886 722836990 722768250 722732849 722720795 722728577 722751617 722775803 722788010 722792282 722813263 722873383 722966843
2123.6 722966843 723051910 723067780 722968063 722748871 722459106 722185745 722012863 721973877 722022781 722050476 721947556
2134.2 721947556 721677475 721307449 720967407 720763474 720705490 720704422 720637970 720436630 720125504 719802475
2143.8 719802475 719573212 719491653 719540253 719651413 719747162 719774017 719717255 719597549 719457092 719338303
2153.5G19338303p4540m2190n2109j09863j87607k40173k37351j85241j21460q7128
2163.1G18000641j01395j56021k24991k76870k83890k34223j44882o1798l5095q3237
2172.8G16398239j75781k52991k69012k19345j37406o9046m7989q3389j60217k46964
2182.4G14736099l10287l35236l31116l20587l18527l23028l23182l10897k81754k31934
2192G11649551j58615p5760j4877o256n1956j19553j69296j85089j82800j89591k20718
2202.6G10275040k74811l41263m06723m52576m62875m34952l85208l39050l05100k67639
2212.3G06604843k01568r6436K8763J35803J88751J78757J31226R4528J05514J61972
2221.9G07332153K19345K29111J79291J03760M7149K4262J8234Q087n951j3580j8234
$$ plain form
2153.5 719338303 719263763 719221573 719169464 719059601 718871994 718631821 718394470 718209229 718087769 718000641
2163.1 718000641 717899246 717743225 717518234 717241364 716957474 716723251 716578369 716516571 716481476 716398239
2172.8 716398239 716222458 715969467 715700455 715481110 715343704 715274658 715226669 715143280 714983063 714736099
2182.4 714736099 714425812 714090576 713759460 713438873 713120346 712797318 712474136 712163239 711881485 711649551
2192 711649551 711490936 711415176 711400299 711394043 711342087 711222534 711053238 710868149 710685349 710495758 710275040
2202.6 710275040 710000229 709658966 709252243 708799667 708336792 707901840 707516632 707177582 706872482 706604843
2212.3 706604843 706403275 706306839 706335602 706471405 706660156 706838913 706970139 707064667 707170181 707332153
2221.9 707332153 707551498 707780609 707959900 708063660 708110809 708135071 708153305 708161392 708155441 708141861 708123627
2232.5G08123627m1809r1706j41906j51215j05209l5248R079M196l5706q2473j19782
2243.2G07331848j42670j42440j09864n6381k2659m7608j28173k09656k31476j85013
2252.8G06055908j26571j28785k15225l38592m16870l97721k95715j77689j14670j34429
2262.4G03709641k09275k81830l05938k73514k11258j53809j21231j13983j25732j50071
2272.1G01763000j83639k19269k48108k60696k52304k23618j86920j65253j82190k36740
2281.7F99604263k95486l11356k65274j89667j44500j62506k20566k61536k47574j91421
2291.4F97314377j39008j24893j46713j76239j89514j85700j79596j85623k04544k31628
2301F95550919k67716l23028m04511m96445n59921n55420m80118l74984k99607k87857
$$ plain form
2232.5 708123627 708081818 707990112 707848206 707696991 707591782 707556534 707565613 707569809 707534103 707451630 707331848
2243.2 707331848 707189178 707046738 706936874 706880493 706857834 706810226 706682053 706472397 706240921 706055908
2252.8 706055908 705929337 705800552 705585327 705246735 704829865 704432144 704136429 703958740 703844070 703709641
2262.4 703709641 703500366 703218536 702912598 702639084 702427826 702274017 702152786 702038803 701913071 701763000
2272.1 701763000 701579361 701360092 701111984 700851288 700598984 700375366 700188446 700023193 699841003 699604263
2281.7 699604263 699308777 698997421 698732147 698542480 698397980 698235474 698014908 697753372 697505798 697314377
2291.4 697314377 697175369 697050476 696903763 696727524 696538010 696352310 696172714 695987091 695782547 695550919
2301 695550919 695283203 694960175 694555664 694059219 693499298 692943878 692463760 692088776 691789169 691501312
2310.7F91501312l28293l83529m26026m53186m80499n17960n59310n81284n57022m78134
2320.3F86736069l78418l26004l75214n05066o11877n86167m16107k16446j42669k59324
2329.9F82918777m84390o57425o67801n32455l63770k73361k86484l32412l10669j83335
2339.6F78826675j7089P4768N1880K0523J59988N40466J002274J234131J002044L36533
2349.2F83232193m94308j180192j548614j600113j431274j159439r01032p51800p30896
2357.9F73434525p48597o64138m10691n9891K45820M23431N06439N73349O45676O79550
2367.6F74625473O42548N80444N79910O78253Q16117Q99658Q87527Q24128P85141Q01468
2377.2F82120667Q39843Q43506P86286O88781N89829N12771M49448L76129K73514J42822
$$ plain form
2310.7 691501312 691173019 690789490 690363464 689910278 689429779 688911819 688352509 687771225 687214203 686736069
2320.3 686736069 686357651 686031647 685656433 685151367 684539490 683953323 683537216 683320770 683178101 682918777
2329.9 682918777 682434387 681776962 681109161 680576706 680212936 679939575 679653091 679320679 679010010 678826675
2339.6 678826675 678809586 678884354 678936234 678956757 679116745 679657211 680659485 681893616 682895660 683232193
2349.2 683232193 682737885 681557693 680009079 678408966 676977692 675818253 674917221 674165421 673434525
2357.9 673434525 672685928 672021790 671611099 671551208 671797028 672220459 672726898 673300247 673945923 674625473
2367.6 674625473 675268021 675848465 676428375 677106628 677922745 678822403 679709930 680534058 681319199 682120667
2377.2 682120667 682960510 683804016 684590302 685279083 685868912 686381683 686831131 687207260 687480774 687623596
2386.8F87623596Q698q9569j17722p0267J4038O8512M3335n1880j49688j77613j16577
2397.4F86984863j6250M7989L1356n8822j79825k83508l30506k99530k02102r0790
2407.1F85602875l6698q1939k04087l28979l86429l57056k75192j94931j56174j69754
2416.7F83411636k16522k56653k46963j69831n4855L3341L8299m2877j54495k16751
2426.4F82124329j78452m6616J16959K33002K46429J59455K7160q0032j21460j07422
2436F82373352p7362o4163p5150j02997j43127j93939k43759k67563k44446j83868
2445.7F80776978j24512j07041j40304j93710k21634j98899j38931q4381p8049j32141
2455.3F79357376k18201k79388k66113j71738m5166L4637R308j17035k72979l62854
$$ plain form
2386.8 687623596 687632294 687542725 687425003 687354736 687368774 687437286 687480621 687428741 687279053 687101440 686984863
2397.4 686984863 686968613 687016602 687047958 686989136 686809311 686525803 686195297 685895767 685693665 685602875
2407.1 685602875 685566177 685484238 685280151 684951172 684564743 684207687 683932495 683737564 683581390 683411636
2416.7 683411636 683195114 682938461 682691498 682521667 682466812 682500153 682538452 682495575 682341080 682124329
2426.4 682124329 681945877 681899261 682016220 682249222 682495651 682655106 682682266 682602234 682480774 682373352
2436 682373352 682295990 682231827 682156677 682053680 681910553 681716614 681472855 681205292 680960846 680776978
2445.7 680776978 680652466 680545425 680405121 680211411 679989777 679790878 679651947 679567566 679489517 679357376
2455.3 679357376 679139175 678859787 678593674 678421936 678376770 678411407 678420715 678303680 678030701 677667847
2465F77667847l28446j86233j3962J01471J14975M0665o8131j54877j79596j27792
2474.6F76865921j2436J21155K07291J92337P3776r1248k15988k43454j83258j04523
2484.2F76609573q3999j52893k74506l70178l74603k81296j45569m3945k4491q2321
2493.9F74775772j73187k41928k46735j72500m1428Q6594J39770Q2397m8294j61132
2503.5F73999329j75934q3695N4245J53733J64642Q8196l5706j48544j95923j53427
2513.2F73666916n0049M0665M9591l2654j48697k20184k08969j36567n6915j3199k0904
2523.8F72869034p1411j42289k01492k16141j65481o2180M4861Q9493K9297j16043
2533.4F72057648k60392l03039k08588m8141M4861j9455k11335m04663m81033m11301
$$ plain form
2465 677667847 677339401 677153168 677139206 677240677 677355652 677396317 677328186 677173309 676993713 676865921
2474.6 676865921 676853485 676974640 677181931 677374268 677448044 677356796 677140808 676897354 676714096 676609573
2484.2 676609573 676525574 676372681 676098175 675727997 675353394 675072098 674926529 674882584 674858093 674775772
2493.9 674775772 674602585 674360657 674113922 673941422 673899994 673986588 674126358 674208755 674160461 673999329
2503.5 673999329 673823395 673739700 673793945 673947678 674112320 674200516 674164810 674016266 673820343 673666916
2513.2 673666916 673616867 673657532 673707123 673674469 673525772 673305588 673096619 672960052 672903137 672889938 672869034
2523.8 672869034 672797623 672655334 672453842 672237701 672072220 672010040 672054901 672144394 672173691 672057648
2533.4 672057648 671797256 671494217 671285629 671237488 671282349 671262894 671051559 670646896 670165863 669754562
2543.1F69754562k56347j00556K594L4485r155j17569k46811l23486k89231j47934
2552.7F68300552K4262J30462J13526o561j51291k33689k11410j07422P706N9738J2512
2563.3F67938385j19247k80610m02145m29001l48053k05993r4834r2468k01035l36685
2573F65428314l91083l22647j85547q2016p8582j64261k76489l49656l47595k71072
2582.6F62959366j52893n4779m0894j37558l01361m40903m75158l91770k46963j24436
2592.2F60592651p8354j10015j77536k24228k11640j40609m9744J0452J5946j4191
2601.9F59612732l4943j6174L6468R2316J27106J37329J26495R1553K6474n0354r1782
2612.5F60057220n2566O2790J85776K23465J29776n4322k26211k89765k18887o5689
$$ plain form
2543.1 669754562 669498215 669397659 669400253 669434738 669425583 669308014 669061203 668737717 668448486 668300552
2552.7 668300552 668324814 668455276 668568802 668562241 668410950 668177261 667965851 667858429 667866135 667925873 667938385
2563.3 667938385 667819138 667538528 667136383 666707382 666359329 666153336 666058502 665966034 665764999 665428314
2573 665428314 665037231 664714584 664529037 664447021 664368439 664204178 663927689 663578033 663230438 662959366
2582.6 662959366 662806473 662751694 662710800 662573242 662271881 661830978 661355820 660964050 660717087 660592651
2592.2 660592651 660514297 660404282 660226746 660002518 659790878 659650269 659600525 659610977 659626923 659612732
2601.9 659612732 659577789 659561615 659598083 659690399 659817505 659954834 660081329 660172882 660199356 660149002 660057220
2612.5 660057220 660004654 660067444 660253220 660476685 660606461 660552139 660325928 660036163 659817276 659751587
2622.1F59751587P5836J24207N0811j05972k63214l34930k86332j58767m3335j5030
2631.8F58794861p8049j67999k11411j82418j12229m8370j6022j3504l3035p1945j19935
2642.4F57739944j50222j35117p5683r461J6022j7395q5449j41297j48773j00021j8082
2653F56874466N6000P8048K2431r8114k32620l14179l00522k00195p0572J0529j2513
2663.6F55812759j41525l19290m57611m86832l96728k42920j11618o5842j12457k00882
2673.3F53277054k54975k22778j08414K5330R5139N4626p3471k12708k88085k75193
2682.9F52016525k05993j36643j11465j42212k08588k68173k76566k17208j20926n2796
2692.5F50275955o4316j48773k41546k73209k19345j17417l0670n951n5160j58768
$$ plain form
2622.1 659751587 659827423 659951630 660002441 659896469 659633255 659298325 659011993 658853226 658809891 658794861
2631.8 658794861 658716812 658548813 658337402 658154984 658042755 657994385 657978363 657964859 657931824 657859879 657739944
2642.4 657739944 657589722 657454605 657378922 657369461 657385483 657368088 657282639 657141342 656992569 656892548 656874466
2653 656874466 656930466 657008514 657030945 656932831 656700211 656386032 656085510 655885315 655814743 655825272 655812759
2663.6 655812759 655671234 655351944 654894333 654407501 654010773 653767853 653656235 653590393 653477936 653277054
2673.3 653277054 653022079 652799301 652690887 652716217 652811356 652865982 652792511 652579803 652291718 652016525
2682.9 652016525 651810532 651673889 651562424 651420212 651211624 650943451 650666885 650449677 650328751 650275955
2692.5 650275955 650211639 650062866 649821320 649548111 649328766 649211349 649180679 649174728 649119568 648960800
2702.2F48960800k77328l60108l59802k58713r1552O1645J15509L1738j51901l39432
2711.8F47330856m33349l92990k56577j12152m0588p0420j72119k86407l54462l43475
2721.5F44868317k61460j60522j14746j66474k82974l69339l42789k07901n1879K9602
2731.1F42939835J2588n5466j18484j59683j89591k02637j69448p5379M1657J09939
2740.8F42133331P7973m3793j94702l03726l28598k73896j92184j54572k05612l18527
2750.4F40195694m04511l81774k49711r7465l7384j16196k85721m44297n07431m54636
2760F37216568l30391k11105j59378j86539k48642k82211k52762j74866r3498m4823
2769.7F35232353m2419q5488j65214k58217l23143l25584k73514k21100k27623l07312
$$ plain form
2702.2 648960800 648683472 648323364 647963562 647704849 647613297 647674942 647790451 647822189 647670288 647330856
2711.8 647330856 646897507 646504517 646247940 646135788 646095200 646024780 645852661 645566254 645211792 644868317
2721.5 644868317 644606857 644446335 644331589 644165115 643882141 643512802 643170013 642962112 642910233 642939835
2731.1 642939835 642952423 642896957 642778473 642618790 642429199 642226562 642057114 641981735 642023392 642133331
2740.8 642133331 642211304 642167511 641972809 641669083 641340485 641066589 640874405 640719833 640514221 640195694
2750.4 640195694 639791183 639409409 639159698 639062233 639024849 638908653 638622932 638178635 637671204 637216568
2760 637216568 636886177 636675072 636515694 636329155 636080513 635798302 635545540 635370674 635277176 635232353
2769.7 635232353 635189934 635104446 634939232 634681015 634357872 634032288 633758774 633537674 633310051 633002739
2779.3F33002739m17213m89731m80118l85590k41203j01662j9684k3613r7465j91002
2789F30555458k50816k55051k20070j78947j56403j59683j84021k18124k47155k55546
2798.6F28429642k36588j96838j56059j40954j73988k53029l38897l68996l04909j77879
2808.3F26081505q2512j03531k40974m05236m92477m67949l78914k97470k59056k57187
2817.9F23096199k75497l10517l56788l90892l86048l40881k90337k74200l03307l51791
2827.6F19815941l82805l78952l50189l20931l14865l43094l99780m63066n13382n48973
2837.2F15799904n91393o60286p46231q07571q02956p30476o36025n82237o04210o91528
2846.8F08946991q02231q90999r27963r03206q21304p02477n80558m93508m62837m75731
$$ plain form
2779.3 633002739 632585526 632095795 631615677 631230087 630988884 630887222 630867538 630843925 630746460 630555458
2789 630555458 630304642 630049591 629829521 629650574 629494171 629334488 629150467 628932343 628685188 628429642
2798.6 628429642 628193054 627996216 627840157 627699203 627525215 627272186 626933289 626564293 626259384 626081505
2808.3 626081505 625998993 625895462 625654488 625249252 624756775 624288826 623909912 623612442 623353386 623096199
2817.9 623096199 622820702 622510185 622153397 621762505 621376457 621035576 620745239 620471039 620167732 619815941
2827.6 619815941 619433136 619054184 618703995 618383064 618068199 617725105 617325325 616862259 616348877 615799904
2837.2 615799904 615208511 614548225 613801994 612994423 612191467 611460991 610824966 610242729 609638519 608946991
2846.8 608946991 608144760 607253761 606325798 605422592 604601288 603898811 603318253 602824745 602361908 601886177
2856.5F01886177m88396m53643l59459k42768j65214j64223k23045k87133l08532k81906
2866.1E98911858k32964j85089j39008q5945l5743k0295o7291j68724k77100l36723
2875.8E97362976l20969k51846j82609j62888k01416k61726k87819k57302k06642k07405
2885.4E95022354l03841m68597o16417o69556o09321m77333l36495k35862k04544k57264
2895.1E90843124l86085n49927o87904p57485p65915p57026p68280q02193q37440q60100
2904.7E83670769q78830r12094r71909j061516j177711j307144j416741j463089j422043
2913.4E73059692j308746j162415j008529q41179o41213m12483j90811j6403R9754
2922.1E67577667J83411K70538L74451M72450N20783M87938L83148K54211J53198R4452
$$ plain form
2856.5 601886177 601397781 600944138 600584679 600341911 600176697 600012474 599789429 599502296 599193764 598911858
2866.1 598911858 598678894 598493805 598354797 598268852 598233109 598212814 598145523 597976799 597699699 597362976
2875.8 597362976 597042007 596790161 596607552 596444664 596243248 595981522 595693703 595436401 595229759 595022354
2885.4 595022354 594718513 594249916 593633499 592963943 592354622 591877289 591540794 591304932 591100388 590843124
2895.1 590843124 590457039 589907112 589219208 588461723 587695808 586938782 586170502 585368309 584530869 583670769
2904.7 583670769 582791939 581879845 580907936 579846420 578668709 577361565 575944824 574481735 573059692
2913.4 573059692 571750946 570588531 569580002 568738823 568097610 567685127 567494316 567477913 567577667
2922.1 567577667 567761078 568031616 568406067 568878517 569399300 569887238 570270386 570524597 570677795 570772247
2931.7E70772247M4556l6469j45797k30751k45018k04964j85890k48490l70025m56772
2941.3E68692627m29802l03726j76163j47972k42653l97835n24673n73006n49736m93011
2951E64854050m31099l70636l13492k80113l02735l95813n26657o26716o44226n89982
2960.6E60372581n29899n28107n91812o72607p18804p21054p08198p06635p13615p10373
2970.3E53771477o92826o77795o80428o96716p06482o98700o79702o66237o68526o84891
2979.9E46919174p05604p13349o90384o31866n60570n18532n32455n81322o07185n67169
2989.6E40810738m78211m04396l97644m47769m97360n03083m82215m97208n98602p82013
2999.2E35722237r97277j192283j338501j422692j422882j308365j072349p63931m77372
$$ plain form
2931.7 570772247 570816803 570780334 570634537 570403786 570158768 569953804 569767914 569519424 569149399 568692627
2941.3 568692627 568262825 567959099 567782936 567634964 567392311 566994476 566469803 565896797 565347061 564854050
2951 564854050 564422951 564052315 563738823 563458710 563155975 562760162 562233505 561606789 560962563 560372581
2960.6 560372581 559842682 559314575 558722763 558050156 557331352 556610298 555902100 555195465 554481850 553771477
2970.3 553771477 553078651 552400856 551720428 551023712 550317230 549618530 548938828 548272591 547604065 546919174
2979.9 546919174 546213570 545500221 544809837 544177971 543617401 543098869 542566414 541985092 541377907 540810738
2989.6 540810738 540332527 539928131 539530487 539082718 538585358 538082275 537600060 537102852 536504250 535722237
2999.2 535722237 534724960 533532677 532194176 530771484 529348602 528040237 526967888 526203957 525726585
3007.9E25726585k99682k54708k90679l23105k94228k07214j15624q7394j70937l76358
3017.5E23306656o72646j001091j301651j543045j724701j846923j873551j732712
3025.2E11610336j374550q37974k60544J95923M50363N54924O48613Q54111J192627
3033.9E13033829J581802J900139K067718K083779K008095J911049J825256J733742
3041.6E28145409J595115J388626J147156R46541Q49724Q43735Q33168P11555M67567
3050.3E36928596K32506K03858M96368J038590J609039J982422K064895J915818J664505
3059E48136597J411323J185036R70383P54928N62477M59633N34706Q48389J379585
3067.7E56243057K002297K529945K803307K766113K479591K073250J675034J358337
$$ plain form
3007.9 525726585 525426903 525172195 524881516 524558411 524264183 524056969 523941345 523853951 523683014 523306656
3017.5 523306656 522634010 521632919 520331268 518788223 517063522 515216599 513343048 511610336
3025.2 511610336 510235786 509397812 509137268 509333191 509783554 510338478 510987091 511841202 513033829
3033.9 513033829 514615631 516515770 518583488 520667267 522675362 524586411 526411667 528145409
3041.6 528145409 529740524 531129150 532276306 533222847 534072571 534916306 535749474 536461029 536928596
3050.3 536928596 537161102 537364960 537861328 538899918 540508957 542491379 544556274 546472092 548136597
3059 548136597 549547920 550732956 551703339 552458267 553020744 553480377 554015083 554863472 556243057
3067.7 556243057 558245354 560775299 563578606 566344719 568824310 570897560 572572594 573930931
3075.4E73930931J123543R19990O92063M27017J68533j7509r6207q9531n6572n2223
3085E76950035r9678j88560k81296l21579k54784n9967K27204N34591Q03337J022110
3094.7E78331413J208000J359444J433449J378822J187744R12705O30836L94135K12784
3103.4E87049332P5378k4757q6060j13220j27258j53237k02980k71187l45306m20342
3113E85380363m96406n68771o24466o54335o71273p04498p71332q52241q91304q36792
3122.6E78308945o84357m88319l26691k51503k57034k92855l02848k61651j82762r9868
3132.3E75161057m0055o218J8273N5351J15433J88675K46505K54975J96609R0866p629
3142.9E76273842l8986J7891J27067K16980K26975J38931k2659k12822l83034m92935
$$ plain form
3075.4 573930931 575054474 575974464 576666527 577093544 577262077 577244568 577148361 577058830 577002258 576950035
3085 576950035 576850357 576661797 576380501 576058922 575804138 575744171 575971375 576505966 577309303 578331413
3094.7 578331413 579539413 580898857 582332306 583711128 584898872 585811577 586442413 586836548 587049332
3103.4 587049332 587124710 587099953 587013893 586900673 586773415 586620178 586417198 586146011 585800705 585380363
3113 585380363 584883957 584315186 583690720 583036385 582365112 581660614 580889282 580037041 579145737 578308945
3122.6 578308945 577624588 577136269 576809578 576558075 576301041 576008186 575705338 575443687 575260925 575161057
3132.3 575161057 575121002 575114784 575133057 575188408 575303841 575492516 575739021 575993996 576190605 576281471 576273842
3142.9 576273842 576234856 576252747 576379814 576596794 576823769 576962700 576940041 576727219 576344185 575851250
3152.5E75851250n25055n00641m72183m86489n47104o12525o41213o28777o02607n82352
3162.2E70252304n57518n08346m36211l66707l18260k81983k40326j94816j66054j62811
3171.8E67019272j64032j41564r4184n2033l9329m4136k9603K0447Q1444J08643Q0719
3182.4E66745644J8005l9024o5384o9771q1863j25733j96342k63138k91939k76337
3192.1E65354118k44941k38877k80685l59879m46205n13038n42527n25474m64669l85437
3201.7E61352386l33976l48702m28810n33142o14510o53305o61010o56052o45828o29082
3211.4E55847969o05774n78575n50499n27992n26123n59387o20690o76193o88973o54106
3221E49859657o00357n63926n55230n63163n73655n77659n59845m94576l75366k46963
$$ plain form
3152.5 575851250 575326195 574825554 574353371 573866882 573319778 572707253 572066040 571437263 570834656 570252304
3162.2 570252304 569694786 569186440 568750229 568383522 568065262 567783279 567542953 567348137 567182083 567019272
3171.8 567019272 566855240 566713676 566619492 566567459 566528130 566483994 566454391 566474838 566556282 566664925 566745644
3182.4 566745644 566763649 566724625 566659241 566589470 566507607 566381874 566185532 565922394 565630455 565354118
3192.1 565354118 565109177 564870300 564589615 564229736 563783531 563270493 562727966 562202492 561737823 561352386
3201.7 561352386 561018410 560669708 560240898 559707756 559093246 558439941 557778931 557122879 556477051 555847969
3211.4 555847969 555242195 554663620 554113121 553585129 553059006 552499619 551878929 551202736 550513763 549859657
3221 549859657 549259300 548695374 548140144 547576981 547003326 546425667 545865822 545371246 544995880 544748917
3230.7E44748917j94283k79465m81147o97785q18825q00743o84242n44739m33540l59306
3240.3E39454842l17650l18642l76167m73824n50956n43671m46968l31421k85339l33138
3249.9E35477066m09546m19464l25165j75476n4703j0376k9716p3433j18599j69411
3259.6E33691177k38533l30505m40559n52636o39343o70585o39077n81703n64537o29654
3269.2E28404045p54394q64106q95996q55751q11004q24166q92410r52644r47838q90465
3278.9E19715271q52470q91114r83848j046105j016502r22279q55408q82568r84383
3287.5E11280594j083756j131477j150970j199189j292877j381302j396980j325455
3295.3E01318588j222725j162414j166229j182633j132088r77630p58667n69344m91905
$$ plain form
3230.7 544748917 544554634 544275169 543794022 543096237 542277412 541476669 540792427 540247688 539814148 539454842
3240.3 539454842 539137192 538818550 538442383 537968559 537417603 536873932 536426964 536095543 535810204 535477066
3249.9 535477066 535067520 534648056 534322891 534147415 534092712 534082336 534052620 533979187 533860588 533691177
3259.6 533691177 533452644 533122139 532681580 532128944 531489601 530819016 530179939 529598236 529033699 528404045
3269.2 528404045 527649651 526785545 525889549 525033798 524222794 523398628 522506218 521553574 520605736 519715271
3278.9 519715271 518862801 517971687 516987839 515941734 514925232 514002953 513147545 512264977 511280594
3287.5 511280594 510196838 509065361 507914391 506715202 505422325 504041023 502644043 501318588
3295.3 501318588 500095863 498933449 497767220 496584587 495452499 494474869 493716202 493146858 492654953
3303.9D92654953n46303o85501q36449r46502j002655j019211j015167j004181r91745
3312.6D84607239r73969r36050q60977p49779o32172n51262n27572n40200n45005n14527
3322.3D77775726m61883m26140m38194n05371o16608p55921r00650j018066j079330
3330.9D71573563j087380j086120j128655j230316j359863j475144j562958j635398
3338.7D61007729j687661j684303j596069j443215j276779j110267q76236m80538R6016
3347.3D50948677P55806J352844J801567K115364K352906K545623K685395K761230
3355.1D67319412K782746K755851K657585K453652K145271J787834J454010J181565
3362.8D84537926R56764P42798N17540K85492O4316j28441k83585l99208m84772n52139
$$ plain form
3303.9 492654953 492108650 491423149 490586700 489640198 488637543 487618332 486603165 485598984 484607239
3312.6 484607239 483633270 482697220 481836243 481086464 480454292 479903030 479375458 478835258 478290253 477775726
3322.3 477775726 477313843 476887703 476449509 475944138 475327530 474571609 473670959 472652893 471573563
3330.9 471573563 470486183 469400063 468271408 467041092 465681229 464206085 462643127 461007729
3338.7 461007729 459320068 457635765 456039696 454596481 453319702 452209435 451333199 450852661 450948677
3347.3 450948677 451704483 453057327 454858894 456974258 459327164 461872787 464558182 467319412
3355.1 467319412 470102158 472858009 475515594 477969246 480114517 481902351 483356361 484537926
3362.8 484537926 485494690 486237488 486755028 487040520 487104836 486976395 486692810 486293602 485808830 485256691
3372.4D85256691o09016o48880o61316o46477o27442o41670p12318q24967r25788r57261
3382.1D78001556r04274q11500p48825p52030p96623q31642q34847q27827q33473q38432
3391.7D69822083q09594p49702p17697p75986r18503j062393j115723j052856r25484
3400.4D61694145q05092p28874o87294o49910n84793m68025k91634p2212J52969L49427
3410D57908707N07011O35414P49245Q63533J003990J196289J425476J610069J642228
3418.7D67541962J482315J215896J001892R46923J021843J099281J072044R29375P36923
3427.4D77048454N61600M30336L47748L21808L52668M01154M03442L29438K26974J82037
3437D80605659K30332L12157L33099K70462K02560K22664L28026M09203L62434K02179
$$ plain form
3372.4 485256691 484647675 483998795 483337479 482691002 482063560 481421890 480709572 479884605 478958817 478001556
3382.1 478001556 477097282 476285782 475536957 474784927 473988304 473156662 472321815 471493988 470660515 469822083
3391.7 469822083 469012489 468262787 467545090 466769104 465850601 464788208 463672485 462619629 461694145
3400.4 461694145 460889053 460160179 459472885 458822975 458238182 457770157 457478523 457406311 457559280 457908707
3410 457908707 458415718 459051132 459800377 460663910 461667900 462864189 464289665 465899734 467541962
3418.7 467541962 469024277 470240173 471242065 472188988 473210831 474310112 475382156 476311531 477048454
3427.4 477048454 477610054 478040390 478388138 478709946 479062614 479463768 479867210 480196648 480423622 480605659
3437 480605659 480835991 481148148 481481247 481751709 481954269 482176933 482504959 482914162 483276596 483478775
3446.7D83478775N3635L0975J34392K67830L43132L49312L22799K81029K10113J15395
3456.3D85587387N3749R0408K27280L86429M76723M65622L88565K98004K21214J64986
3466D88360367J40076J60255K26250L18756M16221N03998N60646N50003M49868K95372
3475.6D91981812J75247J62811K46849L42369L76587L60947L67317M38728N33943N67398
3485.2D95554008M98696L74489K82402K74887L35655M09622M52385M50211M11796L53012
3494.9D99397163L00446K88238L39547M37812N22881N31006M48799L36266K80799L25280
3504.5E03208237M29153N07164N08194M56543M19006M35982M91448N46531N83344O09398
3514.2E08195000O22444O02836N48439N04151N25436O03142O43654N54924L53241J73302
$$ plain form
3446.7 483478775 483532410 483563385 483697777 483965607 484308739 484658051 484980850 485261879 485471992 485587387
3456.3 485587387 485641136 485731544 485958824 486345253 486821976 487287598 487676163 487974167 488195381 488360367
3466 488360367 488500443 488660698 488886948 489205704 489621925 490125923 490686569 491236572 491686440 491981812
3475.6 491981812 492157059 492319870 492566719 492909088 493285675 493646622 494013939 494452667 494986610 495554008
3485.2 495554008 496052704 496427193 496709595 496984482 497320137 497729759 498182144 498632355 499044151 499397163
3494.9 499397163 499697609 499985847 500325394 500763206 501286087 501817093 502265892 502602158 502882957 503208237
3504.5 503208237 503637390 504144554 504652748 505109291 505528297 505964279 506455727 507002258 507585602 508195000
3514.2 508195000 508817444 509420280 509968719 510472870 510998306 511601448 512245102 512800026 513153267 513326569
3523.8E13326569J50528K92701M76799N68886N43327M85192M92744N85480O97250P38678
3533.5E18358154O70967N35241M28199M36821N67131P30667Q11120P61718O38542N31197
3543.1E24469757M73709M34570L90206L74832M33846N43632O13098N85594N10521M93813
3552.7E29323578N78575P03506P84226Q03833P95822P64504O77986N60341N41725P41768
3562.4E36275864J081619J265373J022492M00848k08588l74641J7738O91452J231385
3571.1E41403542J401901J248665R65614P19109N83610N70335O47355P36923P57179
3579.7E49034233P10068P09114Q62465J107330J197968R18235L36457j73226k07061
3588.4E54495583L29284J124993J694793J732674J301117P36923L89481L95317O36101
$$ plain form
3523.8 513326569 513477097 513769798 514246597 514815483 515358810 515844002 516336746 516922226 517619476 518358154
3533.5 518358154 519029121 519564362 519992561 520429382 520996513 521727180 522538300 523300018 523938560 524469757
3543.1 524469757 524943466 525378036 525768242 526143074 526576920 527120552 527733650 528319244 528829765 529323578
3552.7 529323578 529902153 530605659 531389885 532193718 532989540 533754044 534432030 534992371 535534096 536275864
3562.4 536275864 537357483 538622856 539645348 540046196 539837608 539462967 539480705 540172157 541403542
3571.1 541403542 542805443 544054108 545019722 545738831 546322441 546892776 547540131 548277054 549034233
3579.7 549034233 549744301 550453415 551315880 552423210 553621178 554539413 554875870 554702644 554495583
3588.4 554495583 554824867 555949860 557644653 559377327 560678444 561415367 561804848 562200165 562836266
3597.1E62836266Q68568R17473P86743O30798O21262Q18024J122360J336174J289711
3605.8E71227379R71374N70069L56865M58870P23342Q44536O85768M52805M83093Q36945
3615.4E77611046J160621J031685M30680k00806l99513j03798M02908Q91075J361962
3624.1E82185860J792144J870003J218338o3629j230774j451454n84755O62918J393471
3632.8E85792122J301918Q07342M96293N43479O77376N96276L12919R4567J56250M62074
3642.4E91240616P99255R79767R42917O90346J97906n28068j278534j602364j094208
3651.1E90347633J65253J479416J994095J408844K51045n91087o31523r9106M20646
3659.8E94745216N50118L33176N0392k3995K56272Q07037J228485R86519n3444j242599
$$ plain form
3597.1 562836266 563704834 564622307 565409050 566039848 566661110 567479134 568601494 569937668 571227379
3605.8 571227379 572198753 572768822 573125687 573584557 574307899 575152435 575838203 576291008 576774101 577611046
3615.4 577611046 578771667 579803352 580234032 580033226 579633713 579529915 579932823 580823898 582185860
3624.1 582185860 583978004 585848007 587066345 587002716 585771942 584320488 583735733 584398651 585792122
3632.8 585792122 587094040 587901382 588397675 588941154 589618530 590214806 590527725 590622292 590778542 591240616
3642.4 591240616 592039871 593019638 593962555 594652901 594850807 594322739 593044205 591441841 590347633
3651.1 590347633 590512886 591992302 593986397 595395241 595646286 595055199 594423676 594324570 594745216
3659.8 594745216 595295334 595628510 595678902 595654907 595911179 596718216 597946701 598933220 598879776 597637177
3669.4E97637177j533967m97779J066475J735229Q21228r17587j999016j626205l22800
3678.1E94362755P51571R47266N42336K07405K88582O30760R01489Q95157N70526j6632
3687.8F00081215o99196j187935j216507p64313j08985L82499N31464M44450L63121
3696.4E97825813M28162N57022N27382K05002k81525o03943n12352p8926L66440N51224
3706.1E98984299M82177L32756J66131j30272o00586j008530r90257m40827L11814
3714.8E97106705P80487P36885L48854n4894k66456k71378j56440m2458o2752k73971
3724.4E97844582n39246n72052k07710L72696P59735P02591L40309J2855j21383k11678
3734E98380699m63180q28896j009903p40318l6812P89833J309814J187249L81622p19490
$$ plain form
3669.4 597637177 596103210 595605431 596671906 598407135 599228363 598310776 596311760 594685555 594362755
3678.1 594362755 595114326 596061592 596603928 596811333 597099915 597730675 598632164 599527321 600097847 600081215
3687.8 600081215 599382019 598194084 596977577 596213264 596104279 596486778 597018242 597462692 597825813
3696.4 597825813 598253975 598810997 599338379 599543381 599261856 598657913 598145561 598066635 598433075 598984299
3706.1 598984299 599466476 599799232 599965363 599835091 599234505 598225975 597235718 596794891 597106705
3714.8 597106705 597887192 598624077 598972931 598918037 598651581 598380203 598223763 598181305 598118553 597844582
3724.4 597844582 597305336 596733284 596525574 596898270 597658005 598360596 598700905 598713760 598592377 598380699
3734 598380699 597917519 597088623 596078720 595338402 595301590 596091423 597401237 598588486 598970108 598250618
3743.7E98250618j414871j147614l1471J098900J317291M14047q99162j618576j292038
3752.4E94677124k78931P04193J171494J041946M63486l19633r44252j022683m66957
3761E95025787K98195O32515K93732l00179n12046j70594K74391K89841j50413n78347
3770.7E95102882n72853j67198K88239N33943N69572M73442K28272j86386o08483p43446
3780.3E94917984m65507j2703J98898j7891m18358n65796k74162J95961M05884K02980
3790E94167290j15700j38435J74560M21295K39563k00386l27568J32027P05337O08483
3799.6E95666466l27530j326256j424255n28336M43611N38140k40746j019859j036034
3808.3E90745201l39928M69132R54208J080170Q94318L32717m86602j026230p51763
$$ plain form
3743.7 598250618 596835747 595688133 595656662 596755562 598072853 598486900 597587738 595969162 594677124
3752.4 594677124 594398193 595102386 596273880 597315826 597779312 597459679 596515427 595492744 595025787
3761 595025787 595323982 595956497 596250229 595950050 595438004 595267410 595541801 595831642 595681229 595102882
3770.7 595102882 594530029 594362831 594651070 595185013 595754585 596228027 596456299 596269913 595661430 594917984
3780.3 594917984 594452477 594439774 594638672 594620781 594202423 593636627 593362465 593558426 593964310 594167290
3790 594167290 594051590 593913155 594087715 594509010 594748573 594548187 594220619 594352646 595057983 595666466
3799.6 595666466 595338936 594012680 592588425 592060089 592503700 593041840 592801094 591781235 590745201
3808.3 590745201 590405273 590874405 591828613 592908783 593803101 594135818 593649216 592622986 591871223
3817E91871223J37940O84814J30196j146469j890755j271286K09541J237603J051864
3825.7E91014671J35346m47693k12059L85857O33201L69187K7847R155K10419K04010
3835.3E92329941k33155q64677j239586j113319o22292j06849J84593K32162J62125
3844E88728943Q9378O9237J57547M29916Q40989J073303O60324n64346k090836k935982
3853.6E86458473k414322q01124Q28514J514282J199226O10009L93486M71840L03268
3862.3E88563652l17116q85353p32460J37100R04007P43180k72293j185608j134377
3871E85820732k48413N20706M55132j59111m17366J13792Q61359R00421M6120q90198
3880.6E87003174r95484k75344L76510K11296n38368r57336m95873M31557R20257N26543
$$ plain form
3817 591871223 592009163 592693977 592824173 591677704 589786949 588515663 588725204 589962807 591014671
3825.7 591014671 591150017 590702324 590490265 590876122 591509323 591878510 591906357 591915512 592125931 592329941
3835.3 592329941 592096786 591232109 589992523 588879204 588256912 588150063 588334656 588566818 588728943
3844 588728943 588818321 588887558 589045105 589475021 590316010 591389313 592049637 591485291 589394455 586458473
3853.6 586458473 584044151 583243027 584071541 585585823 586785049 587395058 587788544 588260384 588563652
3862.3 588563652 588246536 587361183 586628723 586765823 587669830 588413010 588140717 586955109 585820732
3871 585820732 585572319 586093025 586548157 586389046 585971680 586085472 586946831 587847252 587893372 587003174
3880.6 587003174 586007690 585732346 586108856 586320152 585781784 584824448 584328575 584760132 585680389 586206932
3890.3E86206932l42102r07059p54928r9030N35126P58896N20973L9825l73344n00031
3899.9E85085258l53775j71623k05917m73709p16439o43196k20031K85873N38940M07868
3909.6E83533249M5662k54936k81449m2610K47955L31994J11770k65770n25856m96788
3919.2E82403221k42233J6708R6741k3727k23656l41911k75612m2229K14691L09181
3928.8E81891174J55144j47705l88222m22935k80342r8763J3657M6272M5395M4441
3938.5E80858116L5477k0676j55563l34282m33083l29094n7411J56594R4795k07672
3948.1E79607201m70353m61120k32124j8425N2490N5389P7133O5842n4893k03324k17972
3958.7E78199844j06315p2556k29721l99208l34320p8316O3134o6185k62032k62375
$$ plain form
3890.3 586206932 585864830 584957771 584202843 584103813 584638939 585397835 585918808 585958633 585585289 585085258
3899.9 585085258 584731483 584559860 584353943 583880234 583163795 582520599 582300568 582586441 583125381 583533249
3909.6 583533249 583578911 583323975 583042526 582999916 583247871 583579865 583691635 583425865 582900009 582403221
3919.2 582403221 582160988 582177696 582274437 582250710 582027054 581685143 581409531 581367302 581581993 581891174
3928.8 581891174 582046318 581898613 581510391 581087456 580807114 580708351 580722008 580768280 580813675 580858116
3938.5 580858116 580893593 580872917 580717354 580383072 579949989 579620895 579563484 579720078 579814873 579607201
3948.1 579607201 579136848 578675728 578443604 578425179 578477669 578533058 578610191 578676033 578621140 578417816 578199844
3958.7 578199844 578093529 578020973 577791252 577392044 577057724 576979408 577042542 576976357 576714325 576451950
3968.4E76451950j20087r9907k59704l71437l00904k37808l67737n01823l20358N8861
3978E73931046J11808l50113p98072o67115k13699k08588p68051j079101o24619j50947
3987.7E69182549o69213j712951j693535m37661k09808k746353n729828m732513n40543
3996.3E50710144l151131k4594421o4962311j06348915
4000.2C51653366
$$ plain form
3968.4 576451950 576331863 576231956 575972252 575600815 575299911 575062103 574694366 574192543 573872185 573931046
3978 573931046 574042854 573692741 572894669 572227554 572013855 571805267 571037216 569958115 569333496 569182549
3987.7 569182549 568513336 566800385 565106850 564669189 564459381 561713028 555983200 551250687 550710144
3996.3 550710144 547559013 522964592 458002281 351653366
4000.2 351653366
##END=$$ End of the data block
