##TITLE=AM 05 $$ Begin of the data block
##JCAMP-DX=5.00 $$ ACD/SpecManager v 10.08
##SPECTROMETER/DATA SYSTEM=Alpha
##DATE=23 Oct 2014 09:00:34
##DATA TYPE=INFRARED SPECTRUM
##DATA CLASS=XYDATA
##ORIGIN=
##OWNER=
##NPOINTS=1667
##FIRSTX=599.57470703
##LASTX=3997.16503906
##MAXX=3997.16503906
##MINX=599.57470703
##MAXY=0.98381329
##MINY=0.88671559
##XFACTOR=1.0000000000
##YFACTOR=1.000000000000000e-9
##FIRSTY=0.88671559
##DELTAX=2.03937006
##XUNITS=1/CM
##YUNITS=ARBITRARY UNITS
##XYDATA=(X++(Y..Y))
599.6 886715591 886970758 887512624 888123989 888752222 889650881 890740395 891790867 893003106 894237757
617.9 894237757 895082116 895834565 896365523 896258354 896518111 897376180 897574961 897276163 897614121 898391485
638.3 898391485 899122059 899941087 900686920 901350379 901968896 902224898 902358532 902771711 903004766 902747512
658.7 902747512 902664542 903256655 904108346 904771686 905404925 906195581 906948745 907379150 907437742 907467425
679.1 907467425 907539189 907505751 907423139 907213330 906643689 905794680 904912174 904583812 905414879 906977296
699.5 906977296 908519089 910122991 911899388 913338780 914270937 914908409 915297329 915535569 915847242
717.9 915847242 916276813 916421890 916079700 915737450 915571332 915086687 914090812 912850380 911441207
736.2 911441207 909678698 907479465 905202627 903355420 901892304 900458455 899126530 898289323 898067892
754.6 898067892 898558438 899788618 901225865 902569532 904021442 905746102 907887518 910435200 913070440
772.9 913070440 915286839 916572511 916752517 916133106 914966941 913340926 911404371 909150183 906772137
791.3 906772137 904747307 903150976 901867688 900899291 900306940 900179803 900228739 900192916 900511444 901665866
811.7 901665866 903452575 905626774 908248961 911211967 914462924 917820632 920733452 922828674
828 922828674 924164474 924859226 924874365 924410045 923875034 923470140 923210561 923329949 924197912 925684690
848.4 925684690 927335382 928999901 930715144 932390809 933874249 935012102 935731232 936309695 937213957
866.7 937213957 938609898 940354347 942112982 943681598 945116222 946197271 946667790 946789384 946915388
885.1 946915388 947013140 946879208 946534097 946112633 945651114 945216775 944716275 943957508 943063855 942167521
905.5 942167521 941253483 940317750 939382851 938737988 938576639 938585103 938579798 938618243 938586652 938437402 938308775
927.9 938308775 938354433 938561201 938810170 939060390 939304531 939542294 939744651 939844370 939840853 939774275 939629018
950.3 939629018 939408243 939131737 938806713 938463092 938054502 937520862 936927557 936392248 935932934 935430586
970.7 935430586 934733927 933809638 932718337 931607783 930546880 929315567 927783489 926034033 924168050
989.1 924168050 922237217 920158684 917852104 915352106 912722111 909911394 906886816 903732598
1005.4 903732598 900529444 897437811 894529521 891977906 890821815 892124891 895085871 897488892
1021.7 897488892 897924364 896621704 894562244 892514527 890800476 889392674 888239920 887555778 887410939
1040.1 887410939 887548625 887847662 888323605 888906360 889371395 889464557 889232635 888846219 888386011 887929261
1060.5 887929261 887574911 887477219 887668073 888038516 888602316 889367580 890235066 891225278 892367363 893605173
1080.9 893605173 895013452 896587014 898060799 899392247 900824785 902393997 903970420 905630767
1097.2 905630767 907473087 909361482 911274910 913346112 915527880 917706430 919973612 922478199
1113.5 922478199 925059915 927480340 929801702 932110906 934295058 936268210 938066125 939610124
1129.8 939610124 940741122 941610098 942451000 943143487 943563223 943820536 943963826 943931401 943774641 943647265
1150.2 943647265 943585515 943549633 943590522 943756640 944039941 944437504 944845617 945041239 944897711 944512725
1170.6 944512725 943971038 943160534 942043960 940986276 940468431 940380096 940177798 939563155 938525140
1189 938525140 937111855 935403526 933494806 931486607 929610252 928076446 926919758 926130414 925568581
1207.3 925568581 924968362 924208045 923348069 922559321 922077715 922006130 922299325 922975898 924027264 925395310
1227.7 925395310 927120984 929162443 931419134 933862627 936434031 939023614 941450775 943479359
1244 943479359 944931746 945802629 946186244 946277201 946317017 946317434 946336687 946821451 948281229 950807452
1264.4 950807452 953863978 956568539 958340764 959198594 959490240 959508300 959368289 959120333 958770216
1282.8 958770216 958183289 957236111 956015348 954646111 953104794 951395273 949650884 947968841 946454048
1301.1 946454048 945306659 944672287 944655061 945259273 946315110 947753370 949570596 951855302 954707503
1319.5 954707503 957697988 960274577 962257445 963616252 964428246 964814186 964793503 964348495 963729203
1337.8 963729203 963691890 964417517 965056777 965206623 965128720 965089500 965078890 964952171 964680970 964118958
1358.2 964118958 962984860 961696148 961009681 960350752 959162533 957836866 956594408 956014276 956642389
1376.6 956642389 957850754 959051311 959863722 959943950 959642351 959743917 959839880 959033966 957554162
1394.9 957554162 956296623 955268919 953938603 951706529 948719382 946151912 944578290 944567144 946625888
1413.3 946625888 949891269 953588605 957946360 961377263 962864757 963331640 963098109 962260604 961391270
1431.6 961391270 960579515 959782183 959749401 960161030 960075855 959476113 958571434 957758486 957409680 957205176
1452 957205176 956640780 955830455 956469536 958154082 958861411 958611071 958347738 958049178 956866980 954975009
1472.4 954975009 954035223 954187989 954219401 953614175 952510715 950862527 948310435 945282340 943258643
1490.8 943258643 942113280 940129817 936900020 933627963 930838048 928002536 923952103 919551969
1507.1 919551969 919911683 923174083 926456332 929033995 931222916 932749748 933777630 935147405
1523.4 935147405 936450422 937933922 939440429 940326989 941478670 943063676 943914294 944783330 947291672
1541.8 947291672 950673044 954384983 957583606 960420907 963391960 965957284 967498779 968536496
1558.1 968536496 971271873 973762035 974670708 974642515 974119604 973693192 973442912 972460508 970725179
1576.4 970725179 969509900 968401253 966549337 964097440 961396039 958791912 956628919 955155194
1592.8 955155194 954649806 955225766 956486762 957976162 959478319 960799158 961831391 962782085 963872433
1611.1 963872433 964870155 965762198 967199028 968741715 969433367 969544947 969605565 969586551 969579518 969410360
1631.5 969410360 968426406 966896534 966569841 966874480 966664732 965721309 964043140 962998331 962954760
1649.9 962954760 962137878 961376250 962340057 963053584 962902129 962342381 962133169 961911142 961155593 960617900
1670.3 960617900 960588336 960429907 960375428 960213065 959404290 958071589 957294106 957704484 957980573 958033144
1690.7 958033144 957790434 956798017 955650926 955150008 955442965 956090808 956612468 957370222 958230793
1709 958230793 958796620 958946586 958713233 959023476 960706472 962462604 963765621 964902699 965694427
1727.4 965694427 966149986 966673672 968117774 970939755 973269224 974886298 976319432 977567911 978596866
1745.7 978596866 979155481 979612708 980799735 981988370 982328892 982291520 982232988 982270300 982612133 982562363
1766.1 982562363 981950879 981296003 980937243 981249928 981810689 982020259 981962383 981900930 981890619 982015610
1786.5 982015610 981855690 981113911 980645418 980959356 981281042 981165946 980909288 981156290 981687725 981896818
1806.9 981896818 981782675 981694043 981824279 981929302 981902838 981931746 981862605 981482327 981152833 981008470
1827.3 981008470 980852067 981114984 981606781 981782377 981768370 981649101 981181979 980564833 980542064 980947435
1847.7 980947435 981318295 981614888 981746376 981627882 981349528 981201291 981237411 981141865 980646849 980065525
1868.1 980065525 980225205 980885446 981260717 981345117 981336176 981255770 981190622 981173038 980965674 980556011 980443716
1890.5 980443716 980587542 980614185 980671108 980791390 980814338 980762243 980692565 980593622 980539143 980683327 980874360
1913 980874360 980757475 980406582 980247557 980209947 980211794 980486929 980808735 980964482 981020212 980996728 980956972
1935.4 980956972 980907381 980661690 980218410 980058730 980309308 980562985 980680346 980728447 980784535 980871558
1955.8 980871558 980840445 980679274 980589688 980504036 980350673 980414808 980685830 980879366 980989337 981017649
1976.2 981017649 980903566 980763078 980696499 980618358 980493605 980372250 980253816 980316937 980600774 980748653
1996.6 980748653 980715990 980713069 980735302 980720460 980621219 980487645 980451703 980467737 980409503 980330527 980371237
2019 980371237 980468035 980513573 980500877 980455995 980428100 980419457 980428815 980422556 980399966 980399430 980410457 980443299 980485499
2045.5 980485499 980518401 980532348 980523407 980504870 980477095 980422258 980352521 980293453 980245292 980280876 980415523
2067.9 980415523 980510473 980465770 980333447 980246902 980260551 980326891 980376184 980351686 980296969 980299413 980304658 980260789
2092.4 980260789 980210006 980160534 980135381 980152428 980161607 980119646 980082095 980106652 980107188 980045140 979996443 979958713
2116.9 979958713 979963422 980075836 980172217 980162024 980146229 980113864 980055153 980048716 980029583 979997635 980009437 980014682
2141.4 980014682 980010629 980068505 980182528 980228901 980211020 980212867 980207264 980205178 980245650 980259657 980207622 980173945
2165.8 980173945 980180919 980172873 980188727 980270922 980366647 980423629 980404913 980337560 980315983 980340779 980321646 980270445
2190.3 980270445 980283201 980320930 980327129 980340123 980325460 980258167 980209410 980206430 980200052 980164587 980140984 980135262
2214.8 980135262 980125248 980138719 980184197 980246365 980280519 980228364 980131328 980072439 980072141 980106950 980153024 980150819
2239.3 980150819 980083823 980031133 980025649 980041742 980033815 979997039 979988992 980007946 980023921 980044842 980056524 980038345
2263.7 980038345 980017006 980004728 979993701 979955554 979891419 979899883 979966462 979972661 979932666 979946375 979990900 979969442
2288.2 979969442 979900360 979839265 979790688 979717314 979604244 979485869 979333103 979118526 978975534 978991985
2308.6 978991985 979068100 979193926 979368567 979429305 979315579 979181945 979170442 979311228 979572594 979940653
2329 979940653 980424702 980815709 981049001 981263757 981352031 981212556 980774403 980179489 979845345 979772687
2349.4 979772687 979913414 980381131 980886459 981169403 981342316 981319427 981082320 980678141 980134130 979628146
2369.8 979628146 979359150 979194343 978984416 978935599 979193449 979574502 979832530 979965568 980104685 980261385
2390.2 980261385 980323374 980258703 980213761 980225384 980201185 980177224 980206847 980229974 980219543 980205059 980188191
2412.6 980188191 980180204 980189383 980209529 980224729 980198681 980159342 980183661 980256081 980321527 980332911 980226040 980125129
2437.1 980125129 980183423 980250776 980206490 980193675 980275810 980327666 980323195 980336607 980325580 980247080 980170727 980134964
2461.5 980134964 980128586 980136633 980145156 980179667 980202436 980158031 980123580 980140448 980136752 980089784 980066240 980121017
2486 980121017 980183423 980169892 980132759 980141521 980162919 980112135 980017543 979979634 980005860 980064154 980085850 980053961
2510.5 980053961 980060816 980097592 980079889 980029166 980032682 980053127 980047405 980051458 979995787 979885817 979842365 979874611
2535 979874611 979940891 980013251 980036378 979979038 979935467 979966044 979959249 979897678 979908526 979918540 979836583 979837298
2559.4 979837298 979961514 980020940 979986608 979950309 979922712 979939759 979976714 979953706 979969800 980046451 980062246
2581.9 980062246 980040610 980017662 979935586 979807794 979746878 979801953 979892671 979949296 979967892 979974031 980011404
2604.3 980011404 980058610 980050147 979985654 979931593 979939699 979979575 979998648 979996860 980002999 980046272 980100274 980107188
2628.8 980107188 980074763 980015159 979946971 979940295 979969978 979933977 979817867 979708612 979710996 979789555 979807138
2651.2 979807138 979790688 979822159 979831636 979783237 979747772 979754388 979762495 979754984 979740679 979661345 979500353 979409218
2675.7 979409218 979447663 979506075 979558527 979629219 979703188 979746163 979726434 979654372 979593217 979592919 979565382 979464471
2700.1 979464471 979414403 979473054 979528368 979457498 979344308 979313195 979294896 979290068 979320407 979229212 979079366
2722.6 979079366 979105353 979242861 979311764 979271173 979116201 978933871 978880465 978937447 978986561 979013979 979016662
2745 979016662 978969097 978921354 978906631 978894651 978888452 978932738 978981733 978939593 978886783 978890538 978869617 978781462
2769.5 978781462 978630543 978492796 978466868 978541136 978574753 978500485 978432596 978438377 978486180 978523374 978521287
2791.9 978521287 978472352 978346050 978203833 978138387 978120625 978066802 977940977 977857769 977928877 978042841 978046060
2814.3 978046060 977934420 977807164 977715850 977584243 977395117 977263749 977151275 976902366 976574540 976324320
2834.7 976324320 976167142 976001561 975714147 975285053 974829435 974425077 974117339 973992229 973996162 974024713
2855.1 974024713 974052131 974120259 974245906 974303722 974232376 974176466 974202752 974182189 974152029 974230289 974370778
2877.6 974370778 974532008 974643707 974619329 974519253 974417448 974265516 974076927 973973274 973931193 973853648
2897.9 973853648 973747015 973601460 973448694 973367155 973363340 973362267 973216116 972953498 972793281 972764552 972742319
2920.4 972742319 972799957 972993851 973176718 973416388 973773241 974077046 974357665 974725425 975142181 975540757
2940.8 975540757 975848436 975966275 975907266 975794196 975631595 975380898 975056469 974689603 974348426 974113107
2961.2 974113107 974123478 974360585 974648237 974952698 975294292 975691080 976154506 976595819 976962030 977297485
2981.6 977297485 977621198 977943778 978269398 978594065 978847086 978975475 979063153 979109228 979094744 979061544
3002 979061544 979070067 979191363 979336321 979380906 979341984 979239464 979121327 979048014 978937030 978720486 978508651
3024.4 978508651 978476822 978571951 978663445 978771687 978850663 978852153 978846967 978883564 978946030 978997350 978990316 978940010
3048.9 978940010 978881538 978843629 978876114 978941202 978983045 978969932 978931427 978956044 979115844 979336739 979368031
3071.3 979368031 979229927 979174554 979188204 979165018 979170561 979219675 979180992 979057431 979045153 979177773 979300439
3093.7 979300439 979290247 979190052 979157031 979193628 979156733 978978753 978793740 978728116 978765905 978801250 978720248
3116.2 978720248 978628993 978669941 978732407 978666604 978593171 978708446 978916347 978976011 978883743 978861570 978951812
3138.6 978951812 978994668 978969336 978943646 978911817 978848755 978755116 978661060 978590906 978578269 978592634 978530645
3161 978530645 978442430 978390932 978265822 978090286 978033781 978060246 978009164 977820694 977573574 977455914 977529943
3183.5 977529943 977631152 977655768 977603078 977488875 977478504 977593422 977591276 977448463 977370918 977400184 977406025
3205.9 977406025 977304339 977165163 977098346 977110863 977165759 977196217 977129996 977027476 976971328 976897359 976782620
3228.3 976782620 976658523 976537704 976498127 976497591 976424694 976304114 976150334 975982606 975916088 975941718 975948393
3250.7 975948393 975952387 975981116 975874782 975575864 975369275 975371659 975389063 975312173 975236297 975271940 975337565
3273.2 975337565 975323677 975279450 975245714 975188255 975160301 975208342 975258410 975315154 975419343 975446582 975376666
3295.6 975376666 975348532 975377321 975404322 975351930 975169539 974990547 975038171 975232303 975379944 975541055
3316 975541055 975712538 975703299 975524068 975458920 975535572 975628316 975760460 975866318 975827336 975681722 975701153
3338.4 975701153 975998461 976287484 976313949 976151049 975983620 975941956 976090550 976303816 976438224 976480722
3358.8 976480722 976476014 976495922 976541162 976595283 976707816 976837397 976914942 976962924 976954997 976879597 976853073
3381.3 976853073 976963699 977153599 977350533 977471054 977437198 977403998 977502584 977604985 977625847 977691472
3401.7 977691472 977913082 978180647 978331745 978299379 978206456 978278160 978364766 978242040 978205681 978451788
3422 978451788 978736281 978946745 979093075 979135215 979138434 979219854 979317069 979270458 979121745 979056060 979094028
3444.5 979094028 979232132 979536951 979784906 979804277 979813457 979900360 979877412 979749501 979714096 979774117 979856968
3466.9 979856968 979991198 980164766 980250120 980195105 980093002 979921639 979801118 979944408 980081916 980014086
3487.3 980014086 980013430 980085254 980006516 979993820 980187714 980154574 979795992 979667246 979863048 979949415 979922116
3509.7 979922116 980075598 980388939 980651855 980806649 980728686 980340481 980047703 980120301 980351329 980584264
3530.1 980584264 980652452 980589151 980656087 980868697 980964363 980613947 979980826 979873598 980486155 980974436
3550.5 980974436 981037796 981111705 981169999 981032610 980839014 980421662 979414463 978761256 979740918 981124520
3570.9 981124520 981778026 981945097 981907606 981726766 981601119 981348455 980444372 979601741 980119824 980933845
3591.3 980933845 981016695 981042683 981400907 981595278 981664360 981720865 981338680 980785310 980744660 980779469 980724812
3613.7 980724812 980783761 980650961 980861247 981657803 982021570 981390357 980277359 980317473 981266737 981975794
3634.1 981975794 982343793 982424676 982393742 982363284 981933415 980692804 979366183 979747415 981182337 981985450
3654.5 981985450 982225716 982614815 983005524 983165622 983106494 982531130 981509566 981146336 981216371 980943561
3674.9 980943561 981185675 981915891 982609153 983103752 983017087 982229888 981431603 981663704 982494771 983046770
3695.3 983046770 983088374 982820392 982693732 983027160 983312368 982984483 982113302 981539190 981916010 982531250
3715.7 982531250 982815027 982702434 982254028 981750309 981769383 982398391 982656837 981699049 980195165 979930758
3736.1 979930758 980833054 981375754 980938673 980267584 980604351 981057942 980915546 981188774 982037723 982531965
3756.5 982531965 982653677 982946038 983188093 983056009 982828319 982621729 982641637 983112395 983523726 983477116
3776.9 983477116 983130872 982850790 982763648 982929170 983315110 983655214 983789802 983573616 983058989 982593358
3797.3 982593358 982128501 981913805 982465804 982804239 982713282 983002961 983335614 983103931 982499659 982026935
3817.7 982026935 981573999 981668711 982473671 983024240 983147860 982954383 982651949 982514262 982307732 981871009
3838.1 981871009 981645167 981936514 982609570 983154535 983162344 982528210 981393039 981126606 982066274 982746363
3858.5 982746363 982566535 981870234 981685758 981900871 981662095 981493115 981875420 982499778 982998490 982725739
3878.9 982725739 982149243 981981814 982036769 982454121 982533514 982087433 982215464 982611179 982295394 981493413
3899.2 981493413 981104374 981389523 982208729 983191609 983728468 983708858 983335316 982747734 982340157 982334316
3919.6 982334316 982359827 982358873 982634187 982916474 982725322 982414305 982628465 983125031 983398974 983272016
3940 983272016 982942641 982737482 982494116 982237339 982416987 982890427 983163059 983166993 983239293 983547390
3960.4 983547390 983709991 983626425 983531952 983329356 983168185 983289957 983503044 983533382 983402073 983347952
3980.8 983347952 983424008 983574510 983767390 983813286 983544290 983233213 983298659 983689547
3997.1 983689547
##END=$$ End of the data block
