##TITLE=AM 05 - 120 varreduras $$ Begin of the data block
##JCAMP-DX=5.00 $$ ACD/SpecManager v 10.08
##SPECTROMETER/DATA SYSTEM=Alpha
##DATE=23 Oct 2014 09:00:34
##DATA TYPE=INFRARED SPECTRUM
##DATA CLASS=XYDATA
##ORIGIN=
##OWNER=
##NPOINTS=1667
##FIRSTX=599.57470703
##LASTX=3997.16503906
##MAXX=3997.16503906
##MINX=599.57470703
##MAXY=0.98257220
##MINY=0.88459492
##XFACTOR=1.0000000000
##YFACTOR=1.000000000000000e-9
##FIRSTY=0.88459492
##DELTAX=2.03937006
##XUNITS=1/CM
##YUNITS=ARBITRARY UNITS
##XYDATA=(X++(Y..Y))
599.6 884594917 885127246 885889947 886726141 887477100 888166785 888928235 889980078 891323268 892719924
617.9 892719924 893854916 894859672 895687103 895928204 896098733 896476209 896434128 896201491 896641135 897577286
638.3 897577286 898522496 899327815 899793446 900243819 900857568 901180625 901325464 901607096 901683867 901562870
658.7 901562870 901786447 902491748 903276622 903789580 904216528 904825926 905419648 905827820 906077981 906366408
679.1 906366408 906608820 906652689 906549215 906258285 905729949 904975712 904057741 903604329 904250681 905707538
699.5 905707538 907447875 909297049 911072493 912411213 913216949 913841307 914477587 914972067 915286839
717.9 915286839 915482879 915437639 915137112 914798617 914400578 913757265 912894368 911846399 910469711 908604980
738.3 908604980 906311810 904056132 902284026 900911927 899613500 898316324 897354484 897029936 897476256
756.6 897476256 898644269 900054395 901403010 902813435 904502571 906678677 909307480 912047744
772.9 912047744 914304852 915561140 915770292 915160239 913902521 912093163 909871101 907445133 905097723
791.3 905097723 903096437 901474118 900256515 899461687 898994744 898879826 898931801 898951292 899310231 900478363
811.7 900478363 902350366 904571176 907141805 910138071 913404703 916682124 919552028 921569943
828 921569943 922799170 923520923 923716128 923375309 922738373 922187150 921958745 922217906 923111200 924488068
848.4 924488068 926116168 927924275 929800987 931499600 932833910 933734715 934328258 934994221 936082840
866.7 936082840 937646329 939405560 941107512 942744195 944205105 945241988 945821345 946065307 946041048
885.1 946041048 945880651 945689440 945428550 945103824 944708407 944178462 943489909 942771912 942163050 941472054
905.5 941472054 940534949 939502239 938571036 937954366 937714338 937623441 937552214 937527239 937527895 937559664 937582433
927.9 937582433 937589347 937718630 937953413 938139379 938293159 938483238 938663065 938777626 938810945 938791215
948.3 938791215 938696682 938416779 937990487 937577605 937205076 936834395 936390519 935803533 935239494 934790134
968.7 934790134 934271514 933554769 932634592 931548774 930387974 929248929 928048909 926588297 924861133
987.1 924861133 923053861 921168983 918980122 916496277 913936853 911316931 908505678 905482829
1003.4 905482829 902288318 899039865 895939291 893009663 890475154 889363110 890632987 893510640
1019.7 893510640 895866036 896320403 895030141 892945826 890937328 889307916 887970448 886907816
1036 886907816 886266410 886128128 886348248 886715233 887144506 887600601 887956679 888078392 887943268 887554884
1056.4 887554884 887024343 886562526 886256695 886148751 886279225 886636317 887243450 888029695 888898373 889941931
1076.8 889941931 891164124 892442405 893799126 895238101 896615803 897960365 899443984 901047230
1093.1 901047230 902631283 904230475 905991435 907894015 909902334 912053049 914304197 916610539
1109.4 916610539 919013798 921536148 924075544 926528096 928867936 931113064 933281302 935338616
1125.7 935338616 937202096 938750684 939933419 940867424 941660285 942272365 942681670 942946672 943078637
1144.1 943078637 943061531 942930341 942774057 942684889 942699194 942812145 942979574 943190515 943491161 943815529
1164.5 943815529 944005489 943983734 943710208 943132639 942289054 941244364 940218389 939623296 939429939
1182.8 939429939 939156651 938529313 937529922 936134696 934400499 932500720 930568635 928767562 927253246
1201.2 927253246 926101208 925337315 924773097 924143434 923379719 922525048 921728134 921224654 921112776
1219.5 921112776 921348870 921973407 923043013 924467325 926190853 928215325 930485785 932921350 935462356
1237.9 935462356 938037753 940466523 942511737 943971872 944783568 945058405 945037067 944979608 944916844
1256.3 944916844 944880128 945351124 946911216 949586809 952747941 955500603 957318187 958240509 958585799
1274.6 958585799 958648145 958529055 958237529 957804501 957178295 956291735 955155611 953778684 952175438
1293 952175438 950433850 948686600 947022676 945558608 944453180 943807304 943781674 944405913 945400298
1311.3 945400298 946708739 948509991 950836182 953672767 956687808 959325790 961340368 962729454
1327.6 962729454 963558495 963922083 963865221 963326156 962516963 962373495 963176906 963916421 964169085 964212418
1348 964212418 964189053 964090884 963917494 963686049 963105321 961792231 960344374 959743321 959230185 958052099
1368.4 958052099 956662357 955343664 954760790 955473661 956749141 957999706 958842933 958871424 958498776
1386.8 958498776 958651185 958752573 957726419 955991268 954691648 953800380 952613711 950387239 947412014
1405.1 947412014 945016980 943572879 943556964 945569813 948682904 952092946 956340373 959911168 961522698
1423.5 961522698 962123156 961952031 961065292 960210323 959329724 958313584 958334327 959007859 959044278 958437622
1443.9 958437622 957418263 956457615 956085563 955857038 955086112 953924239 954541326 956629097 957569838
1462.2 957569838 957282603 957043469 956821322 955476046 953299105 952328861 952649891 952851355 952330172
1480.6 952330172 951278508 949636877 946852088 943447590 941434979 940584183 938645780 935252309
1496.9 935252309 932023108 929430842 926629663 922210693 917268336 917776883 921446502 924900532
1513.2 924900532 927332699 929274380 930679262 931699395 933158994 934605062 936304390 937958062
1529.5 937958062 938768327 939820468 941462159 942203343 942664385 945095778 948827982 952911198 956287265
1547.9 956287265 959120750 962046742 964514375 965810299 966417074 969257236 972247481 973390758
1564.2 973390758 973365188 972724438 972298086 972177088 971174657 969377816 968282640 967293024 965494275
1582.6 965494275 963082612 960368752 957685828 955475271 954030752 953581512 954182088 955391288 956778705
1600.9 956778705 958243310 959600925 960675180 961683989 962831497 963800132 964541435 965869308 967416048
1619.3 967416048 968042076 968116343 968286097 968388975 968463957 968276083 967112839 965398192 965173542 965669274
1639.7 965669274 965523899 964445412 962474644 961369157 961439490 960440159 959552884 960900307 961874962
1658 961874962 961736381 961150527 960988224 960714638 959752202 959093690 959114611 958989024 958951950 958768547
1678.4 958768547 957807243 956186116 955348432 956120491 956687391 956910908 956665576 955333471 953764498
1696.8 953764498 953125894 953581572 954495907 955140173 956016719 957016945 957523823 957373857 956762433
1715.1 956762433 957026660 959153414 961248875 962619722 963759601 964541852 964889944 965174079 966420174
1733.5 966420174 969428003 971984863 973618150 974996150 976215243 977179587 977583051 977953970 979282081
1751.8 979282081 980608702 980936348 980905354 980915725 981012642 981428325 981378794 980667770 979897976 979501903
1772.2 979501903 979918122 980579793 980740786 980582595 980540454 980609655 980776012 980549932 979664922 979178667
1792.6 979178667 979613066 980010331 979878247 979604840 979950607 980564296 980717719 980531216 980469286 980682015
1813 980682015 980818033 980792880 980865657 980798542 980295718 979828477 979637563 979482889 979837000 980426967
1833.4 980426967 980590284 980581999 980512738 979990423 979243100 979194820 979709685 980219543 980559409 980634451
1853.8 980634451 980508685 980305254 980188310 980190992 980012655 979324758 978592694 978857100 979730666 980229855
1874.2 980229855 980313778 980267942 980199695 980133832 980058789 979822218 979413867 979321003 979526401 979589045 979650497
1896.6 979650497 979774177 979797006 979777515 979726493 979536593 979362428 979491472 979743242 979652643 979243040
1917 979243040 979029179 979012907 979073286 979418814 979777038 979910314 979927421 979900301 979904413 979881465 979559660
1939.5 979559660 979028583 978946090 979354978 979688883 979794323 979756951 979721844 979797006 979828477 979740918 979679167
1961.9 979679167 979533374 979256332 979235828 979509413 979737759 979859054 979875922 979770422 979664028 979631364
1982.3 979631364 979586720 979463458 979274631 979052186 979057550 979349434 979524791 979519367 979541004 979594052 979599655
2004.7 979599655 979537368 979482293 979497313 979491174 979356408 979219556 979258835 979361713 979405522 979447842 979491234
2027.2 979491234 979480386 979443014 979426682 979408562 979367375 979305208 979276419 979336023 979400158 979367256 979294062
2049.6 979294062 979307711 979370773 979380488 979346097 979312778 979262233 979168713 979156971 979271352 979358137 979364336 979317963
2074.1 979317963 979234278 979183972 979199946 979214907 979204416 979191244 979162872 979144812 979162157 979159415 979130924 979127944
2098.5 979127944 979127169 979094267 979049683 979013979 978996277 978977799 978944957 978920698 978896320 978903174 979014933 979126334
2123 979126334 979107857 979042232 978985369 978936672 978957891 979009330 979024410 979022026 979002595 978974640 979011059 979112744
2147.5 979112744 979165494 979169607 979163945 979131520 979152381 979236186 979263961 979216814 979174495 979148269 979137361 979199409
2172 979199409 979282618 979328990 979382932 979375243 979245424 979147196 979162753 979189336 979186416 979208112 979260683 979287148
2196.4 979287148 979268968 979221642 979175806 979161739 979146361 979099452 979058146 979071140 979107440 979110062 979103327 979118526
2220.9 979118526 979141593 979152560 979124665 979076087 979065955 979064643 979018450 978985369 978987515 978977203 978979945 979001403
2245.4 979001403 978971720 978906035 978880286 978911459 978959382 978970826 978980720 979021251 979001045 978922188 978886485 978873134
2269.8 978873134 978822529 978781343 978810370 978857577 978852928 978818476 978831351 978876710 978842199 978735566 978664637
2292.3 978664637 978630781 978552818 978410900 978240311 978044629 977820575 977618754 977516472 977514923 977583587
2312.7 977583587 977694809 977784276 977825522 977851450 977954626 978221893 978548110 978828728 979192019 979624033
2333.1 979624033 979916155 980047107 980094314 980035603 979666054 979035914 978647530 978615463 978848398 979384840
2353.5 979384840 979956627 980301559 980531037 980512142 980122209 979542017 978962123 978492498 978115380 977779210
2373.8 977779210 977569640 977612555 977910042 978328168 978710234 978979409 979144692 979240298 979249895 979200125
2394.2 979200125 979183853 979195893 979177952 979159534 979163229 979149580 979106188 979035378 978999078 979043186 979085565 979111493
2418.7 979111493 979159355 979163706 979089320 979038119 979062796 979131579 979215443 979224801 979183197 979206026 979225457 979150176
2443.2 979150176 979077399 979095042 979132056 979144156 979155540 979139984 979076445 979032874 979022980 978989065 978982151 979036212
2467.7 979036212 979097486 979123294 979079902 978995919 978976786 979050100 979100764 979079902 979056001 979039490 979000211
2490.1 979000211 978968918 978979886 979022801 979043961 979009986 978971064 978946567 978943169 978950620 978934526 978929996 978940189
2514.6 978940189 978940666 978931069 978915334 978885710 978872299 978903413 978902340 978871405 978883803 978911340 978946328 978998363
2539 978998363 978991210 978906810 978841066 978863955 978915393 978918970 978909910 978866935 978782773 978758216 978794396 978820145
2563.5 978820145 978850663 978918493 978962123 978951275 978902578 978836000 978846550 978921890 978931367 978899181 978884101 978845894
2588 978845894 978781939 978742123 978747427 978754461 978775203 978828371 978830457 978798509 978831887 978884399 978883326 978881001 978909433
2614.5 978909433 978929043 978926241 978901327 978855014 978831470 978855789 978891850 978900313 978862762 978797853 978763878 978777945
2639 978777945 978746057 978630126 978533268 978543699 978639483 978676498 978618622 978609741 978644848 978629410 978611529 978642881
2663.4 978642881 978664279 978606224 978538156 978533864 978518486 978489280 978525221 978587270 978584349 978506207 978410721 978354275
2687.9 978354275 978334963 978329062 978375077 978480935 978530526 978473663 978409231 978382587 978371561 978351355 978317320
2710.3 978317320 978299856 978280783 978267550 978259563 978179932 978087664 978089035 978128672 978152990 978148878 978037655 977854073
2734.8 977854073 977768481 977808714 977865338 977885604 977885067 977901995 977951527 977961302 977883518 977816820 977829993 977823377
2759.3 977823377 977741241 977697313 977725267 977721572 977663815 977605224 977547705 977491140 977479398 977456152 977369487 977318585
2783.7 977318585 977306664 977269113 977242112 977226317 977186620 977125764 977069020 977042615 977026284 976986825 976924360
2806.2 976924360 976871550 976866663 976882041 976853549 976750910 976616561 976516366 976387084 976187885 976031363
2826.6 976031363 975900888 975667119 975360036 975094318 974902749 974731088 974500835 974156380 973693728 973181009
2847 973181009 972777009 972622812 972679019 972809792 972899139 972933829 972979963 973013461 972986042 972935379 972909391
2869.4 972909391 972904921 972948730 973055959 973177612 973286271 973339438 973296285 973213494 973164499 973086357 972935796
2891.8 972935796 972804308 972693861 972563684 972444296 972331405 972212911 972100675 972015917 971978366 971904218
2912.2 971904218 971726298 971562088 971518636 971585929 971754551 971958995 972092927 972259521 972584248 972962976
2932.6 972962976 973300219 973645627 974040687 974393070 974622726 974701285 974638700 974536896 974395156 974137127
2953 974137127 973775029 973389626 973070741 972849309 972761989 972889781 973248243 973704934 974113941 974487007
2973.4 974487007 974936366 975449800 975873888 976188242 976510942 976875544 977202594 977426589 977545261 977644086
2993.8 977644086 977823138 978004634 978051901 977995217 977981150 978062868 978136063 978107810 978003681 977897346 977843046
3016.2 977843046 977821648 977741301 977563739 977399886 977412760 977509856 977546096 977604508 977675676 977690816 977709949
3038.7 977709949 977780282 977845013 977840006 977800190 977746189 977679789 977695823 977796853 977853358 977847159 977827609 977804184
3063.1 977804184 977794588 977896392 978073895 978101611 978011131 977971435 977955699 977946937 977978289 978020191 978040874
3085.6 978040874 978042126 978037953 978041053 978046775 978015542 977930129 977861345 977894068 977922142 977795184 977633536 977570772
3110 977570772 977561951 977527618 977460682 977426171 977430642 977434456 977421343 977459669 977586508 977674663 977659464 977599740
3134.5 977599740 977563560 977608562 977675855 977669835 977641523 977651834 977664173 977625906 977511764 977398992 977375567
3156.9 977375567 977363467 977290630 977216721 977143347 977017701 976888657 976851761 976903379 976894796 976714790 976467311
3179.4 976467311 976325035 976322293 976393580 976462901 976436615 976318598 976236045 976254880 976332545 976370394 976326287
3201.8 976326287 976249695 976141214 975992024 975885987 975860298 975903749 975984156 975988567 975881100 975728214 975614727
3224.2 975614727 975588322 975607514 975581944 975474715 975354850 975263536 975141525 974981248 974831641 974699259
3244.6 974699259 974653840 974701881 974686503 974593878 974551439 974501967 974375010 974316418 974314988 974222422 974096775
3267.1 974096775 974055946 974024355 973896503 973792553 973824263 973893821 973896623 973892152 973927736 973937213 973952830 974014640
3291.5 974014640 974044859 974018097 973998904 974042952 974073887 974014699 973915577 973824024 973827004 973950207 974129021
3314 974129021 974336922 974487960 974487841 974353194 974253058 974297404 974421084 974538505 974550366 974402189 974249363
3336.4 974249363 974361956 974657476 974825919 974817812 974784970 974830031 974909782 974995196 975087225 975147545 975163400
3358.8 975163400 975178421 975254416 975365579 975494266 975640237 975703120 975663722 975625753 975628734 975638866 975638568
3381.3 975638568 975695670 975848019 976006567 976055503 976000965 976007640 976125181 976235688 976297557 976432502 976699889
3403.7 976699889 976910651 976975262 976954043 976918936 976985037 977060676 976994038 976949453 977123439 977396846 977613211
3426.1 977613211 977745354 977773786 977766216 977832615 977946162 977995813 977934599 977821887 977717876 977725387 977991283
3448.6 977991283 978322685 978427649 978431582 978495061 978493035 978394270 978400946 978533864 978628874 978688478 978767872
3471 978767872 978813469 978820562 978793681 978605986 978366733 978420496 978638709 978702307 978752792 978848994 978766680
3493.4 978766680 978680849 978785098 978688002 978284955 978212237 978546739 978665173 978586376 978744745 979080141
3513.8 979080141 979292691 979355931 979248881 978877187 978578746 978653014 978906631 979221582 979437232 979382575
3534.2 979382575 979304910 979465425 979579329 979173720 978467584 978404045 979071677 979449749 979441583 979669690
3554.6 979669690 979897618 979732096 979371607 978764772 977501452 976668417 977823377 979506254 980263948
3573 980263948 980380177 980340838 980220437 980121732 979828835 978784680 977819741 978432775 979373515 979468167
3593.4 979468167 979488790 979840159 980070889 980256319 980328023 979817808 979141116 979039669 979035020 978931367
3613.7 978931367 978927910 978728652 978988707 979987383 980495393 979757428 978334129 978367448 979611099 980558217
3634.1 980558217 981101334 981260657 981178880 981060803 980487525 978860855 977052987 977542698 979433417
3652.5 979433417 980429649 980720401 981256306 981768668 981940925 981806695 981088877 979904473 979448080
3670.8 979448080 979348421 978784561 979193807 980457008 981448829 981954336 981758475 980764568 979791045 980081320
3691.2 980081320 981004000 981603444 981723547 981436551 981213093 981598973 981934726 981525302 980495632
3709.6 980495632 979790747 980273128 981052339 981318772 981061399 980506480 979991734 980078757 980803907 981022179
3730 981022179 979743481 977834046 977668226 979027450 979789019 979246736 978331268 978678346 979187906
3748.3 979187906 978927732 979350388 980400026 980784237 980766535 981188059 981601536 981459975 981164694 981003642
3768.7 981003642 981224537 981859803 982203603 981924474 981427372 981276691 981395841 981652617 982104838 982436359
3789.1 982436359 982409358 981992364 981367469 980957448 980558932 980242372 980695188 981109560 981231093 981625736
3809.5 981625736 981847405 981403053 980647326 980209827 979819059 979897022 980609596 981113493 981457770 981528759
3829.9 981528759 981153429 980737627 980344713 979849994 979690015 980136037 980995834 981722176 981690586 980610311
3850.3 980610311 978956103 978860259 980290115 981295645 981294990 980574310 980246842 980353177 979933262 979487479
3870.7 979487479 979785562 980581641 981152594 980683565 980067968 980126798 980321407 980830014 980963886 980496049
3891.1 980496049 980664730 981112897 980729640 979723096 979048967 979257584 980259061 981357098 982033551
3909.4 982033551 982318401 982064009 981240690 980657220 980776787 981002569 981063962 981257141 981413126 981146574
3929.8 981146574 980917096 981329978 981925189 982051849 981660664 981226683 981125951 981015503 980840802 981039226
3950.2 981039226 981460392 981737852 981872857 981983423 982154369 982338428 982350290 982065439 981688917 981685758
3970.6 981685758 981997311 982193232 982219040 982188225 982227862 982367814 982503057 982572198 982498705 982263088
3991 982263088 982014954 982017636 982286990
3997.1 982286990
##END=$$ End of the data block
