##TITLE=AM 04 $$ Begin of the data block
##JCAMP-DX=5.00 $$ ACD/SpecManager v 10.08
##SPECTROMETER/DATA SYSTEM=Alpha
##DATE=23 Oct 2014 09:00:34
##DATA TYPE=INFRARED SPECTRUM
##DATA CLASS=XYDATA
##ORIGIN=
##OWNER=
##NPOINTS=1667
##FIRSTX=599.57470703
##LASTX=3997.16503906
##MAXX=3997.16503906
##MINX=599.57470703
##MAXY=0.98288882
##MINY=0.92647350
##XFACTOR=1.0000000000
##YFACTOR=1.000000000000000e-9
##FIRSTY=0.92647350
##DELTAX=2.03937006
##XUNITS=1/CM
##YUNITS=ARBITRARY UNITS
##XYDATA=(X++(Y..Y))
599.6I26473498J94610K01225L84390M47273L90649M07934O32465O98507M66049M09603
620I30706203O05702K94209k28822J63734N47468J10030j33216K64108M86553K79069
640.4I33095038O0201M7981M98891P39336K20299J19507M90308K59698L8743L69548
660.8I35939550O01828M50016J65879k2828Q4698K63870L13699K00033O5208n37o4194
683.2I37997222j10686q1420j25408j81377j58608k35975j99556K08199N38766O33061
703.6I38284218O21856L91244J60456J16527J81794K02418K46346K97367J729k93374
724I40210581j57237p7725l09348m20213m13179n44965p63893j089990j138509o09219
744.4I34686303k09153k80320l17872L8564O48559J076936J158536J100302J115143
$$ plain form
599.6 926473498 926668108 926869333 927253723 927700996 928091645 928499579 929132044 929830551 930296600 930706203
620 930706203 931311905 931606114 931377292 931541026 932088494 932198524 932065308 932329416 932815969 933095038
640.4 933095038 933155239 933203220 933702111 934441447 934661746 934781253 935271561 935531259 935570002 935939550
660.8 935939550 936541378 936991394 937157273 937134445 937219143 937483013 937796712 937996745 938061953 938061416 937997222
683.2 937997222 937886536 937805116 937679708 937498331 937339723 937103748 936904192 937112391 937651157 938284218
703.6 938284218 938906074 939297318 939457774 939574301 939756095 939958513 940204859 940502226 940503955 940210581
724 940210581 940053344 939975619 939666271 939246058 938832879 938287914 937524021 936434031 935295522 934686303
744.4 934686303 934477150 934196830 933878958 933917522 934566081 935643017 936801553 937901855 939016998
762.7I39016998J054585Q73506R10401J086951J127064J081168Q92580M89473R7513
781.1I46630239j67250m19438o85692q02636p13110o13153o27458n91993m93706m80234
801.5I41035569l99351l44754m00006j05381O37471J193106J220823J238346J410544
819.8I45486367J280963J081407J133323R51469O13332N68747N11289K88904J24216
838.2I52040017M1783q0467p2360K87891O06298O18875O33896P90834Q47042O81161
858.6I56394970L96550J26898J14263L34143M41253K40207j4365M2796K27690K45869
879I58550274J25826r0957k74718j76012r6321l56675m75049k85148k40028m08411
899.4I56272781m19438k72095l02494m93645n54264k91765R2566J79470K9623Q5473
$$ plain form
762.7 939016998 940071583 940945089 941855490 942942441 944069505 945150673 946043253 946532726 946630239
781.1 946630239 946462989 946043551 945357859 944555223 943842113 943228960 942601502 942009509 941515803 941035569
801.5 941035569 940636218 940291464 939891458 939786077 940423548 941616654 942837477 944075823 945486367
819.8 945486367 946767330 947848737 948982060 949933529 950546861 951115608 951626897 951915801 952040017
838.2 952040017 952081800 952001333 951928973 952216864 952823162 953442037 954075933 954866767 955713809 956394970
858.6 956394970 956791520 956918418 957032681 957366824 957808077 958048284 958033919 958076715 958304405 958550274
879 958550274 958676100 958585143 958310425 958134413 958038092 957681417 957206368 956921220 956681192 956272781
899.4 956272781 955853343 955581248 955278754 954785109 954230845 953939080 954031646 954211116 954240739 954326212
919.8I54326212L63112M78566K89738M2021k2531L8684K3961j00493j52171j33395
940.1I55153704r8825m0889n7041n7817o6161k35319l36885j73629Q94q8930l26753
962.6I53672349m19497k72155j14977j90675l99650n54800o48260n69701m52042o63757
983I49386835q75592p07626m10200l31521n40673p95067q72969p99358p76828p85827
1003.4I42491174p67112q39531r89497j212061j286745p44819M75347J599192J687229
1021.7I40413177P90834l21865r73701r82642p42615n41269l62397k10940k8015J40191
1042.1I37180758J71065J87695K55942J23263j35124k07663k52485l27706l21925l19123
1062.5I36354697k49267o5148J18554L15845M68969M84705N41687O08921M95792M41730
$$ plain form
919.8 954326212 954689324 955167890 955457628 955499649 955477118 955515802 955539763 955439270 955287099 955153704
940.1 955153704 955054879 955013990 954956949 954899132 954832971 954597652 954260767 954087138 954088032 953999102 953672349
962.6 953672349 953252852 952980697 952865720 952675045 952275395 951720595 951072335 950502634 950050592 949386835
983 949386835 948511243 947803617 947393417 947061896 946521223 945726156 944853187 944053829 943277001 942491174
1003.4 942491174 941724062 940884531 939895034 938682973 937396228 936651409 937126756 938725948 940413177
1021.7 940413177 941204011 940882146 939908445 938925803 938183188 937641919 937279522 937068582 937040567 937180758
1042.1 937180758 937351823 937539518 937795460 937918723 937783599 937575936 937323451 936995745 936673820 936354697
1062.5 936354697 936105430 936040282 936158836 936474681 936943650 937428355 937970042 938578963 939074755 939516485
1082.9I39516485N72800N31853L15189K66731L36706L54946L75867L82364L33309M06027
1103.3I43392277O41048P93457P68065P46906Q37862R53019J055837J060188R04441
1121.7I51153100P98642P63834N79774K70009K4676o2823j23978k40981k77639k45332
1142.1I52639282k82169l93033n10275n83530o26862o08503n11170n47051o32942n31435
1162.4I47412312m31478m29273l42369j29997n2035k01583l05474n8353N32210R27746
1182.8I46921706Q75414O33120K85924j01984l90649n10156m54962l23355k26021j69158
1203.2I46539879j15395j13249j48594j56939j99258k41101k04802j36196n8115J03295
1223.6I45269525L04818M60208O94632R70185J161754J325965J466334J535833J483023
$$ plain form
1082.9 939516485 940089285 940621138 940936327 941203058 941539764 941894710 942270577 942652941 942986250 943392277
1103.3 943392277 944033325 944826782 945594847 946341753 947179615 948132634 949188471 950248659 951153100
1121.7 951153100 951951742 952715576 953295350 953565359 953590035 953527212 953403234 953162253 952884614 952639282
1142.1 952639282 952357113 951964080 951453805 950870275 950243413 949634910 949123740 948576689 947943747 947412312
1162.4 947412312 946980834 946551561 946209192 946079195 946027160 945825577 945520103 945461750 945993960 946921706
1182.8 946921706 947797120 948430240 948716164 948614180 948223531 947713375 947258413 946935058 946709037 946539879
1203.2 946539879 946424484 946311235 946162641 946005702 945806444 945565343 945360541 945224345 945166230 945269525
1223.6 945269525 945574343 946034551 946729183 947699368 948861122 950187087 951653421 953189254 954672277
1242I54672277J273513R27865N73695L20673J20282m8756j92881k74539j72079J18077
1262.4I57318127M25995N45144M91380M04001K84135J37746N4062Q285m6850m8995
1282.8I59573030j02520k90632n04851o54936p37548q08239q30650p37369n09680k04682
1303.2I54191923J07646M75884P67290Q23856R08076J138926J351178J541555J592934
1321.5I62899268J402616J077771P08342L68893J08361j29163m16458n79416k09987
1339.9I65230227L33428K76029m9472j40130j19925k07364l58344m05311m94063q23677
1360.3I63241398q71181l20435j25408l43263m47512n70059m11450P1168K54690J84477
1380.7I60662425m1604m71354o95169l48926k65836q79824j387835j235545j038849
$$ plain form
1242 954672277 955945790 956873655 957447350 957768023 957888305 957839549 957646668 957372129 957200050 957318127
1262.4 957318127 957744122 958289266 958780646 959184647 959468782 959606528 959660590 959668875 959622025 959573030
1282.8 959573030 959470510 959179878 958675027 958020091 957282543 956474304 955643654 954906285 954396605 954191923
1303.2 954191923 954299569 954775453 955542743 956366599 957274675 958413601 959764779 961306334 962899268
1321.5 962899268 964301884 965379655 966087997 966456890 966565251 966436088 966019630 965440214 965230227
1339.9 965230227 965563655 965839684 965790212 965650082 965530157 965322793 964964449 964559138 964065075 963241398
1360.3 963241398 962370217 962049782 961924374 961581111 961133599 960563540 960152090 960223258 960477948 960662425
1380.7 960662425 960620821 960149467 959454298 959105372 958839536 957959712 956571877 955336332 954297483
1399I54297483j126349j415789j405478o15120L13878J270652K133787K249539K038300
1417.4I57740903K214312J598478M22776j34528m29392o45578n12838m33862m06087
1435.7I59414184Q9645L47615J13547j56165m93168o99222n91279n57899p80702j004457
1456.1I55682099k82169M66109l6717p37190p97212o33419r71436j221597n27859J75714
1476.5I51116323J00852l86000p44820r85384j517951j875818j084924l11315p17640
1494.9I43593323j283109r99570n12123m83930j036584p98643J873791L172815K965868
1513.2I46491838K370715K016246J446843R64344R81092Q35717Q94070P89225K73287
1531.6I57063377L33428P19667L80873K76089J304448J988411K159059J740813J444995
$$ plain form
1399 954297483 953171134 951755345 950349867 949734747 950048625 951319277 953453064 955702603 957740903
1417.4 957740903 959955215 961553693 961976469 961841941 961412549 960766971 960254133 959820271 959414184
1435.7 959414184 959503829 959851444 959964991 959808826 959315658 958616436 958025157 957467258 956686556 955682099
1456.1 955682099 955399930 955866039 955829322 955092132 954294920 953661501 952690065 951468468 950940609 951116323
1476.5 951116323 951217175 950831175 950086355 949100971 947583020 945707202 944622278 944310963 943593323
1494.9 943593323 942310214 941310644 940798521 940314591 939278007 938479364 940353155 943525970 946491838
1513.2 946491838 948862553 950878799 952325642 953289986 954271078 955106795 956000865 956790090 957063377
1531.6 957063377 957396805 958116472 958497345 958773434 960077882 962066293 964225352 965966165 967411160
1549.9I67411160J569033J363695P61449M03524J292288J291156L60727l01003o73056
1568.3I73478973o77049n47648j061499j740634j332581j072049j485169j678050j468956
1586.6I62415338j035989m99964J8955N84364J076996J170397R47118P09235N71311
1605I65957761M93228N02646N94318N18084L73959N30958N30065J00255j70470j14619
1625.4I69316185r6858n8830j17719n43118q75175k80678Q5771j77920o00040j043379
1645.8I65608239o96480j10149o18041n66125O63579N35607J192j75476R0718Q9288
1666.2I64822352j90675q5295J11342R0957K97427K29418k36392n89848j92582M85241
1686.6I64741945L04222J87099P8023l82126n96404j93357L54528M42386K47836L78847
$$ plain form
1549.9 967411160 968980193 970343888 971105337 971508861 972801149 974092305 974453032 974152029 973478973
1568.3 973478973 972801924 972254276 971192777 969452143 968119562 967047513 965562344 963884294 962415338
1586.6 962415338 961379349 960879385 960898340 961482704 962559700 963730097 964677215 965386450 965957761
1605 965957761 966450989 966953635 967547953 968066037 968439996 968970954 969501019 969601274 969430804 969316185
1625.4 969316185 969219327 969160497 969042778 968499660 967624485 967343807 967429578 967251658 966651618 965608239
1645.8 965608239 964911759 964801610 964183569 963617444 964281023 964816630 964817822 964642346 964733064 964822352
1666.2 964822352 964631677 964546382 964657724 964748681 965046108 965275526 965039134 964449286 964256704 964741945
1686.6 964741945 965046167 965233266 965311289 964929163 964332759 964139402 964493930 964936316 965184152 965562999
1707I65562999N25356M50551K56777L7551M92930J442552J359105R46701O83844K79009
1727.4I72037375J7762J11103O44803J400233J126766O92427N40435N35488N99146
1745.7I77705538M96924O74606J219868J083613N20885L38316K83122K24530L06905
1764.1I82854307L4511l39449m26709l02255R2685K70366N2333j16765o8903j6391
1784.5I82033730L7491j47045m85778k87771J85788J83761q9526j87576J39296K86639
1804.9I81669009M9352j04963l6598O7711J908p3612R298k8789k57850k71380j58965
1827.3I80865121k00331M6551K66671J44184N0425p0333l17037m09663j11580J47224
1847.7I80411232K12252J94549N7638p8976j41621q0645Q464q6546l67880m21584P3910
$$ plain form
1707 965562999 966088355 966538906 966795683 966833234 967326164 968768716 970127821 971074522 971758366 972037375
1727.4 972037375 972055137 972166240 972811043 974211276 975338042 976030469 976570904 977106392 977705538
1745.7 977705538 978202462 978877068 980096936 981180549 981701434 982039750 982322872 982547402 982854307
1764.1 982854307 982888818 982549369 982122660 981820405 981913090 982183456 982235789 982119024 982050121 982033730
1784.5 982033730 982071221 981924176 981438398 981150627 981336415 981520176 981430650 981243074 981382370 981669009
1804.9 981669009 981718361 981613398 981576800 981644511 981646419 981572807 981582105 981553316 981295466 981024086 980865121
1827.3 980865121 980664790 980711341 980978012 981122196 981172621 981102288 980785251 980375588 980264008 980411232
1847.7 980411232 980623484 980818033 980875671 980796695 980655074 980574429 980582893 980496347 980128467 979706883 979780793
1870.1I79780793M03166K17140k623p6651r8825m6372l875j31845k65956j09673P1705
1892.6I79736984L5822N2512O9380j6809l7074l5703j12534r0658P4565J09911p3850
1915I79712546k28763j23560k5988n543J40965J83880J28567Q5533Q524k1637n9724
1937.4I79794800k01404k84076p9393J82390J83165M7505o0439p4148q166J192j2278
1959.9I79489148K6464p1823j88649l2962J08839N2332J6869l3081j14322o1989L9220
1982.3I79230046L1531j9669r1017j65343n3823J23262R0242J2934K8014J1742n2929
2004.7I79144990j16705j21654m589R1433J1862r1374n8174N9k622m8518p9632m8757
2029.2I78676319J8180O5088j3411j38164j47342m4346R1672J06811r477m6790M2856
$$ plain form
1870.1 979780793 980183959 980401099 980398476 980321825 980223000 980176628 980172753 980040908 979774952 979665279 979736984
1892.6 979736984 979772806 979825318 979894698 979877889 979840815 979805112 979692578 979601920 979676485 979786396 979712546
1915 979712546 979483783 979360223 979334235 979328692 979469657 979653537 979782104 979867637 979876161 979854524 979794800
1937.4 979794800 979593396 979309320 979229927 979412317 979595482 979642987 979582548 979508400 979500234 979501426 979489148
1959.9 979489148 979515612 979443789 979255140 979222178 979331017 979383349 979400218 979367137 979252815 979190826 979230046
1982.3 979230046 979261577 979241908 979150891 978985548 978931725 979054987 979145229 979158163 979186177 979197919 979144990
2004.7 979144990 979028285 978906631 978902042 978993475 979005337 978913963 978855789 978855848 978853226 978804708 978725076 978676319
2029.2 978676319 978694499 978759587 978746176 978608012 978460670 978416324 978507996 978614807 978605330 978558540 978601396
2051.6I78601396O6400J2636n9843j20938r6142p1943m3094L3796L7312m590m768m3571
2076.1I78306651r3996o5327m1783l9160j8895j7047j6391k6822r5368j78039j90437
2098.5I77523386j28030r5606p1585R000J0788p4088r6202n4896j2815O1631J49191
2121I77220774J05679k5630n1499m0829o8009k2471O795j9431K9624J11520J24574
2143.4I77371097J17063J25945O1691J7643M6134L2424N3227J11759R0182K3305Q166
2165.8I78058636L0697L6299N1796M1187m888j7702l3498n1618k7537j9193o0260n6207
2190.3I77947712L6955O7532k9266p9691l5227l1888o5983p3552r3460q4638j3292
2212.7I77545202j4186r1672j38164j35064n9902l5406j44660j68204n1499l1531j46329
$$ plain form
2051.6 978601396 978667796 978680432 978620589 978499651 978403509 978331566 978288472 978322268 978359580 978354990 978350222 978306651
2076.1 978306651 978212655 978147328 978105545 978066385 978047490 978030443 978014052 977987230 977891862 977713823 977523386
2098.5 977523386 977395356 977299750 977228165 977237165 977247953 977173865 977077663 977022767 977009952 977071583 977220774
2121 977220774 977326453 977300823 977249324 977208495 977140486 977118015 977124810 977105379 977135003 977246523 977371097
2143.4 977371097 977488160 977614105 977675796 977693439 977739573 977771997 977825224 977936983 978027165 978050470 978058636
2165.8 978058636 978089333 978125632 978177428 978218615 978213727 978196025 978162527 978110909 978083372 978064179 978003919 977947712
2190.3 977947712 977984667 978052199 978022933 977943242 977908015 977876127 977810144 977736592 977643132 977558494 977545202
2212.7 977545202 977531016 977439344 977301180 977166116 977106214 977070808 976926148 976757944 976706445 976674914 976528585
2235.2I76528585k20895k47896k83181k46644j14680k8967o3301j03652o6996l8922
2255.6I75113451q7082r1255p271J8894n2750r7871p1883k7060J00374K62081K94328
2278I75353956K71261K63095K76625L11136K73049K15233K26199K21074J67191J35422
2298.4I77714241J16050N5134j9491K206J19924J45972N9485N0605J58787J57952m0591
2320.8I78520274r9003J09792K13086K07067L24070L04282J30057P0095P3910N6386
2341.2I79910016j65403m52041l14594R179K56062M47035L33369M6372m8697j60694
2361.6I79860604k51591k92600l12626k30491k22445k77698k04920l1770J33634K28166
2382I78398263K06888J31309Q0109L2782r894k3365j0192l934m4585o1035k1040j5378
$$ plain form
2235.2 976528585 976307690 976059794 975776613 975529969 975415289 975386322 975323021 975219369 975152373 975113451
2255.6 975113451 975026369 974935114 974927843 974946737 974893987 974796116 974724233 974697173 974797547 975059628 975353956
2278 975353956 975625217 975888312 976164937 976476073 976749122 976964355 977190554 977411628 977578819 977714241
2298.4 977714241 977830291 977885425 977865934 977868140 977988064 978134036 978193521 978244126 978402913 978560865 978520274
2320.8 978520274 978421271 978531063 978744149 978951216 979275286 979579568 979709625 979779720 979853630 979910016
2341.2 979910016 979744613 979292572 978977978 978987157 979243219 979690254 980023623 980069995 980021298 979860604
2361.6 979860604 979609013 979316413 979003787 978773296 978550851 978273153 978068233 978036463 978170097 978398263
2382 978398263 978605151 978736460 978816569 978849351 978839457 978816092 978805900 978801966 978757381 978696346 978675306 978659928
2406.5I78659928k9206j9908j5378k1935j7583K0802N6684J073j25051j20699J5199
2428.9I78403926R0897J12116O3122m7624n5790n484j9610k3663M3452O1154j1921
2451.3I78610575k3603m649o0201p4983o9082q9228m589J01328J08301K5213j00672
2473.8I78418410j22905n484J12713P5519l4511n9009m9829m7028l2485J0252Q1599
2496.2I78347242O9857m1903p5340o616K980o9737m7743M6014J6392k6644Q047J3590
2520.7I78236139k0981j9789k2888j06513j11819J1206Q6427Q4698N9903R059l7908
2543.1I78167534m3571j0073K1577l457m1724p5698p1585J5259O7532N1677M7088N9724
2567.6I78184283O6578K7359q5473j32203k4200M9651j3352o2704l1471j5676m2737
$$ plain form
2406.5 978659928 978630722 978610814 978595436 978573501 978555918 978576720 978633404 978634477 978509426 978388727 978403926
2428.9 978403926 978494823 978606939 978670061 978622437 978566647 978561163 978541553 978517890 978561342 978622496 978610575
2451.3 978610575 978586972 978582323 978522122 978447139 978378057 978288829 978284240 978385568 978493869 978519082 978418410
2473.8 978418410 978295505 978290021 978402734 978478253 978443742 978384733 978334904 978287876 978255391 978265643 978347242
2496.2 978347242 978417099 978375196 978299856 978293240 978296220 978226483 978178740 978224754 978241146 978214502 978222549 978236139
2520.7 978236139 978215158 978195369 978172481 978065968 977954149 977965355 978051782 978136480 978196383 978205442 978167534
2543.1 978167534 978123963 978113890 978135467 978132010 978090286 978014588 977943003 977958262 978025794 978077471 978124559 978184283
2567.6 978184283 978250861 978278220 978192747 978060544 978036344 978085995 978072643 978009939 977978468 977962792 977920055
2590I77920055o0558l8981k146M7088O7770j4067l8981J7285l1590n2035N0187J01924
2614.5I77965951L7432o0678j00314m7684K5868P391J1444R4831L7372j17123r3579
2636.9I77760911M7505J8179j37925j68025m1426O9380N3466K8014N4002J6987n0426
2659.3I77650642k1934M7564j3291j46628r5725N6565P5817k861n2154r358K9266m8459
2683.8I77469444j29163m5300P3195L7253J788N6505K4796o4790n5194j6272k5571
2706.3I77326691o2227q5950k9564J5795j0669m8280j06454p2360P7725R6857j0550
2728.7I77091014m7028p5400j11639r418R4116K5153n9783l3438N1558J02937K0981
2751.1I77049053r2626o5267m768n5254j14381m4167M5597K4438l3617p450L0458m4048
$$ plain form
2590 977920055 977859497 977820516 977818370 977865458 977933228 977919161 977880180 977897465 977865875 977813840 977864027 977965951
2614.5 977965951 978003383 977942705 977842391 977794707 977820575 977827966 977839410 977934241 977971613 977854490 977760911
2636.9 977760911 977808416 977826595 977688670 977520645 977479219 977548599 977602065 977630079 977684081 977701068 977650642
2659.3 977650642 977628708 977676272 977662981 977516353 977420628 977477193 977553010 977550149 977497995 977488637 977517903 977469444
2683.8 977469444 977340281 977294981 977368176 977405429 977407217 977463722 977488518 977423728 977368534 977352262 977326691
2706.3 977326691 977264464 977178514 977148950 977164745 977154076 977105796 976999342 976926982 977004707 977101564 977091014
2728.7 977091014 977043986 976968586 976856947 976847529 976941645 976966798 976907015 976873577 976925135 977028072 977049053
2751.1 977049053 976956427 976891160 976886392 976831138 976716757 976672590 976718187 976742625 976709008 976701558 976732016 976687968
2775.6I76687968r5904r3937r8705l7253K7120L1650r298o3539q1837j09375j31547
2798I76025343q5890j1504o318r7215j23144m6908n246j8060q2433j44780j72615k48909
2822.5I74982321k77936j72198j40548k65181l87370l75629k70486k92420n00679p69556
2842.9I71530318j036465j187980q79467j12235N28395Q08716Q56399P56204O29187
2861.2I71893072M61400K34902O2406k9862k2531Q8573J36912O4313r239p5936k01047
2883.7I72602963k54869k43902l67403m01259k39491k34485l93748m24028l20673l04758
2904.1I69418347m91917o66440p09176q67247r31740n28753l040K77698M49836O14703
2924.5I66562271O82175P64489R46999J018941R11355P97928P59482O97077N22732
$$ plain form
2775.6 976687968 976592064 976498127 976399422 976362169 976389289 976420939 976411641 976348102 976266265 976156890 976025343
2798 976025343 975939453 975927949 975921631 975824416 975701272 975654364 975649118 975631058 975548625 975403845 975231230 974982321
2822.5 974982321 974704385 974532187 974391639 974126458 973739088 973363459 973092973 972800553 972299874 971530318
2842.9 971530318 970493853 969305873 968426406 968314171 968842566 969651282 970507681 971263885 971893072
2861.2 971893072 972354472 972589374 972651780 972621918 972599387 972687960 972824872 972889185 972879946 972804010 972602963
2883.7 972602963 972348094 972104192 971736789 971335530 971096039 970861554 970467806 970043778 969723105 969418347
2904.1 969418347 968926430 968259990 967550814 966683567 965751827 965223074 965220034 965497732 965947568 966562271
2924.5 966562271 967244446 968008935 968955934 969974875 970886230 971684158 972443640 973140717 973663449
2942.8I73663449K77639P7843m4822j14441j00136k0623R6917J99258K14637K32637
2963.2I74482358L06963L45111K55883J28925J49310K90274L70026K47597M3095L9339
2983.6I76658881J67250K08974J57893p75j00434O736M0829r3460j61529r7930L7372
3006I76823807J27375M8280l3439j8537j8000o7890j73867k17914j10865M9532P8380
3028.5I76486862L4749N4121J490o1631j371R2685J05679M9532L3796p093j01924j01030
3052.9I76585865m2498l2306j4901L8445O7532M2498P1049J28090n960j64867q7618
3075.4I76585329K3305J192l1173q941q643l9160n2988j3233R9719O9380j29223j24156
3099.8I76371408P7247N5194j21295p4387j4067q3804j24276j41263q9705j1324J0609
$$ plain form
2942.8 973663449 973941088 974018931 973974109 973859668 973759532 973738909 973835826 974035084 974249721 974482358
2963.2 974482358 974789321 975134432 975390315 975519240 975668550 975958824 976328850 976576447 976619542 976658881
2983.6 976658881 976826131 977035105 977192998 977192223 977091789 977098525 977139354 977045894 976884365 976786435 976823807
3006 976823807 976951182 976999462 976966023 976947486 976929486 976861596 976687729 976469815 976358950 976408482 976486862
3028.5 976486862 976521611 976575732 976577222 976515591 976514220 976606905 976712584 976762116 976795912 976788819 976686895 976585865
3052.9 976585865 976543367 976511061 976496160 976534605 976602137 976644635 976715684 976843774 976837814 976672947 976585329
3075.4 976585329 976608634 976609826 976578653 976569712 976561069 976521909 976468921 976455688 976555407 976624787 976495564 976371408
3099.8 976371408 976448655 976503849 976382554 976308167 976294100 976210296 976086020 975944757 975855052 975843728 975854337
3122.3I75854337J8418M6432P7665P5877N781j52349j98066K861J38163M0591n5671
3144.7I75854039n6147m9413n4001j17124j64926l4451M5776n662J3888l4452j94132
3167.1I75203395k17319n2273Q9765K3126j70946k13504o1869L8922K8967k38o3658
3189.6I74604368j39475j12235j2040K6822o318l7492l6478l8564r5606j34408l8028
3212I73980546Q6725O5446l5704o1392m3691j1920J6391l7193p5818l5047N901Q821
3236.5I73863065o6459j12295q1241j08838p0155Q0347Q0943m8399n9485o4075j36316
3258.9I73277092k5570R9659J788r5487p9334o8903k8908L2425L3438M3631J7285n5134
3283.4I73151982n1141J2279J08659J98483J22607r1493j93775o6578J11461Q4936
$$ plain form
3122.3 975854337 975872755 975919187 975996852 976072729 976078510 975926161 975728095 975730956 975869119 975909710 975854039
3144.7 975854039 975797892 975748479 975694478 975577354 975412428 975377977 975423753 975418091 975431979 975397527 975203395
3167.1 975203395 974986076 974933803 975023568 975046694 974875748 974662244 974600375 974639297 974668264 974668026 974604368
3189.6 974604368 974464893 974352658 974340618 974367440 974361122 974323630 974287152 974248588 974152982 974018574 973980546
3212 973980546 974067271 974132717 974097013 974035621 973991930 973980010 973996401 973959208 973883390 973848343 973854244 973863065
3236.5 973863065 973796606 973684311 973603070 973494232 973424077 973504424 973585367 973536968 973477483 973413408 973277092
3258.9 973277092 973251522 973351181 973352969 973257482 973178148 973109245 973080337 973112762 973146200 973189831 973207116 973151982
3283.4 973151982 973100841 973113120 973221779 973420262 973542869 973451376 973257601 973191023 973302484 973387420
3303.8I73387420l9697r655P2956J2040j2577J28210J69575P927j61290j28686O9082
3326.2I73495305J97529J40310l1829j38045j8358K24889K98976J97769R179j46926
3346.6I74228799q2314N3525J26541J45495N3465j08063j52886N9784K26378J09851
3367I74660575n9K5153O9797R7275P5817j2219k8730P7546J32620O4075l2961J2994
3391.5I75141883J67727J78099L7253l3200J05679L04878K38895k0980r7275L3021
3411.9I76055980J86443K09510R9898J51932K95937K29418J43111J25706R477o1810
3432.2I77445602O5506J83284J84298Q4817r1314j22726J1861K06411K62857J7166
3452.6I78247762j26362O1154J73629P212p9155K8193P6234R1612R3520M4763j6510
$$ plain form
3303.8 973387420 973347723 973338068 973411024 973423064 973410487 973538697 973708272 973716199 973554909 973426223 973495305
3326.2 973495305 973692834 973833144 973801315 973663270 973644912 973869801 974168777 974366546 974375725 974228799
3346.6 974228799 974146485 974200010 974326551 974472046 974525511 974417448 974264562 974324346 974550724 974660575
3367 974660575 974660516 974685669 974755466 974852741 974928558 974916339 974887609 974965155 975097775 975161850 975128889 975141883
3391.5 975141883 975309610 975487709 975524962 975491762 975597441 975902319 976141214 976120234 976022959 976055980
3411.9 976055980 976242423 976451933 976551831 976703763 976999700 977229118 977372229 977497935 977507412 977445602
3432.2 977445602 977511108 977694392 977878690 977963507 977872193 977749467 977761328 977967739 978230596 978247762
3452.6 978247762 978121400 978182554 978356183 978363395 978284240 978312433 978388667 978480279 978573799 978618562 978602052
3475.1I78602052r4354j26124l8504J69634K45929K4080m0710J00077o4254j49727
3495.5I78628099J61409K13027o1392o7890N0783k0981j9371Q3685J47342J36793L4332
3517.9I79285836p5578j06991K8968J61409J20700J03772P5876k5749K7716J63973
3538.3I79759932L4630l30448m12405N5969M08471J86801l2366Q4400R8050p2718j00135
3560.7I79680181j59502n02944l70205N36919P95781M22240J62840k39j85788j66297
3581.1I80212986j05798m24206m28021L36349M63128J5497j669J93656J85370K18571
3601.5I80665863N6564l63469l60548R477q7798j74761J04607P4923J01804L85344
3621.9I80412006K45512k24948n79178l8207N87225M58479J90079P15p2479J4484n8532
$$ plain form
3475.1 978602052 978507698 978381574 978343070 978512704 978758633 978782713 978742003 978842080 978777826 978628099
3495.5 978628099 978789508 979002535 978941143 978873253 978924036 978903055 978883684 978967369 979114711 979251504 979285836
3517.9 979285836 979210258 979103267 979132235 979293644 979414344 979518116 979593992 979568243 979595959 979759932
3538.3 979759932 979794562 979464114 979051709 979107678 979516149 979702950 979670584 979754984 979853034 979780316 979680181
3560.7 979680181 979520679 979017735 978647530 979184449 979980230 980402470 980565310 980565071 980379283 980212986
3581.1 980212986 980107188 979682982 979254961 979591310 980054438 980069935 980068266 980261922 980447292 980665863
3601.5 980665863 980722427 980358958 979998410 980007887 979920089 979745328 979849935 979924858 980026662 980412006
3621.9 980412006 980657518 980432570 979853392 979815185 980402410 980860889 981050968 981051683 980979204 980993688 980935156
3644.3I80935156m61697o35207J83702Q12649M32730N9605J72734K02894J41800R7513
3664.7I81941879k25902n81980k07126N0605k83361O7234N62608N06878K15233j95921
3685.1I81850147n67257m97580J57476N02288L39806N5969r0778p629K23219J49608
3705.5I82115269k03431m69029l88443J14321L72112K59221P1048j32560k71440k7180
3725.9I81439888L40581K3067p58171r04321l2187O40571M15147l14176o03736K24352
3746.3I80471015L23892k58565J76847O91950L60012P2777J73867J13785j24871j27793
3766.7I81872916j22726p093L07858K43128m8042k14398k05934r3221J85251L72529
3787.1I82290268J68979m4227k47478m89533l69310q5831K16842N93066L35395o2406
$$ plain form
3644.3 980935156 980473459 979838252 980021954 980834603 981267333 981326938 981499672 981702566 981844366 981941879
3664.7 981941879 981715977 981133997 980926871 980977476 980694115 980761349 981323957 981830835 982046068 981850147
3685.1 981850147 981282890 980785310 980942786 981445074 981784880 981840849 981750071 981742442 981965661 982115269
3705.5 982115269 981911838 981442809 981054366 981168687 981540799 981800020 981871068 981738508 981467068 981439888
3725.9 981439888 981780469 981803536 981045365 980141044 980108857 980749428 981164575 980850399 980246663 980471015
3746.3 980471015 980794907 980536342 980713189 981405139 981765151 981837928 982011795 982125580 982000709 981872916
3766.7 981872916 981750190 981743097 982050955 982294083 982246041 982031643 981825709 981732488 981917739 982290268
3787.1 982290268 982459247 982415020 982167542 981678009 981308699 981222868 981439710 982032776 982368171 982305765
3807.5I82305765k622p6533l62217m36783k98977l00467J36256O25491L58522Q6844
3827.9I82035279j14083l66509k74956j18733k53677j53899K64883N13971M12762Q3387
3848.3I82028425l83318q25524l70503N25237N90443J16110l05414j4782K37286k48611
3868.7I81349349m15027J25587M80056K93076k48671k96593K7359O0916J93834R477
3889.1I81579363l47376o0737J56641j72615l51190r1911K26736L95060L59356J79291
3909.4I81872618K0087j82986l73066j62422J77800J71900L1173L3617J29700K1815
3929.8I81740236n5909J75476K00331l1232j73569k12789j48058m3153P0750J47403
3950.2I81669486J09970J07229J41501J98961L26037J76609j84894l02553k27750n6803
$$ plain form
3807.5 982305765 982303143 982226610 981864393 981427610 981128633 980828166 980964422 981589913 981948435 982035279
3827.9 982035279 981921196 981554687 981279731 981160998 980907321 980753422 981018305 981532276 981945038 982028425
3848.3 982028425 981645107 980819583 980449080 980974317 981564760 981680870 981375456 981360674 981597960 981349349
3868.7 981349349 980934322 981059909 981539965 981833041 981584370 981287777 981315136 981376052 981569886 981579363
3889.1 981579363 981231987 981171250 981327891 981155276 980804086 980712175 980938911 981333971 981693327 981872618
3909.4 981872618 981892705 981709719 981336653 981174231 981352031 981523931 981555104 981588721 981718421 981740236
3929.8 981740236 981684327 981859803 982060134 982028902 981855333 981642544 981494486 981451333 981522083 981669486
3950.2 981669486 981779456 981886685 982028186 982227147 982553184 982729793 982544899 982242346 982014596 981957793
3970.6I81957793J04904J22965k5094j70767l6240J29819R5725J00136J32263K4795
3991I82436299q8811m8220l5822
3997.1I82263446
$$ plain form
3970.6 981957793 982062697 982185662 982160568 981989801 981953561 982083380 982179105 982279241 982411504 982436299
3991 982436299 982347488 982299268 982263446
3997.1 982263446
##END=$$ End of the data block
