##TITLE=AM 04 $$ Begin of the data block
##JCAMP-DX=5.00 $$ ACD/SpecManager v 10.08
##SPECTROMETER/DATA SYSTEM=Alpha
##DATE=23 Oct 2014 09:00:34
##DATA TYPE=INFRARED SPECTRUM
##DATA CLASS=XYDATA
##ORIGIN=
##OWNER=
##NPOINTS=1667
##FIRSTX=599.57470703
##LASTX=3997.16503906
##MAXX=3997.16503906
##MINX=599.57470703
##MAXY=0.99104291
##MINY=0.95657223
##XFACTOR=1.0000000000
##YFACTOR=1.000000000000000e-9
##FIRSTY=0.95657223
##DELTAX=2.03937006
##XUNITS=1/CM
##YUNITS=ARBITRARY UNITS
##XYDATA=(X++(Y..Y))
599.6I56572235K93195L21448J62720J16349Q3446q166K73943N23448M78566L89636
620I59206820K80499K31266P0274m8816j2935l43918n21601J71781M82500m650K1041
642.4I59532261L17573M17948N71132K95877J25349M84586K24113m18722l36528J30057
662.8I61343646K22981K88010O38246L88801L2425j49846k49147m0949J67013K6047
683.2I62667227q7738J3888N7697n0306k67685l09110n6028J77741K90096L54469M20511
705.6I63210762M43398K10286p0751m5419J0431N4419J82152m947l33011k75076J7643
728.1I63399887J00553j1861l2723j3530j82152m93109m16756P6830K15411j9311r6500
750.5I62526739K1219J00136J06752J62243J83464K66730M31776M30942L81470M24862
$$ y = [956572235, 956865430, 957186878, 957349598, 957465947, 957549393, 957541227, 957815170, 958338618, 958817184, 959206820, 959487319, 959718585, 959788859, 959740043, 959727108, 959383190, 958861589, 959033370, 959515870, 959511220, 959532261, 959849834, 960267782, 960838914, 961134791, 961260140, 961744726, 961968839, 961550117, 961213589, 961343646, 961566627, 961854637, 962492883, 962881684, 962914109, 962764263, 962515116, 962474167, 962641180, 962667227, 962579489, 962593377, 962651074, 962600768, 962333083, 962023973, 961967945, 962145686, 962435782, 962790251, 963210762, 963654160, 963864446, 963793695, 963748276, 963758707, 963813126, 963995278, 963990331, 963657320, 963382244, 963399887, 963500440, 963488579, 963455856, 963442326, 963260174, 962767065, 962350309, 962427139, 962642550, 962623239, 962526739, 962547958, 962648094, 962754846, 962917089, 963100553, 963367283, 963799059, 964230001, 964611471, 965036333]
770.9I65036333N75184P23780O35087M00245J75417n1916k63750m10915n06103m51147
791.3I65862215j61589M4704P3612R6023K4438j93537l88443m18067j88649L69847
811.7I65120554P24673N86808N12302O31869P27236P47502O05225L69311L17395L24785
832.1I70667660R3282j38224n3227O8903j35004k54333J1742K90155L53396K94090
852.5I71198440K77161K80500K73227K39432J25051J00851K48372L37482J28627n9426
872.8I73149717O0797J77204K08318J02520k31206m32372l24071k23457k56896k29836
893.2I72000718j64866j73450l01480l83020k64763k35022k79426j89781j29223l219
913.6I69876468K18034J53661k7299N9902K07544J69098m7803k69174k73049j43469
$$ y = [965036333, 965611517, 966335297, 966970384, 967370629, 967546046, 967494130, 967230380, 966819465, 966313362, 965862215, 965700626, 965745330, 965818942, 965914965, 965939403, 965745866, 965357423, 964939356, 964750707, 965120554, 965845227, 966432035, 966944337, 967576206, 968303442, 969050944, 969656169, 970025480, 970342875, 970667660, 970760942, 970622718, 970569491, 970638394, 970503390, 970249057, 970260799, 970550954, 970904350, 971198440, 971475601, 971756101, 972029328, 972268760, 972393811, 972494662, 972743034, 973080516, 973209143, 973149717, 973210514, 973387718, 973596036, 973698556, 973467350, 973034978, 972710907, 972487450, 972230554, 972000718, 971835852, 971662402, 971360922, 970977902, 970713139, 970478117, 970198691, 970008910, 969879687, 969876468, 970094502, 970248163, 970220864, 970280766, 970488310, 970657408, 970609605, 970340431, 970067382, 969923913]
934I69923913j28805k18213k50160j34707o616l0041l3498j2099q3447p9691m0412
956.5I68906224l0637M4286R060j62840j73330n5552o3479k05636l28064l54647k76268
978.9I67309117j63555j87754k92063l23832k51949j14739j29461l31104n02706n45978
999.3I64465976m73142l94165l96312m74631n98610o32346n09381k37346L03388Q36074
1019.7I61889505Q17657K86341l89994p59542n94019l61145l55124l36767j22249J19269
1040.1I60193932N8532j99437l17335k26677j07109p2778m2200l4809l2544J13785
1060.5I59333360K79665L31879L88265M96804O52790O79255N12123M29451M70043N26726
1080.9I64100361N84900N47469K86281k8491j15871n9009l8803r596K0981l4273M3869
$$ y = [969923913, 969795108, 969576895, 969326735, 969192028, 969185412, 969155371, 969121873, 969109774, 969026327, 968946636, 968906224, 968875587, 968919873, 968928933, 968766093, 968592763, 968537211, 968473732, 968268096, 967940032, 967585385, 967309117, 967145562, 966957808, 966665745, 966341913, 966089964, 965975225, 965845764, 965514660, 965011954, 964465976, 963992834, 963598669, 963202357, 962727726, 962129116, 961496770, 960987389, 960750043, 961053431, 961889505, 962707162, 962993503, 962603509, 961843967, 961249948, 960888803, 960533679, 960196912, 960074663, 960193932, 960252464, 960053027, 959735692, 959509015, 959401906, 959329128, 959286928, 959252119, 959219575, 959333360, 959613025, 959944904, 960333169, 960829973, 961482763, 962162018, 962674141, 963103592, 963573635, 964100361, 964685261, 965232730, 965519011, 965490520, 965374649, 965315640, 965276837, 965267241, 965288222, 965253949, 965297818]
1103.3I65297818K93017M08053L99053M47929N03302N11169O06775O50287N11050M18484
1123.7I70046937L17932J48236N1082j26541l11613l05355k96891j95741K9266L5941
1144.1I69393253j79827m19438m96268m19796m18305n15103n81980n40137m32134l62813
1164.5I65027452l37184k55227j28031j23441k17617k08675j0193L29495N64694N28336
1184.9I65169609L43978O6519k56062m25279m16577l76403k60770n3406R9540J64270
1205.3I64055419J04070k8789j01090j47819j40310N901K29597M17352N04494M86076
1225.7I65384901M35948M76479N74410O36995O81937P24494P53642P34388N87702L29912
1246.1I71320808J85907K00689J61707J00076J03593J38939K45094M46379N96583N57482
$$ y = [965297818, 965590835, 965998888, 966397941, 966845870, 967349172, 967860341, 968467116, 969117403, 969628453, 970046937, 970364869, 970513105, 970564187, 970437646, 970126033, 969820678, 969523787, 969328046, 969357312, 969393253, 969213426, 968793988, 968297720, 967877924, 967459619, 966944516, 966362536, 965822399, 965390265, 965027452, 964690268, 964435041, 964307010, 964183569, 963965952, 963757277, 963747084, 964076579, 964641273, 965169609, 965513587, 965580106, 965324044, 964898765, 964482188, 964105785, 963845015, 963791609, 963891149, 964055419, 964159489, 964130700, 964029610, 963881791, 963741481, 963747382, 963976979, 964394331, 964898825, 965384901, 965820849, 966297328, 966871738, 967508733, 968190670, 968915164, 969668806, 970403194, 970990896, 971320808, 971506715, 971707404, 971869111, 971969187, 972072780, 972211719, 972456813, 972903192, 973499775, 974057257]
1266.5I74057257M97401M89175L71278K57313L07143L14354J86086J29104J23977j668
1286.8I76731420k32935l91186m57585n30004n60522n80609n90742m43279j49370J46449
1307.2I72941637M07815O11126P08104P68900Q87215J040101J070797R38893P72953
1325.6I80147541N71608K84553M9889m8936j76608l04103j41144J42992J54256k503
1346I80677545j07407j36257j63793k00868j96755k37048m41253m84049j02401J02937
1366.4I78710651K0981p5459k88069l60907r3102J15454O8724j55449l49819l40224
1386.8I77252781j31011j64210o31273r97782p81596m98056n40316p68244q42512n93722
1407.2I71304059k88188K75015J041472J367510J465320J825095J396060M48763l6299
$$ y = [974057257, 974554658, 975043833, 975415111, 975672424, 975979567, 976293921, 976480007, 976609111, 976733088, 976731420, 976498485, 976107299, 975649714, 975119710, 974559188, 973978579, 973387837, 972944558, 972795188, 972941637, 973349452, 973960578, 974668682, 975437582, 976324797, 977364898, 978435695, 979374588, 980147541, 980719149, 981003702, 981053591, 981004655, 980828047, 980523944, 980382800, 980525792, 980680048, 980677545, 980570138, 980433881, 980270088, 980069220, 979872465, 979635417, 979194164, 978710115, 978607714, 978710651, 978731632, 978656173, 978368104, 978007197, 977914095, 978029549, 978098273, 977942824, 977593005, 977252781, 977121770, 976957560, 976326287, 975328505, 974546909, 974048853, 973508537, 972740293, 971897781, 971304059, 971015871, 971290886, 972332358, 973699868, 975165188, 976990283, 978386343, 978835106, 978798807]
1425.5I78798807l47793n61297m82977l73006k13504J42873J83821l3975k02477l26693
1445.9I76583779l85344l99113m56452n68867n61535O2287M18186M2200k91527k54571
1466.3I74189043k26557m43697l51668K31922M38809J83046j46866l31223n63204r87172
1486.7I71992433j164436p38800m65214p80642j106680j000404p98345p86721j094759
1505.1I64056432q41498Q92520J601100J422941J130999R52124N18799J68741K75492
1523.4I70177650L23952M45127M36604K52962M63665O15895L46720N35846J246094
1541.8I74844515J445830J506746J330435J227081J215875R92954O14762M56810J056671
1560.1I84691679Q46684J74582j90019l36170l24965l00705n68569q97646p35402o42836
$$ y = [978798807, 978451014, 977889717, 977406740, 977033734, 976820230, 976963103, 977146924, 977112949, 976910472, 976583779, 976198435, 975799322, 975342870, 974774003, 974212468, 974274755, 974692941, 974735141, 974443614, 974189043, 973962486, 973518789, 973167121, 973399043, 973837852, 974020898, 973874032, 973542809, 972979605, 971992433, 970827997, 970089197, 969623983, 968843341, 967736661, 966736257, 965937912, 965151191, 964056432, 963214934, 964107454, 965708554, 967131495, 968262494, 969214618, 969733417, 969902158, 970177650, 970501602, 970946729, 971383333, 971636295, 972099960, 972715855, 973062575, 973598421, 974844515, 976290345, 977797091, 979127526, 980354607, 981570482, 982563436, 983178198, 983635008, 984691679, 985538363, 985712945, 985522926, 985186756, 984861791, 984561086, 983992517, 983094871, 982359469, 981716633]
1580.5I81716633r15587j167655j206160r97483o53685l21328O0141N02169P72953
1598.9I77789998Q19504P39456N28097L63528L93987M62115L74973L14831N79358O07192
1619.3I82973039K28346n6208j32620r7513l2306j04189l56078m68433j60098q3327
1639.7I81710613k45691m10914o15180m44233j52767m28617l78251K33293J19746j70112
1660.1I79217887k47598j37985j99675l06606j93537j61409k08020p7725j53839m12107
1680.5I77119386n56290k93255J22309J3649q5115k11120n32806o28411k42532J80543
1700.9I74886358J20044O3180L02017L14951J18137r0719k14040J38998O58810N63562
1721.2I76861298L12746J11460p9631k3008K44558P32541J257420R82701P46787P84934
$$ y = [981716633, 980801046, 979633391, 978427231, 977429748, 976776063, 976454735, 976514876, 977017045, 977789998, 978609502, 979348958, 979877055, 980240583, 980634570, 981096685, 981471658, 981786489, 982365847, 982973039, 983201385, 983145177, 983012557, 982915044, 982882738, 982778549, 982422471, 981954038, 981793940, 981710613, 981464922, 981054008, 980438828, 979994595, 979841828, 979413211, 979034960, 979268253, 979387999, 979217887, 978970289, 978832304, 978632629, 978326023, 978132486, 977971077, 977763057, 977685332, 977531493, 977119386, 976563096, 976269841, 976392150, 976405799, 976320684, 976109564, 975576758, 974948347, 974705815, 974886358, 975006402, 975069582, 975371599, 975686550, 975804687, 975713968, 975499928, 975638926, 976297736, 976861298, 977174044, 977285504, 977205873, 977182865, 977427423, 978159964, 979417384, 980400085, 981146872, 981931806]
1741.6I81931806Q74400R80973R46641R94921J202464J028240O66260N33521L77715
1760I89536941K70188L13580J06454j68562k06351r6679O3777J23620O556o7830k7060
1782.4I89854634l2664k9623j03831k34485j24395J02162J20044j9550j07348M7982
1802.8I89472926J35958L8147L099M5300N0783l9876q6128n543m0472j96695j66715
1825.3I89210784n4180l1233J09792J24633J8179O9201M471k64466k97368J1325J49429
1847.7I89050567J30832J06931P451j08123j29461l4452L7432k9206k68400l72112
1868.1I88391459M2856L44753J98185L2545n2214j05381m3750L8743n7638j99735r7751
1890.5I88492072O8664P9692O1869K6465j2815m3631q0943n2512N1022J48058Q7321
$$ y = [981931806, 982806206, 983787179, 984733820, 985728741, 986931205, 987959445, 988625705, 989159226, 989536941, 989807129, 990120709, 990227163, 990058601, 989852250, 989755571, 989819348, 989942968, 989949524, 989881694, 989854634, 989821970, 989792347, 989688516, 989454031, 989329636, 989431798, 989551842, 989532292, 989424944, 989472926, 989608884, 989647031, 989650130, 989695430, 989746213, 989706337, 989620209, 989614666, 989574194, 989377499, 989210784, 989156604, 989125371, 989235163, 989359796, 989377975, 989447176, 989451647, 989187181, 988889813, 988901138, 989050567, 989181399, 989288330, 989295781, 989187658, 989058197, 989023745, 989061177, 989031971, 988763571, 988391459, 988434315, 988779068, 988977253, 989009798, 988957584, 988852203, 988808453, 988847196, 988789558, 988589823, 988492072, 988560736, 988640428, 988702297, 988728762, 988715947, 988672316, 988591373, 988538861, 988589883, 988737941, 988825262]
1913I88825262j06991k08556j23382k3723N5790J54674J27495L4988j0610M053M9412
1935.4I88778412k7179j99557k19047j9729J29163J01030K5630k1457J1682O6280p629
1957.8I88617599j02282o3359l5227l0398O1870Q5473K3245L160l4214q3684o4254
1980.3I88377929M112K7717J0132m470m2856k3901K6405k0325l2545M0651M2379j6809
2004.7I88388419o3896m5061M9949O0856l6299p2539k8074l9160l7372M4644L9756
2027.2I88261223m0472k7954L2901L398m6671l9279m947L5584L3498j6868m3333K0742
2051.6I88167822N8294l0637q3685J192L7789o4730r1911J2637P5876L0399m1724p8618
2076.1I87992704o3658J5915O9022M4942L636l4750n5909k3067m113m5478n7101l5227
$$ y = [988825262, 988718271, 988509715, 988386333, 988362610, 988418400, 988573074, 988700569, 988735557, 988724947, 988729000, 988778412, 988751233, 988551676, 988332629, 988312900, 988442063, 988543093, 988568723, 988547266, 988558948, 988625228, 988617599, 988515317, 988451958, 988416731, 988386333, 988448203, 988533676, 988556921, 988560081, 988525867, 988442183, 988377929, 988382041, 988409758, 988419890, 988415420, 988372564, 988348663, 988375068, 988354743, 988322198, 988362849, 988405228, 988388419, 988324523, 988279462, 988329411, 988390267, 988353968, 988281429, 988253355, 988214195, 988176823, 988221467, 988261223, 988220751, 988192797, 988225698, 988229096, 988182425, 988143146, 988138199, 988173783, 988207281, 988190413, 988147080, 988167822, 988226116, 988195479, 988111794, 988112986, 988150775, 988086045, 987994134, 988006771, 988082647, 988113046, 988071322, 987992704, 987929046, 987944961, 988013983, 988058925, 988062561, 988027811, 987971902, 987948835, 987944722, 987899244, 987842143, 987806916]
2100.6I87806916j7524k1040o0320p4446l7432q344k2233j7583O5803J64330J38521
2123I87916648o258q6844r2864p6175j2398L6598N6624N1439J1146k8431P987R9003
2147.5I87876475O5625k7717m8220l8683J4067Q3088O4671m0948r1672m8458J4364
2169.9I87822592Q1182Q4996J5676n186K9803R775l4034k9207p4267j42694q0883K7537
2194.4I87705290P4506Q0288p570j07467o8069p510m3750p7486m4346q881K4617L6836
2218.9I87556458j9134l3319P213k6822o8307j4544J2100p7665j34647q7321p0989
2241.3I87043023q6605p3970j09851j46747r1970j1325L2723J4723K384K1159l8981
2263.7I86554563r7334o9857l3140k0623J430O0856R6143J00970J14799J45673J54794
$$ y = [987806916, 987789392, 987768352, 987708032, 987633586, 987596154, 987587810, 987565577, 987547994, 987613797, 987778127, 987916648, 987910390, 987823546, 987730682, 987654507, 987642109, 987678707, 987735331, 987786770, 987797916, 987769485, 987777472, 987876475, 987942100, 987914383, 987866163, 987827480, 987841547, 987924635, 987989306, 987948358, 987856686, 987808228, 987822592, 987903774, 987988770, 988004446, 987999260, 988029063, 988038838, 988004804, 987975597, 987901330, 987758636, 987677753, 987705290, 987779796, 987860084, 987852514, 987745047, 987676978, 987669468, 987625718, 987548232, 987503886, 987495005, 987519622, 987556458, 987537324, 987504005, 987511218, 987484396, 987416089, 987401545, 987413645, 987335980, 987201333, 987114012, 987043023, 986956418, 986882448, 986772597, 986625850, 986533880, 986522555, 986555278, 986570001, 986572385, 986593544, 986554563, 986457229, 986387372, 986354232, 986333609, 986335039, 986395895, 986492038, 986593008, 986707807, 986853480, 987008274]
2286.2I87008274J05142M9472L8803Q0704P9036L7551L4571M053n2035j2219J32740
2308.6I87506092J70946R1612O9976O2644N424o2942k8908J33097J97649J22487J63854
2331I88431931K13444O0498o5624K1159J83464J2934l34680l10183j52945J9013L11494
2353.5I88390505L59297J53959J40786J17302o0856k57790l87788l49820k29001j49608
2373.8I87726986q6307N8353J98185J94252J04785J1027k861N4061J8358p9155p4267
2396.3I88123417k4736l5584k2054L6419L4094j6392l5226k8431m0353m6611O438P1406
2420.7I88022387O3300J2994l696n364R716M4047k443m6134K9623N8413l5823p3135
2445.2I88073885K7240Q6605K5392j4663k1219n4479l1233K7419L278j6034K8670M7266
$$ y = [987008274, 987113416, 987162888, 987201691, 987282395, 987361431, 987398982, 987433553, 987437606, 987385571, 987373352, 987506092, 987677038, 987768650, 987838626, 987901270, 987906694, 987843752, 987814844, 987947941, 988145590, 988268077, 988431931, 988645375, 988705873, 988640249, 988661408, 988844872, 988857806, 988523126, 988212943, 988059998, 988079011, 988390505, 988749802, 988903761, 989044547, 989161849, 989100993, 988843203, 988455415, 988105595, 987876594, 987726986, 987640679, 987699032, 987897217, 988091469, 988196254, 988207281, 988204420, 988258481, 988276839, 988197684, 988123417, 988098681, 988063097, 988041043, 988077462, 988111556, 988095164, 988059938, 988031507, 987991154, 987944543, 987950981, 988022387, 988085687, 988098681, 988094985, 988089621, 988099337, 988143384, 988140941, 988094807, 988124430, 988182843, 988147020, 988073885, 988101125, 988187730, 988213122, 988198459, 988177240, 988122761, 988091528, 988118947, 988122225, 988106191, 988134861, 988182127]
2469.7I88182127J2577o6817r8586j6689M4942N305m2260m5598l3855j3352N901R060
2494.2I87942755L7968M4167k3424n7996l0457K0027K4438k8611j5795o318l4273K6822
2518.6I87899303R0242K3007l6657J1504j7106r2805k4855P5758Q0287N9843K8729
2541.1I88097250o4969j17302k1278P6890K9921l5763n1021o6698m7445R060N9485
2563.5I87868130P7129Q7857R0241P630j08719r6977K8789P4625J6332k0862n8770
2585.9I87965405j19627j06453q405O3956O7532K7895n6624p4923M3869J15752M7624
2608.4I87966001l8683m2081K0265L1352k8133n2154l6001J5258J08958J05560l7909
2630.8I88012433j17004m1544O3836O6519o9678j81079j42038j7046J05798R9420K3425
$$ y = [988182127, 988194704, 988127887, 988029301, 988012612, 988057554, 988062859, 988020599, 987975001, 987941146, 987927794, 987933695, 987942755, 987980723, 988024890, 988001466, 987943470, 987913013, 987933040, 987957478, 987928867, 987913072, 987906754, 987872481, 987899303, 987989545, 988012552, 987975895, 987987399, 987970293, 987877488, 987852633, 987928391, 988008678, 988068521, 988097250, 988032281, 987914979, 987893701, 987970591, 988000512, 987964749, 987913728, 987847030, 987799585, 987808645, 987868130, 987945259, 988033116, 988123357, 988130987, 988022268, 987925291, 987954080, 988028705, 988045037, 988024175, 987965405, 987845778, 987739325, 987730920, 987794876, 987862408, 987890303, 987833679, 987758756, 987802625, 987918377, 987966001, 987927318, 987885237, 987905502, 987936854, 987908721, 987856567, 987820566, 987835824, 987944782, 988050342, 988012433, 987895429, 987853885, 987917721, 987984240, 987914562, 987733483, 987591445, 987574399, 987680197, 987779617, 987803042]
2653.2I87803042L7193K3663l4213j9729p15j2934m9472o4314n960J6153j1981k742
2677.7I87677991k4736q4757p5698m2200j5617K1518M2021P2777N1379l2603l8505
2700.1I87551570J371P331l993l3140k2531J2159k8014n8293l2783k6822j3947m77
2724.6I87352431K086O6698Q7380p2241j95026j05679L4094R9599R6857M7386j4305
2747I87399280m0293j0311j0610n6147m3035m3809j14501o5148N6029N6266j2755p6532
2771.5I87038434p6473j6332j0133m0233n543N1498K5154p2003j13785m1366Q762m0889
2796I86707091p1108m9412m8638n7339p9811r0241N066J06156M4167j08123j44303
2818.4I86213505j28627k25603k49624j39952j54793k79487k70128k12014k87234l49045
$$ y = [987803042, 987840235, 987863898, 987829685, 987809956, 987809241, 987796307, 987746835, 987682521, 987676561, 987692714, 987680733, 987677991, 987653255, 987568498, 987492800, 987450600, 987434983, 987456501, 987498522, 987571299, 987622678, 987590075, 987551570, 987552941, 987560272, 987556279, 987523139, 987500608, 987512767, 987484753, 987426460, 987393677, 987366855, 987352908, 987352431, 987354517, 987421215, 987508595, 987436354, 987241328, 987135649, 987169743, 987269342, 987366199, 987413585, 987399280, 987358987, 987348676, 987338066, 987281919, 987238884, 987195075, 987080574, 987015426, 987071455, 987127721, 987114966, 987038434, 986961961, 986945629, 986935496, 986895263, 986889720, 986941218, 986966372, 986894369, 986780584, 986739218, 986747980, 986707091, 986635983, 986586571, 986537933, 986480594, 986400783, 986310542, 986315608, 986421764, 986465931, 986357808, 986213505, 986084878, 985859275, 985609651, 985469699, 985314906, 985035419, 984765291, 984553277, 984266043, 983916998]
2838.8I83916998m19378o46174r32992j106381q39770j49727M21405O28590O04094
2857.2I81476665N45561N74112N38826L29435J15156K5511K2947M1485P7188J30594
2877.6I83877480R7752o1036j85251j88172k04920l20793l62575k02119j15991k17616
2897.9I82116759k55466k85923l95477m69744n31614o29842p70152q04365m69863L2067
2918.3I77536380K58088K82824L50357M46140N57065O63102O89387O07074N57959O11424
2938.7I82559800N54085L83615K46168J42455P6711N3048M8816M3094R9957K11418
2959.1I84419167K74181K98083L57449M20153L29256J91153K37166L54827L05533J31488
2979.5I87318456M2141P1406J24574J41203Q7619l9995p8439L8981Q5175q047r2208
$$ y = [983916998, 983497620, 982851446, 981918454, 980812073, 979972303, 979822576, 980243981, 980872571, 981476665, 982022226, 982596338, 983135164, 983464599, 983579755, 983605266, 983628213, 983669698, 983746886, 983877480, 983975232, 983914196, 983728945, 983540773, 983335853, 983015060, 982652485, 982450366, 982334375, 982116759, 981861293, 981575370, 981179893, 980710149, 980178535, 979548693, 978778541, 977974176, 977504313, 977536380, 977794468, 978077292, 978427649, 978873789, 979430854, 980093956, 980783343, 981390417, 981948376, 982559800, 983113885, 983497500, 983743668, 983886123, 983962834, 984015882, 984064698, 984107792, 984207749, 984419167, 984693348, 984991431, 985348880, 985769033, 986098289, 986289442, 986526608, 986881435, 987186968, 987318456, 987360597, 987432003, 987556577, 987697780, 987785399, 987745404, 987666965, 987705946, 987791121, 987783074, 987690866]
3002I87690866m2737R1196J27852R119j26779r2030L8505N3167o8903j94788r9778
3024.4I87385690J20104P2062m4823K0921m291l8982O3121J13726L8207o8963j3649
3046.8I87643123M0114q0407l1173J29699N6625r7573q2672M1426O0260O199K5511
3069.2I87711132r239p1049K7537R2984K3782j0669o0082j36435j13249J2756J07705
3091.7I87575173R0659J1146o8247o6400K5392N9902m0650j05560p9632o4909j9252
3114.1I87317622L7849K8669j4781k7776j4186L3676Q3685M1128l7909r1195o6042
3136.5I87290740P9513J30415J0252m7565k4378m0472q0347j20997j13964l4273K2113
3159I87071037j4066n2572o9856j07587j07646j4364J12772O9022j00613j55687q1063
$$ y = [987690866, 987648129, 987739325, 987867177, 987876296, 987749517, 987657487, 987695992, 987749159, 987680256, 987485468, 987385690, 987505794, 987577856, 987533033, 987553954, 987549663, 987510681, 987573802, 987687528, 987725735, 987656772, 987643123, 987683237, 987602830, 987571657, 987701356, 987757981, 987660408, 987577736, 987619162, 987679422, 987685621, 987711132, 987701893, 987630844, 987658381, 987751365, 987775147, 987764478, 987704396, 987567961, 987454712, 987467468, 987575173, 987665832, 987676978, 987608731, 987542331, 987567723, 987627625, 987586975, 987481415, 987401783, 987336874, 987317622, 987355471, 987384140, 987369359, 987341583, 987327397, 987361073, 987444758, 987485886, 987447977, 987356782, 987290740, 987370253, 987500668, 987510920, 987463355, 987438977, 987398505, 987318158, 987197161, 987083197, 987048924, 987071037, 987056971, 987004399, 986934543, 986826956, 986719310, 986704946, 986817718, 986886740, 986786127, 986630440, 986549377]
3181.4I86549377k801j7285l3617l1472n4717L0995J44422Q5711o8426j19030l9280
3203.8I86443877J3173j7405p6890p0631P4208J60038L7611j51635k64525k00868J0014
3226.3I85956967J61528Q9765o6876p2420o855k5510r5070j63853j85370k9624J36614
3248.7I85699296N5850n3227m0055j3709K9326M2915p1168j97530j20222P1048O7592
3271.1I85470116r9540j45614k9146K3782l4750J0729O2466k5332m1247N1558P2659
3293.6I85315681K38k5988K4081m292r2328j00195m2498O7174J08838M0949N5909P7248
3318I85424817k7001q2374M1485J23501P4148L8028k0504j55151j69218J24932L42667
3340.5I85715330K29358K0027j19149j07825j3709J07586J84894R1731p7664o3599
$$ y = [986549377, 986546576, 986529291, 986495674, 986464202, 986409485, 986440480, 986584902, 986670613, 986602187, 986483157, 986443877, 986457050, 986439645, 986362755, 986292124, 986366332, 986526370, 986563981, 986412346, 986147821, 985946953, 985956967, 986118495, 986208260, 986141384, 986068964, 986062109, 986036599, 985941529, 985777676, 985592306, 985562682, 985699296, 985755146, 985701919, 985661864, 985648155, 985677481, 985720396, 985649228, 985451698, 985331476, 985402524, 985470116, 985370576, 985224962, 985195816, 985219598, 985184848, 985195577, 985258043, 985232711, 985191464, 985243022, 985315681, 985315919, 985289931, 985314012, 985309720, 985217392, 985117197, 985074699, 985141873, 985250711, 985291660, 985347569, 985424817, 985397816, 985315442, 985356927, 985480428, 985554576, 985592604, 985572100, 985416949, 985247731, 985372663, 985715330, 985944688, 985964715, 985845566, 985737741, 985724032, 985831618, 986016512, 986108243, 986030579, 985966980]
3360.9I85966980J02818J63556J20103N7280J4305J6630J8060J8239K5272k324M8756
3383.3I86549675J63436J20640K0027J6213N6863N7161J1324K9385J40489K23159J72556
3405.7I87560928M2319p7128n6446P9870L0399r0540N9665K27570J48416Q1718J26063
3428.2I88132834J35124J00017N0843j0491o4134q2315m8160K3186R9600J18374O5804
3450.6I88520682K4497N9665R8765N8710k8193p2718L58R6023J42038J08123m1902
3473I88966048r7335j9431m4882q8751M6312J63973P1347m3869o8486o9440N1558J91093
3497.5I89058137n603k93493j73748R2030J13010J7286j431Q2910J06335M6074k2411
3519.9I89019096j36197o2406J64628J11819m4823o2704j3709N4717O3479L8027l9160
$$ y = [985966980, 986069798, 986233354, 986353457, 986410737, 986425042, 986441672, 986459732, 986477971, 986503243, 986500919, 986549675, 986713111, 986833751, 986853778, 986869991, 986926854, 986984015, 986995339, 987024724, 987165213, 987388372, 987560928, 987603247, 987526119, 987469673, 987549543, 987579942, 987489402, 987549067, 987776637, 987925053, 988006771, 988132834, 988267958, 988367975, 988418818, 988408327, 988344193, 988261878, 988213718, 988236904, 988336504, 988454878, 988520682, 988545179, 988604844, 988703609, 988762319, 988734126, 988661408, 988661766, 988757789, 988899827, 989007950, 988966048, 988868713, 988849282, 988804400, 988715649, 988761961, 988925934, 988997281, 988953412, 988884926, 988815486, 988867044, 989058137, 989052534, 988759041, 988585293, 988677323, 988790333, 988807619, 988806188, 988889098, 988995433, 989041507, 989019096, 988882899, 988820493, 988985121, 989096940, 989052117, 988989413, 988975704, 989030421, 989093900, 989131927, 989092767]
3542.4I89092767j35422L5048K78294J09017q0764K9087K8670j15931j69456k35677
3562.8I88835633m09842j20759O56724O93858J70112j15991r5427n9486p450l6657
3583.2I89510715l06249l44395J33097K59101J7405Q3029K12967Q0884P570l8088k07364
3605.6I89408672k23279N3525J62899P3970m8042k45273m4346L62456K30909j68443
3626I89563048k94984O6817K66731K04921J02103m0532p4446M7624O3837k30789m54724
3648.4I89219606L7372M39525K06291J312J44362K37882N3048k00510l27944k56300
3668.8I89554644R0718J74284n1916k7358J51992K21729J67131N961j87695k16663
3689.2I89882827L338J18255J04845N4300J2219J15275J73807o7532k35498k24531
$$ y = [989092767, 988957345, 988992393, 989270687, 989379704, 989298940, 989328027, 989356697, 989240766, 989071310, 988835633, 988425791, 988305032, 988961756, 989655614, 989825726, 989709735, 989614308, 989554822, 989547372, 989510715, 989204466, 988860071, 988993168, 989252269, 989269674, 989352703, 989565670, 989646554, 989654124, 989616036, 989408672, 989185393, 989238918, 989401817, 989475787, 989427745, 989182472, 989138126, 989500582, 989731491, 989563048, 989268064, 989334881, 989601612, 989806533, 989908636, 989868104, 989793658, 989841282, 989905119, 989674330, 989219606, 989256978, 989696503, 989902794, 989904106, 990048468, 990286350, 990339398, 990138888, 989810944, 989554644, 989645362, 989819646, 989767730, 989740372, 989892364, 990114093, 990281224, 990287185, 990099490, 989882827, 989886165, 990004420, 990109265, 990163565, 990175784, 990291059, 990464866, 990397334, 990161836, 989937305]
3709.6I89937305k10285l0696J30057J85967J96576j2160k53021p4804K27332L4690
3730I90130961m80294n89967L4749M86315K48432k15292l35574R7811K42710R3162
3750.4I89713013J92285L32892J84178J8120J2755k8670j11699p7068k7836M0174J91092
3772.8I90439236J69575m470j34766j89126r3996J86443L11136J29819p1942k13564
3793.2I90528345k11835o1869o1214k6226K07185J68324j431l4153l2306r3281j55687
3815.6I90225852j84715k85447p0631K99394K80976J41621p8023k22385k7835J25348
3836I90204155p5221j27554P6235K11715K58446M2260m05669m87089J12712K85149
3856.4I90095139J02758n1379r8884K04980K54691k97487m31121M0830K60949J94669
$$ y = [989937305, 989727020, 989696324, 989826381, 990012348, 990208924, 990196764, 989943743, 989868939, 990096271, 990130961, 989650667, 989060700, 989095449, 989581764, 989830196, 989614904, 989279330, 989377141, 989619851, 989713013, 989905298, 990238190, 990422368, 990440488, 990453243, 990424573, 990312874, 990235806, 990207970, 990248144, 990439236, 990608811, 990604341, 990469575, 990280449, 990186453, 990372896, 990684032, 990813851, 990741909, 990528345, 990316510, 990254641, 990193427, 990167201, 990374386, 990542710, 990541279, 990507126, 990474820, 990381539, 990225852, 990041137, 989755690, 989685059, 989984453, 990265429, 990407050, 990329027, 990106642, 990078807, 990204155, 990128934, 990001380, 990077615, 990289330, 990547776, 990590036, 990184367, 989697278, 989809990, 990095139, 990197897, 990146518, 990047634, 990252614, 990507305, 990209818, 989778697, 989819527, 990080476, 990275145]
3876.8I90275145L57k3842p689o2287J22011K6703k60234p8976J25885n3108k85804
3899.2I89778161j85013J86503L77655K97487J64211P2717p3790k15769j74403r7215
3919.6I90130544q9765m5299N1975N9068l5226P987J49607J24812j9311j07527q3804
3942.1I90143061n5433n6266m3393k6524P6533J74582J28925J69277K80976O7651k27809
3964.5I90631580l47852l20375P3075M24147L30805O3003q7977L2306J74820O9380
3984.9I91042912o6578p8798k25246m11510j29581L19362
3997.1I90450561
$$ y = [990275145, 990275502, 990251660, 990243971, 990181684, 990303695, 990330398, 990070164, 989991188, 990117073, 990063965, 989778161, 989593148, 989779651, 990157306, 990454793, 990619004, 990691721, 990617931, 990402162, 990227759, 990130544, 990040779, 989995480, 990047455, 990106523, 990071297, 990079284, 990228891, 990353703, 990334392, 990226865, 990143061, 990087628, 990031362, 989987969, 989961445, 990037978, 990212560, 990341485, 990510762, 990791738, 990859389, 990631580, 990283728, 989963353, 990036428, 990460575, 990791380, 990854383, 990766406, 990798712, 990973532, 991042912, 990976334, 990897536, 990672290, 990260780, 990131199, 990450561]
##END=$$ End of the data block
