##TITLE=AM 04 $$ Begin of the data block
##JCAMP-DX=5.00 $$ ACD/SpecManager v 10.08
##SPECTROMETER/DATA SYSTEM=Alpha
##DATE=23 Oct 2014 09:00:34
##DATA TYPE=INFRARED SPECTRUM
##DATA CLASS=XYDATA
##ORIGIN=
##OWNER=
##NPOINTS=1667
##FIRSTX=599.57470703
##LASTX=3997.16503906
##MAXX=3997.16503906
##MINX=599.57470703
##MAXY=0.99227917
##MINY=0.94499373
##XFACTOR=1.0000000000
##YFACTOR=1.000000000000000e-9
##FIRSTY=0.94499373
##DELTAX=2.03937006
##XUNITS=1/CM
##YUNITS=ARBITRARY UNITS
##XYDATA=(X++(Y..Y))
$$ plain form
599.6 944993734 945530951 946295321 946282744 945843041 946027458 946974814 948175371 949124634 949668050 949808061
620 949808061 949804246 949795783 949433804 948886156 948681772 948689640 948707163 949089110 949708819 950198352 950603426
642.4 950603426 950827837 951080978 951531947 951823473 952100694 952448547 952361166 952032149 952025890 952302754
662.8 952302754 952477813 952400446 952314675 952302396 952263057 952179193 952153087 952406228 952707529 952747047 952684462
685.2 952684462 952725410 952867687 953010619 953061998 953128278 953309000 953559756 953907311 954296410 954557836
705.6 954557836 954650879 954559624 954219222 953744709 953351259 953250170 953520298 953796744 953835249 953910887
726 953910887 954113007 954228401 954343915 954686403 955052912 955143809 955067933 955106437 955169618 954955518 954663575
748.4 954663575 954649389 954887450 955175459 955386698 955590010 955788791 956010938 956312001 956555665 956808746
$$ packed form
599.6I44993734N37217P64370j2577m39703J84417R47356J200557R49263N43416J40011
620I49808061l815q463l61979n47648k04384P868J7523L81947O19709M89533M05074
642.4I50603426K24411K53141M50969K91526K77221L47853q7381l29017o259K76864
662.8I52302754J75059p7367q5771j2279l9339q3864k6106K53141L01301L9518o2585
685.2I52684462M0948J42277J42932N1379O6280J80722K50756L47555L89099K61426
705.6I54557836R3043r1255l40402m74513l93450j01089K70128K76446L8505P5638
726I53910887K02120J15394J15514L42488L66509R0897p5876L8504O3181k14100k91943
748.4I54663575j4186K38061K88009K11239K03312J98781K22147L01063K43664K53081
$$ plain form
768.8 956808746 957333028 958135545 958935797 959443212 959707081 960108578 960746825 961223602 961286604 961192250
789.2 961192250 961229324 961365998 961446941 961410940 961388052 961442471 961362898 961032510 960602701 960333347 960382938
811.7 960382938 960602522 960905790 961414337 962057829 962612331 963027239 963429391 963796675 964121103 964351177
832.1 964351177 964238405 963953197 963807046 963556170 962838769 961840212 961122870 961103678 961840212 962967336
852.5 962967336 963848293 964079797 963846028 963452220 962939918 962502599 962581635 963349581 964381158 965047002
872.8 965047002 965273917 965525508 965943038 966161489 966001868 965597808 965033889 964358032 963673711 963035285
893.2 963035285 962309361 961363077 960329652 959414065 958619893 957872868 957456172 957751513 958409548 958898127
913.6 958898127 959349394 959871054 960375249 961137712 962219417 963111043 963464737 963405192 963144422 962715030
$$ packed form
768.8I56808746N24282Q02517Q00252N07415K63869M01497O38247M76777O3002r4354
789.2I61192250L7074J36674Q0943l6001k2888N4419p9573l30388m29809k69354M9591
811.7I60382938K19584L03268N08547O43492N54502M14908M02152L67284L24428K30074
832.1I64351177j12772k85208j46151k50876p17401r98557p17342j9192P36534J127124
852.5I62967336Q80957K31504k33769l93808n12302m37319P9036P67946J031577O65844
872.8I65047002K26915K51591M17530K18451j59621m04060n63919o75857o84321o38426
893.2I63035285p25924r46284j033425r15587p94172p47025m16696K95341O58035M88579
913.6I58898127M51267N21660N04195P62463J081705Q91626L53694n9545k60770m29392
$$ plain form
934 962715030 962070405 961314082 960715950 960596204 961004078 961515665 961776376 961827397 961701453 961388052
954.4 961388052 961083889 960861981 960559249 960107446 959526718 958869576 958204925 957534552 956720650 955651641
974.8 955651641 954425991 953218400 952152073 951258123 950493217 950064659 950489700 951745987 953015804
993.2 953015804 953562200 953316987 952661991 951972365 951563358 951540172 951517701 951040387 950178564 949393988
1013.6 949393988 949101925 949590802 950886607 952248812 952522755 951403141 949627161 948073685 947061837
1031.9 947061837 946439922 946203530 946555316 947283566 947744668 947607160 947132230 946714997 946477175 946429014
1052.3 946429014 946557879 946716905 946821809 946873367 946859896 946952343 947413445 948324084 949617445 951025784
1072.7 951025784 952301443 953461587 954403639 954983413 955527902 956400871 957297266 957723379 957716525 957580805
$$ packed form
934I62715030o44625p56323n98132j19746M07874N11587K60711N1021j25944l13401
954.4I61388052l04163k21908l02732m51803n80728o57142o64651o70373q13902j069009
974.8I55651641j225650j207591j066327q93950p64906m28558M25041J256287J269817
993.2I53015804N46396k45213o54996o89626m09007k3186k2471m77314q61823p84576
1013.6I49393988k92063M88877J295805J362205K73943j119614j775980j553476j011848
1031.9I47061837o21915k36392L51786P28250M61102j37508m74930m17233k37822m8161
1052.3I46429014J28865J59026J04904N1558j3471R2447M61102R10639J293361J408339
1072.7I51025784J275659J160144R42052N79774N44489Q72969Q96395M26113o854j35720
$$ plain form
1093.1 957580805 957487881 957541466 957656980 957636476 957633793 957808137 957907677 957788646 957622051 957674325 958194375
1115.5 958194375 959122360 960150838 961078107 961803675 962228000 962361872 962293267 961990476 961489022 961012721
1135.9 961012721 960700572 960619569 960879207 961396635 961880386 962081254 961919904 961461663 960789025 959995091
1156.3 959995091 959117174 958275437 957703233 957271695 956702590 956153333 955905139 955887675 955851614 955785751
1176.7 955785751 956139505 957292259 958888233 960315108 961263955 961580932 961284041 960699975 960109532
1195.1 960109532 959571123 959210098 959073901 959051609 959051609 958984256 958942533 958992720 958982468 958963096 959097385
1217.5 959097385 959372580 959710538 960063994 960345626 960484087 960621119 960881889 961249530 961704791 962263346
1237.9 962263346 963010967 963865519 964498281 964722097 964723945 964804411 965026319 965316057 965721011 966369450
$$ packed form
1093.1I57580805r2924N3585J15514k0504k683J74344R9540j19031j66595N2274N20050
1115.5I58194375R27985J028478R27269P25568M24325J33872o8605l02791n01454m76301
1135.9I61012721l12149q1003K59638N17428M83751K00868j61350m58241o72638p93934
1156.3I59995091q77917q41737n72204m31538n69105n49257k48194j7464l6061o5863
1176.7I55785751L53754J152754J595974J426875R48847L16977k96891n84066n90443
1195.1I60109532n38409l61025j36197k2292%o7353m1723N0187j0252j9372J34289
1217.5I59097385K75195L37958L53456K81632J38461J37032K60770L67641M55261N58555
1237.9I62263346P47621Q54552O32762K23816J848Q0466K21908K89738M04954O48439
$$ plain form
1258.3 966369450 967173100 967842877 968266606 968604445 969114482 969737470 970166743 970468044 970857501 971297026
1278.7 971297026 971714616 972070336 972344220 972565234 972648323 972453177 971962631 971289039 970550358 969741583
1299.1 969741583 968998253 968610823 968644083 968967676 969422817 969882011 970339358 970874727 971554458 972369373
1319.5 972369373 973241091 974172831 975146234 975906372 976225793 976165295 975870192 975394428 974875569 974635422
1339.9 974635422 974763274 974985003 975138009 975293040 975470483 975528777 975399613 975079894 974608183 974134505
1360.3 974134505 973854601 973793030 973735869 973633587 973493576 973275602 973065734 972923756 972879648 972894192
1380.7 972894192 972766042 972515583 972432077 972541809 972500086 972188175 971738100 971285403 970779419 970116019
1401.1 970116019 969299197 968406260 967584252 967022717 967013955 967706740 968868315 970413148 972352207
$$ packed form
1258.3I66369450Q03650O69777M23729L37839N10037O22988M29273L01301L89457M39525
1278.7I71297026M17590L55720K73884K21014Q3089j95146m90546o73592p38681q08775
1299.1I69741583p43330l87430L3260L23593M55141M59194M57347N35369O79731Q14915
1319.5I72369373Q71718R31740R73403P60138L19421o0498k95103m75764n18859k40147
1339.9I74635422J27852K21729J53006J55031J77443N8294j29164l19719m71711m73678
1360.3I74134505k79904o1571n7161j02282j40011k17974k09868j41978m4108J4544
1380.7I72894192j28150k50459q3506J09732m1723l11911m50075m52697n05984o63400
1401.1I70116019q16822q92937q22008n61535q762O92785J161575J544833J939059
$$ plain form
1419.4 972352207 973668933 974074244 974084377 973843217 973466814 973077655 972718298 972642183 972874403 972953975
1439.8 972953975 972943962 972955525 972889543 972725213 972351789 971754849 971107364 970719576 970844328 970896840
1460.2 970896840 970701158 970461965 970140994 969599366 969118237 969541848 970948100 972246706 973126292
1478.6 973126292 973608196 973667502 973300993 972568512 971643150 970859647 970157266 969241083 968182027 967199624
1499 967199624 966237128 965223670 964190185 963669121 964226902 965226889 966251969 967091680 967718244
1517.3 967718244 968001425 968089998 968275905 968496680 968827605 969127595 969354808 969874799 970440865 970862687
1537.7 970862687 971945047 973634124 974993706 976298273 977486432 978613675 979704142 980623066
1554 980623066 981276035 981977761 983105004 983701944 983784676 983634472 983447671 983320355 983025670 982527256
$$ packed form
1419.4I72352207J316726M05311J0133k41160l76403l89159l59357p6115K32220P9572
1439.8I72953975j0013J1563o5982j64330l73424n96940o47485l87788J24752N2512
1460.2I70896840j95682k39193l20971n41628m81129M23611J406252J298606Q79586
1478.6I73126292M81904N9306l66509p32481r25362p83503p02381r16183j059056r82403
1499I67199624r62496j013458j033485n21064N57781R99987J025080Q39711O26564
1517.3I67718244K83181Q8573J85907K20775L30925K99990K27213N19991N66066M21822
1537.7I70862687J082360J689077J359582J304567J188159J127243J090467R18924
1554I80623066O52969P01726J127243N96940Q2732j50204j86801j27316k94685m98414
$$ plain form
1574.4 982527256 981942534 981346309 980616868 979594350 978378117 977133095 976046860 975302339 974894285
1592.8 974894285 974872530 975303173 976014137 976807415 977521777 978033304 978416204 978758693 979013145 979170322
1613.2 979170322 979481459 980152786 980657756 980848670 980983973 980951309 980731189 980539799 980302036 979912639
1633.6 979912639 979614079 979558229 979402125 979078948 978698969 978388309 978165627 977807879 977422297 977432489
1653.9 977432489 977460504 977249265 976994157 976801395 976639152 976402521 976188958 976064384 975828648 975562990
1674.3 975562990 975427389 975219071 974818468 974344194 974076092 973922431 973555982 973097861 972612739 972034931
1694.7 972034931 971539378 971462429 971842885 972093463 972230077 972535014 972775280 972862124 972839236 972714841
1715.1 972714841 972674549 972691059 972466648 971863210 970614433 968913317 967791438 967827797 968657315 969840467
$$ packed form
1574.4I82527256n84722n96225p29441j022518j216233j245022j086235p44521m08054
1592.8I74894285k1755M30643P10964P93278P14362N11527L82900L42489K54452J57177
1613.2I79170322L11137O71327N04970J90914J35303l2664k20120j91390k37763l89397
1633.6I79912639k98560n5850j56104l23177l79979l10660k22682l57748l85582J0192
1653.9I77432489K8015k11239k55108j92762j62243k36631k13563j24574k35736k65658
1674.3I75562990j35601k08318m00603m74274k68102j53661l66449m58121m85122n77808
1694.7I72034931m95553p6949L80456K50578J36614L04937K40266Q6844k2888j24395
1715.1I72714841m0292J6510k24411o03438j248777j701116j121879L6359Q29518J183152
$$ plain form
1735.5 969840467 971003115 972249329 973355711 974499822 976221740 978271663 980415881 982543468
1751.8 982543468 984200895 985512674 986745775 987712264 988422692 988907218 989106953 989080012 989004612
1770.2 989004612 989047348 989154994 989221275 989187956 989081085 988999248 989018321 989088058 989024580 988860130 988828480
1792.6 988828480 988875628 988844275 988772631 988762081 988848865 988916993 988970935 989080846 989162445 989083946 988876224
1815.1 988876224 988715589 988706529 988739550 988696218 988654077 988627493 988629460 988772511 988869309 988850713 988877237
1837.5 988877237 988870203 988712847 988559306 988523722 988501966 988518417 988613367 988670707 988593876 988449693 988379657
1859.9 988379657 988417923 988444626 988327146 988162100 988189161 988323092 988393366 988410890 988385975 988324523 988286257
1882.4 988286257 988274276 988209844 988123119 988103688 988082111 988040388 988067091 988113523 988117874 988136172 988154829 988119960
$$ packed form
1735.5I69840467J162648J246214J106382J144111J721918K049923K144218K127587
1751.8I82543468J657427J311779J233101R66489P10428M84526J99735k6941p5400
1770.2I89004612M2736J07646O6281l3319j06871q1837J9073O9737o3478j64450l1650
1792.6I88828480M7148l1353p1644j0550Q6784O8128N3942J09911Q1599p8499k07722
1815.1I88876224j60635r060L3021m3332m2141k6584J967J43051R6798j8596K6524
1837.5I88877237p034j57356j53541l5584k1756J6451R4950N7340p6831j44183p0036
1859.9I88379657L8266K6703j17480j65046K7061J33931P0274J7524k4915o1452l8266
1882.4I88286257j1981o4432q6725j9431k1577m1723K6703M6432M351J8298J8657l4869
$$ plain form
1906.8 988119960 988078892 988098204 988167346 988175690 988068342 987960696 987907827 987881362 987920463 987991571 988055646
1929.3 988055646 988129020 988153815 988162518 988199413 988135695 987997115 987944603 987969100 988018453 988069296 988047540
1951.7 988047540 987982333 988007128 988066971 988070309 988073647 988045692 987960994 987933636 987996340 988078296 988118827 988074243
1976.2 988074243 987997055 987964690 987955511 987925470 987891197 987860739 987814069 987805963 987849414 987866700 987864792 987875283
2000.6 987875283 987860143 987814903 987771571 987744689 987763822 987800419 987778783 987740874 987757742 987778544 987780392 987762690
2025.1 987762690 987713516 987681687 987695634 987749755 987789690 987767637 987739384 987764180 987808585 987798750 987708032 987618327
2049.6 987618327 987655461 987777114 987833023 987800658 987772048 987741470 987665713 987657785 987763286 987845182 987836719
2072 987836719 987786055 987699687 987626672 987611055 987603128 987623394 987676024 987699866 987658203 987572908 987515748 987508059
$$ packed form
1906.8I88119960m1068J9312O9142Q344j07348j07646n2869k6465L9101P1108O4075
1929.3I88055646P3374K4795Q703L6895o3718j38580n2512K4497M9353N0843k1756
1951.7I88047540o5207K4795N9843L338Tk7955q4698k7358O2704Q1956M0531m4584
1976.2I88074243p7188l2365r179l0041l4273l0458m6670q106M3451J7286j908J0491
2000.6I87875283j5140m5240m3332k6882J9133L6597k1636l7909J6868K0802J848j7702
2025.1I87762690m9174l1829J3947N4121L9935k2053k8253K4796M4405r835r0718q9705
2049.6I87618327L7134J21653N5909l2365k8610l0578p5757p928J05501Q1896q463
2072I87836719n0664q6368p3015j5617p927K0266N2630K3842m1663q5295n7160p689
$$ plain form
2096.5 987508059 987524867 987524986 987482667 987434089 987451434 987501621 987465382 987389028 987374604 987365901 987371504 987489402
2121 987489402 987601340 987562418 987475216 987398148 987293303 987242937 987283766 987342715 987401366 987451911 987466335
2143.4 987466335 987487316 987526119 987520933 987523794 987561464 987589896 987664700 987752497 987746954 987693369 987679839 987653553
2167.9 987653553 987582386 987589896 987672806 987723291 987732232 987680137 987594128 987572432 987617075 987649202 987628698 987612724
2192.3 987612724 987672925 987772405 987793624 987707794 987630188 987637103 987672210 987645090 987550914 987484276 987471879 987460196
2216.8 987460196 987438679 987414718 987423480 987471163 987482965 987429023 987366021 987356305 987362683 987316430 987209976 987086475
2241.3 987086475 987051487 987119734 987117112 986987472 986889839 986872792 986859918 986820340 986759543 986683071 986626029
2263.7 986626029 986609340 986575961 986517310 986480772 986475050 986520231 986642778 986803949 986918986 986976624 987037778
$$ packed form
2096.5I87508059J6808J19m2319m8578J7345N0187l6239p6354j4424q703N603J17898
2121I87489402J11938l8922q7202p7068j04845n0366M0829N8949N8651N0545J4424
2143.4I87466335K0981L8803n186K861L7670K8432P4804Q7797n543n3585j3530k6286
2167.9I87653553p1167P510Q2910N0485Q941n2095q6009k1696M4643L2127k0504j5974
2192.3I87612724O0201R9480K1219q5830p7606O915L5107k7120r4176o6638j2397j1683
2216.8I87460196k1517k3961Q762M7683J1802n3942o3002r716O378m6253j06454j23501
2241.3I87086475l4988O8247k622j29640r7633j7047j2874l9578o0797p6472n7042
2263.7I86626029j6689l3379n8651l6538n722M5181J22547J61171J15037N7638O1154
$$ plain form
2286.2 987037778 987097979 987129688 987189353 987306237 987420380 987498701 987530589 987473428 987383366 987373173 987426400
2308.6 987426400 987499952 987640560 987812161 987862349 987768352 987668216 987654209 987718463 987853229 988019645
2329 988019645 988159418 988234639 988256752 988281369 988324404 988421142 988532484 988515377 988317966 988030374 987855077
2351.4 987855077 988004029 988262594 988378942 988562226 988608837 988353968 988102078 987963676 987872958 987805605
2371.8 987805605 987780929 987767756 987785220 987905920 988064110 988129735 988128543 988144219 988159060 988115549 988035619
2394.2 988035619 988033533 988071680 988001883 987871826 987815261 987861454 987916350 987886131 987874508 987949014 988006294
2416.7 988006294 988053739 988112628 988083482 987976313 987928331 987940371 987951517 987987816 988023996 988061488 988144577
2439.1 988144577 988170564 988054633 987948120 987960696 988004506 988034487 988088608 988104284 987985432 987867236 987838626
$$ packed form
2286.2I87037778O0201L1709N9665J16884J14143P8321L1888n7161r0062j0193N3227
2308.6I87426400P3552J40608J71601N0188r3997j00136j4007O4254J34766J66416
2329I88019645J39773P5221K2113K4617M3035R6738J11342j7107j97411k87592j75297
2351.4I87855077J48952K58565J16348J83284M6611k54869k51890j38402r0718o7353
2371.8I87805605k4676j3173J7464J20700J58190O5625j192J5676J4841m3511p9930
2394.2I88035619k086L8147o9797j30057n6565M6193N4896l0219j1623P4506N7280
2416.7I88006294M7445N8889k9146j07169m7982J2040J1146L6299L6180L7492Q3089
2439.1I88144577K5987j15931j06513J2576M3810K9981N4121J5676j18852j18196k8610
$$ plain form
2461.5 987838626 987797916 987807214 987906814 987984240 988003910 987978041 987923503 987912774 987988651 988056719 988029361 987951100
2486 987951100 987893105 987868726 987870157 987883151 987895906 987910151 987896085 987861276 987836421 987834215 987848103 987844169
2510.5 987844169 987851381 987870336 987848938 987796068 987766981 987743318 987740934 987829387 987876654 987798333 987731636 987743795
2535 987743795 987794936 987842560 987844408 987798274 987755179 987786889 987870336 987885416 987840950 987788916 987743139 987716079
2559.4 987716079 987677693 987653136 987688839 987770438 987859607 987934589 987955391 987920821 987931907 987985730 987970352
2581.9 987970352 987929583 987886906 987758040 987653255 987693548 987759650 987748086 987751722 987794340 987793446 987807214 987869501
2606.3 987869501 987870693 987810314 987795830 987821341 987813294 987770617 987719834 987655997 987636805 987688303 987738550 987732351
2630.8 987732351 987656236 987571478 987519503 987506032 987523317 987511635 987423778 987339973 987357259 987346470 987263680
$$ packed form
2461.5I87838626m0710R298R9600P7426J9670k5869n4538j0729P5877O8068k7358p8261
2486I87951100n7995k4379J431J2994J2755J4245j4066l4809k4855k206J3888l934
2510.5I87844169P212J8955k1398n2870k9087k3663k384Q8453M7267p8321o6697J2159
2535I87743795N1141M7624J848m6134m3095L1710Q3447J5080m4466n2034m5777k7060
2559.4I87716079l8386k4557L5703Q1599Q9169P4982K0802l4570J1086N3823j5378
2581.9I87970352m0769m2677j28866j04785M0293O6102j1564L636M2618q94J3768O2287
2606.3I87869501J192o0379j4484K5511q047m2677n0783o3837j9192N1498N0247o199
2630.8I87732351p6115q4758n1975j3471J7285j1682q7857q3805J7286j0789q2790
$$ plain form
2653.2 987263680 987289846 987418592 987476766 987442017 987415135 987397134 987331450 987302899 987357140 987365901 987345278
2675.7 987345278 987400115 987462580 987428010 987318754 987243176 987234652 987260044 987311602 987369478 987436056 987474799
2698.1 987474799 987432718 987392783 987392604 987360120 987276256 987215161 987198889 987169802 987181664 987201273 987111270 986996353
2722.6 986996353 986941576 986924529 986946464 986988425 986943960 986781716 986679792 986760855 986893713 986939251 986940324
2745 986940324 986936152 986912966 986917913 986925244 986884177 986880422 986896932 986799181 986702442 986746311 986778080 986704886 986611247
2771.5 986611247 986521304 986424565 986382008 986378431 986344397 986319840 986310840 986289203 986257911 986225843 986189902 986097872
2796 986097872 985986829 985905886 985784471 985637665 985539258 985502243 985531747 985538244 985439479 985297501 985156000
2818.4 985156000 984993219 984766543 984486699 984221518 983898818 983428895 982909918 982438922 981939316 981252253
$$ packed form
2653.2I87263680K6166J28746N8174l4749k6882j8001o5684k8551N4241Q761k0623
2675.7I87345278N4837O2465l4570j09256p5578q524K5392N1558N7876O6578L8743
2698.1I87474799m2081l9935j79l2484q3864o1095j6272k9087J1862J9609r0003j14917
2722.6I86996353n4777j7047K1935M1961m4465j62244j01924Q1063J32858M5538J073
2745I86940324m172k3186M947P331m1067l755J6510r7751r6739M3869L1769p3194r3639
2771.5I86611247q9943r6739m2557l577l4034k4557r000k1637l1292l2068l5941r2030
2796I86097872j11043q0943j21415j46806r8407l7015K9504O497r8765j41978j41501
2818.4I85156000j62781k26676k79844k65181l22700m69923n18977m70996m99606o87063
$$ plain form
2838.8 981252253 980179369 978514969 976301074 974014163 972580433 972646534 973820806 975344658 976785183
2857.2 976785183 978009820 979046404 979841650 980294764 980456769 980485916 980516970 980664492 980896294 981071055
2877.6 981071055 981129527 981044233 980813503 980446815 979977906 979435563 978848219 978271663 977605343 976814449
2897.9 976814449 976156175 975687504 975094080 974124134 972734332 970884323 968641639 966803610 966430306
2916.3 966430306 967366934 968641520 969801068 970825016 971737206 972706795 973857760 975034535 976129174
2934.7 976129174 977310836 978563726 979539096 980165124 980621636 980941713 981134772 981194019 981147468 981184125
2955 981184125 981406212 981753469 982252002 982920408 983594239 984162211 984628320 985030174 985442579 985869706
2975.4 985869706 986230254 986460268 986586630 986724138 986957431 987218678 987363279 987337351 987281084 987353265
$$ packed form
2838.8I81252253j072884j664400k213895k286911j433730O6101J174272J523852J440525
2857.2I76785183J224637J036584P95246M53114J62005K9147L1054J47522K31802J74761
2877.6I81071055N8472q5294k30730l66688m68909n42343n87344n76556o66320p90894
2897.9I76814449o58274m68671n93424r69946j389802j850009k242684j838029l73304
2916.3I66430306R36628J274586J159548J023948R12190R69589J150965J176775J094639
2934.7I76129174J181662J252890R75370O26028M56512L20077J93059N9247m6551L6657
2955I81184125K22087L47257M98533O68406O73831N67972M66109M01854M12405M27127
2975.4I85869706L60548K30014J26362J37508K33293K61247J44601k5928n6267P2181
$$ plain form
2995.8 987353265 987412810 987276077 987068534 987001359 987109125 987279475 987391770 987405241 987391651 987470388
3016.2 987470388 987628222 987701774 987561047 987319648 987259984 987368643 987460852 987531304 987515390 987352371
3036.6 987352371 987202108 987188578 987252653 987322569 987385213 987391531 987302661 987253785 987344444 987421691 987356603
3059.1 987356603 987238348 987187505 987193286 987255991 987317145 987248600 987145305 987147033 987225950 987299740 987256944
3081.5 987256944 987099290 986973226 986903131 986848354 986866176 986995578 987071574 986948907 986851931 986925721 986928105
3103.9 986928105 986742377 986590981 986580133 986557782 986455858 986360490 986315191 986287296 986242890 986146867 986068189
3126.3 986068189 986069143 986086428 986086905 986039162 985992193 986036837 986078143 985996902 985868871 985798120 985745788 985641599
3150.8 985641599 985517442 985483050 985543966 985541463 985388100 985232651 985176206 985112548 984979451 984905958 984958708
$$ packed form
2995.8I87353265N9545j36733k07543o7175J07766J70350J12295J3471j3590P8737
3016.2I87470388J57834P3552j40727k41399n9664J08659R2209P0452j5914j63019
3036.6I87352371j50263j3530O4075O9916O2644O318q8870m8876R0659P7247o5088
3059.1I87356603j18255n0843N781O2705O1154o8545j03295J728P8917P3790m2796
3081.5I87256944j57654j26064p0095n4777J7822J29402P5996j22667r6976P3790K384
3103.9I86928105j85728j51396j0848k2351j01924r5368m5299k7895m4406r6023p8678
3126.3I86068189R54J7285M77m7743m6969M4644M1306q1241j28031p0751n2332j04189
3150.8I85641599j24157l4392O0916k503j53363j55449n6445o3658j33097p3493N2750
$$ plain form
3173.3 984958708 984879971 984550059 984252274 984235525 984431446 984601140 984652042 984529257 984255850 984101415
3193.6 984101415 984173775 984309196 984344721 984242797 984099329 983992517 983923793 983851552 983767450 983775020 983845770
3216.1 983845770 983853996 983816981 983751595 983699858 983707249 983719110 983689964 983606577 983514547 983436465 983315706 983176887
3240.6 983176887 983061731 982938409 982857049 982877910 982898712 982864916 982858956 982818425 982684970 982609928 982614100
3263 982614100 982579231 982501090 982460082 982464433 982450068 982397616 982336640 982322216 982307076 982228816 982136488 982080042
3287.5 982080042 982145011 982225716 982096672 981904268 981865585 981891811 981845319 981688559 981465042 981354713
3307.8 981354713 981450796 981562078 981596828 981711209 981830716 981747746 981564641 981489182 981528163 981638849
3328.2 981638849 981819510 981927514 981834829 981705189 981854439 982240140 982519865 982620835 982672513 982772052
$$ packed form
3173.3I84958708p8737l29912k97785j6749J95921J69694N0902j22785k73407j54435
3193.6I84101415P2360J35421L5525j01924j43468j06812o8724p2241q4102P570P0750
3216.1I83845770Q226l7015o5386n1737P391J1861k9146q3387r2030p8082j20759j38819
3240.6I83176887j15156j23322q1360K0861K0802l3796n960m0531j33455p5042M172
3263I82614100l4869p8141m1008M351j4365n2452o0976j4424j5140p8260r2328n6446
3287.5I82080042O4969Q0705j29044j92404l8683K6226m6492j56760k23517j10329
3307.8I81354713R6083J11282L4750J14381J19507q2970j83105p5459L8981J10686
3328.2I81638849J80661J08004r2685j29640J49250L85701K79725J00970N1678R9539
$$ plain form
3348.6 982772052 982944548 983127534 983235478 983279169 983353138 983487725 983657539 983763218 983749032 983724236
3369 983724236 983709037 983666301 983627200 983493745 983269930 983220100 983486235 983865559 984071195 984157860 984340787
3391.5 984340787 984613538 984791040 984853685 985005856 985331595 985637665 985719800 985700846 985768080 985920966
3411.9 985920966 986074388 986179531 986290097 986468136 986662030 986770451 986889124 987116814 987338841 987427413
3432.2 987427413 987401187 987455547 987670243 987834334 987839818 987807512 987839699 988000393 988203228 988305271 988363683
3454.7 988363683 988425553 988476753 988530993 988542438 988557458 988679171 988846421 988902330 988860548 988876343 988873065
3477.1 988873065 988789141 988779068 988841355 988886476 988890648 988920569 989031792 989090741 989068151 989076197 989009440 988852382
3501.6 988852382 988858163 989024818 989158809 989186943 989187121 989257157 989314318 989303231 989256442 989200115 989256263 989468038
$$ packed form
3348.6I82772052J72496J82986J07944M3691P3969J34587J69814J05679j4186k4796
3369I83724236j5199m2736l9101j33455k23815m9830K66135L79324K05636Q6665J82927
3391.5I84340787K72751J77502O2645J52171L25739L06070Q2135j8954O7234J52886
3411.9I85920966J53422J05143J10566J78039J93894J08421J18673K27690K22027Q8572
3432.2I87427413k6226N4360K14696J64091N484l2306L2187J60694K02835J02043N8412
3454.7I88363683O1870N1200N4240J1445J5020J21713J67250N5909m1782J5795l278
3477.1I88873065q3924j0073O2287M5121M172K9921J11223N8949k2590Q046o6757j57058
3501.6I88852382N781J66655J33991K8134J78P0036N7161j1087m6789n6327N6148K11775
$$ plain form
3526.1 989468038 989655912 989665806 989478946 989303291 989362597 989581227 989799380 989800990 989547908 989455402 989650428
3548.5 989650428 989788234 989722669 989514410 989325285 989345968 989454806 989387870 989203513 989347756 989916384
3568.9 989916384 990322649 990395248 990369618 990437746 990547061 990622997 990637004 990425885 990176499 990290940
3589.3 990290940 990496933 990504324 990496218 990660012 990822494 990811944 990641534 990469694 990580142 990893364
3609.7 990893364 990965903 990841627 990764618 990749240 990906179 991109073 991077363 990897119 990797520 990898967
3630.1 990898967 991082311 991220713 991247475 991216004 991204083 991229177 991235733 991098821 990972996 991153061 991340637
3652.5 991340637 991392136 991425395 991404414 991375685 991388500 991314292 991124451 990994096 991016090 990985870 991039038
3674.9 991039038 991264939 991395175 991536558 991639078 991479218 991165280 991113603 991362989 991555095 991562366
$$ packed form
3526.1I89468038J87874R894j86860j75655N9306K18630K18153J610k53082r2506J95026
3548.5I89650428J37806o5565k08259j89125K0683J08838o6936j84357J44243N68628
3568.9I89916384M06265P2599k5630O8128J09315P5936J4007k11119k49386J14441
3589.3I90290940K05993P391q106J63794J62482j0550j70410j71840J10448L13222
3609.7I90893364P2539j24276p7009j5378J56939K02894l1710j80244r9599J01447
3630.1I90898967J83344J38402K6762l1471j1921K5094O556j36912j25825J80065J87576
3652.5I91340637N1499L3259k0981k8729J2815p4208j89841j30355K1994l0220N3168
3674.9I91039038K25901J30236J41383J02520j59860l13938n1677K49386J92106P271
$$ plain form
3695.3 991562366 991437733 991446435 991701245 991835237 991710663 991626561 991594732 991509557 991520643 991583288 991601884
3717.7 991601884 991574705 991470635 991306126 991291523 991460025 991500318 991252363 991015971 991133094 991380870
3738.1 991380870 991464734 991297364 991113186 991212964 991339147 991316855 991371512 991655588 991893470 991987228
3758.5 991987228 991941214 991746008 991667390 991760552 991692185 991573930 991744876 992031634 992227077 992230654 991981387
3781 991981387 991757452 991822124 992062032 992175579 992003739 991709292 991571546 991535366 991470397 991616130
3801.4 991616130 991915286 992004812 991899729 991734684 991588116 991529167 991554499 991435111 991204023 991270483
3821.8 991270483 991541684 991759658 991937101 992009640 991951942 991923869 992060721 992040515 991763353 991694570
3842.1 991694570 991807520 991858959 991806984 991661847 991689563 991999209 992059410 991997361 991882026 991680801
$$ packed form
3695.3I91562366j24633Q702K54810J33992j24574q4102l1829q5175J1086O2645J8596
3717.7I91601884k7179j04070j64509j4603J68502M0293k47955k36392J17123K47776
3738.1I91380870Q3864j67370j84178R9778J26183k2292N4657K84076K37882R3758
3758.5I91987228m6014j95206p8618R3162o8367j18255J70946K86758J95443L577k49267
3781I91981387k23935O4672K39908J13547j71840k94447j37746l6180o4969J45733
3801.4I91616130K99156Q9526j05083j65045j46568n8949K5332j19388k31088O6460
3821.8I91270483K71201K17974J77443P2539n7698k8073J36852k0206k77162o8783
3842.1I91694570J12950N1439n1975j45137K7716L09646O0201o2049j15335k01225
$$ plain form
3862.5 991680801 991687715 991829038 991861999 991827428 991747856 991850793 992040992 991980553 991887271 991851807 991737068
3885 991737068 991738141 991725087 991596699 991485059 991367877 991350412 991437793 991533875 991824567 992050290 991865039
3907.4 991865039 991664171 991720438 991767526 991661608 991563380 991578162 991636336 991643608 991635919 991635501 991568029 991557956
3931.9 991557956 991830051 992175519 992169976 991847932 991630733 991597593 991552770 991503239 991463244 991456091 991537392
3954.3 991537392 991559267 991542518 991781950 992081285 992021382 991665781 991381526 991522074 991939902 992185712
3974.7 992185712 992134571 991931617 991857111 992028117 992190719 992241383 992279172 992155969 991844118 991725683
3995.1 991725683 991892040
3997.1 991892040
$$ packed form
3862.5I91680801O914J41323L2961l4571p9572J02937J90199o0439r3282l5464j14739
3885I91737068J073j3054j28388j11640j17182j7465Q7381R6082K90692K25723j85251
3907.4I91865039k00868N6267M7088j05918r8228J4782N8174P272p689m18o7472j0073
3931.9I91557956K72095L45468n543l22044k17199l3140m4823m9531l9995p153Q1301
3954.3I91537392K1875j6749K39432K99335n9903l55601k84255J40548M17828K45810
3974.7I92185712n1141k02954p4506J71006J62602N0664L7789j23203l11851j18435
3995.1I91725683J66357
3997.1I91892040
##END=$$ End of the data block
