##TITLE=AM 03 $$ Begin of the data block
##JCAMP-DX=5.00 $$ ACD/SpecManager v 10.08
##SPECTROMETER/DATA SYSTEM=Alpha
##DATE=23 Oct 2014 09:00:34
##DATA TYPE=INFRARED SPECTRUM
##DATA CLASS=XYDATA
##ORIGIN=
##OWNER=
##NPOINTS=1667
##FIRSTX=599.57470703
##LASTX=3997.16503906
##MAXX=3997.16503906
##MINX=599.57470703
##MAXY=0.98028713
##MINY=0.72619045
##XFACTOR=1.0000000000
##YFACTOR=1.000000000000000e-9
##FIRSTY=0.77663004
##DELTAX=2.03937006
##XUNITS=1/CM
##YUNITS=ARBITRARY UNITS
##XYDATA=(X++(Y..Y))
599.6G76630044k672672k256096j642227o75797P43448K331496L440976L166556J691699
617.9G80757427O68705J11818r01341j487136j321733j537621j873613j303613k24769
636.3G72888124J62840m44591j045704r52721m31776K35081O88314Q64506J393616
654.6G73357689J995981K269447K701640L107905K983332L268480L985227L484964
671G97154665L494859L767252L433644L026426K778590K555907K274155J902819J567304
689.3H21955621J496256J448214J008451K09808l19660o00576p98225j58072J127124
707.7H25368941J756370J497865P45058j72854n33938l85106l93569o12915q36551
726H26433301r39310o39379k67326l66331q88109j880646l090679l982365m418671
$$ plain form
599.6 776630044 773957372 771701276 770059049 769383252 770126700 772458196 775899172 779065728 780757427
617.9 780757427 781426132 781537950 780636609 779149473 777827740 776290119 774416506 773112893 772888124
636.3 772888124 773050964 772606373 771560669 770607948 770176172 770411253 771099567 771964073 773357689
654.6 773357689 775353670 777623117 780324757 783432662 786415994 789684474 793669701 797154665
671 797154665 800649524 804416776 807850420 810876846 813655436 816211343 818485498 820388317 821955621
689.3 821955621 823451877 824900091 825908542 826118350 825798690 825198114 824399889 824241817 825368941
707.7 825368941 827125311 828623176 829368234 829195380 828661442 828276336 827882767 827269852 826433301
726 826433301 825493991 824854612 824587286 824220955 823332846 821452200 818361521 814379156 809960485
744.4H09960485m530550m230678k938211o71744J358867K390027K292454N69582k418339
762.7H01781893n090714n953908l548026K804816R180307R263158L783524o21021n59330
781.1H11040699J775682J679779k026439n109549m243016n22554L056884M150629K544105
799.4H12346220J63019j244128j474023j342118j744151k685845k544701J459062Q055210
817.8H10988545J1621237J0769546Q281231N420268K595007L38137j763761m118085
834.1H44132125n877435o494582o279885n046845k786338p749L127456N886674O835163
852.5H33488584N795776L793896J602828j98901q28266J05501K359092N301773P529557
870.8H58949840P978261P151424N756736M119814K710044J631856O43194j99378p11798
$$ plain form
744.4 809960485 805429935 801199257 798261046 797589302 798948169 801338196 803630650 804200232 801781893
762.7 801781893 796691179 790737271 787189245 789994061 799174368 808437526 812221050 811600029 811040699
781.1 811040699 812816381 814496160 812469721 807360172 803117156 802594602 805651486 809802115 812346220
799.4 812346220 812509239 811265111 809791088 808448970 806704819 804018974 801474273 802933335 810988545
817.8 810988545 822609782 833379328 841660559 847080827 849675834 850013971 848250210 844132125
834.1 844132125 838254690 831760108 825480223 820433378 817647040 817639291 820766747 826653421 833488584
852.5 833488584 839284360 843078256 844681084 844482183 843653917 843759418 846118510 851420283 858949840
870.8 858949840 866928101 874079525 879836261 883956075 886666119 888297975 888941169 888741791 888029993
889.2H88029993r59456j111508j215040j197100j116455j210809j426339j569628j721740
907.5H76501918j934827k002835j666188q54194J71482P59662O13093p3135j221716
925.9H70293260k317250k732039k640545k552927k795517l181398l021777k143681
942.2H48908126j371085j296819j495659j481116j226723q94487o42240l38197J34945
960.5H40296745O43373R54628R64939Q95203P89582N82576L07918l0816k63035l60787
980.9H44780326l26097O5446O80923P72238j62363j533985k527952l240049m041076
999.3H34467411m854083n582631o278991o987274p672906q302152q667469p531583
1015.6G78590322l489852K368450O048620M597961j93238m237890n707204n451918
$$ plain form
889.2 888029993 887070537 885959029 884743989 883546889 882430434 881219625 879793286 878223658 876501918
907.5 876501918 874567091 872564256 870898068 870043874 870215356 870975018 871588111 871514976 870293260
925.9 870293260 867976010 865243971 862603426 860050499 857254982 854073584 851051807 848908126
942.2 848908126 847537041 846240222 844744563 843263447 842036724 841142237 840499997 840161800 840296745
960.5 840296745 840940118 841894746 842859685 843754888 844544470 845127046 845434964 845404148 845141113 844780326
980.9 844780326 844454229 844519675 845200598 845972836 845810473 844276488 841748536 838508487 834467411
999.3 834467411 829613328 824030697 817751706 810764432 803091526 794789374 786121905 778590322
1015.6 778590322 775100470 777468920 783517540 788115501 787922263 783684373 777977169 772525251
1031.9G72525251m775882m018426k838790j458109j126527k325356l864587m750728
1048.2G47366846m946530m729152m301727l547430k445817j205742L8326R49859J313687
1066.6G28492320J347839J266241J273513J581431K174020K863824L449202M221260
1082.9G46669650O683827J1292099J4383972J2318432P175029L107548J139938L58999
1099.2H03129494N4956J99914J173079K848923M368245N247891N645633N431652M552603
1117.6H32652390L438592K477527J805901J290620P05838L7849n82934r77874r30666
1135.9H39917243m97401L0696M54962O66261O19948K19286o03736j612186k608955
1154.3H36586118l584743m270136m300416l790378l153086k503216j839161j329005
$$ plain form
1031.9 772525251 767749369 763730943 760892153 759434044 758307517 755982161 752117574 747366846
1048.2 747366846 742420316 737691164 733389437 729842007 727396190 726190448 726228774 727178633 728492320
1066.6 728492320 729840159 731106400 732379913 733961344 736135364 738999188 742448390 746669650
1082.9 746669650 753353477 764645576 779029548 791347980 798523009 801630557 802770495 803129494
1099.2 803129494 803184450 803384364 804557443 807406366 811774611 817022502 822668135 828099787 832652390
1117.6 832652390 836090982 838568509 840374410 841665030 842370868 842408717 841825783 840847909 839917243
1135.9 839917243 839419842 839450538 839905500 840571761 841191709 841410995 840807259 839195073 836586118
1154.3 836586118 833001375 828731239 824430823 820640445 817487359 814984143 813144982 811815977
1170.6H11815977j085997j089692j188516r99272k42829M21404N4002j099944k187192
1189H04397941k882660l281891l599286l951311l934265l006279j468718k97010k04980
1207.3G81771541j300633k905965l612459k618492p00175J054346K249182K759933
1223.6G76697278K617717J990020J147151N39720O04868J654983L779471O120741O398201
1242H01550150L217697j517057m811883n179048k471924K207876O712794R185791R857297
1260.3H18751693J0220647J0712564J0595858R288668P538319O505370O218732O009399
1276.7H85841250N630136N121291M315495L288627K435148J721262P90298m15444j827598
1295I06900465l400862m769563n464793n428433m766882l122448l1412L686070N942166
$$ plain form
1170.6 811815977 810729980 809640288 808451772 807452500 807209671 807631075 807685077 806585133 804397941
1189 804397941 801515281 798233390 794634104 790682793 786748528 783742249 782273531 781976521 781771541
1207.3 781771541 780470908 777564943 773952484 771333992 770633817 771688163 773937345 776697278
1223.6 776697278 779314995 781305015 782452166 782991886 783596754 785251737 789031208 795151949 801550150
1242 801550150 804767847 803250790 798438907 793259859 790787935 792995811 799708605 808894396 818751693
1260.3 818751693 828972340 839684904 850280762 859569430 867107749 873613119 879831851 885841250
1276.7 885841250 891471386 896592677 900908172 904196799 906631947 908353209 909143507 908728063 906900465
1295 906900465 903499603 898730040 893265247 887836814 883069932 879947484 879916072 883602142 889544308
1313.4H89544308N693674M855573N691231P385909P578254N946457M226864L348708
1329.7I34270978K594054J454293K41518n24818m43638l2902j64985o55532j079619
1348I35659349j326084j401663j393914j260936j007736q00789k68519O14584P50840
1366.4I29565132L04639M3690k06113l11076j50204k46704o31392j224279k021432
1384.7I25122261k792656k608002j736402j687884k569259l459334m030168m028261
1401.1I02210295m088700n270004o783545p843852n974829Q93712Q745491J4502824
1417.4H96391392J7402827J2293816N410731J821577n53548k322793k741873k242088
1433.7I25460041j954437r72509K46644K22206m17709j189471j700878j661718j586437
$$ plain form
1313.4 889544308 895237982 900093555 905784786 913170695 920748949 926695406 930922270 934270978
1329.7 934270978 936865032 938319325 938560843 938036025 937592387 937559485 937394500 936738968 935659349
1348 935659349 934333265 932931602 931537688 930276752 929269016 928468227 928199708 928814292 929565132
1366.4 929565132 929869771 929913461 929707348 929396272 929246068 928999364 928367972 927143693 925122261
1384.7 925122261 922329605 919721603 917985201 916297317 913728058 910268724 906238556 902210295
1401.1 902210295 898121595 892851591 886068046 878224194 872249365 873143077 881888568 896391392
1417.4 896391392 913794219 926088035 931498766 933320343 932766795 930444002 927702129 925460041
1433.7 925460041 923505604 922533095 922779739 923001945 922584236 921394765 919693887 918032169 916445732
1452I16445732j639724j656949r36926J76430M9830m08829L696N13613P6473m91798
1472.4I12131548k40564K41398K162993N331457O228149L684461O29366j384676k001047
1490.8I26783085j870513l023446n324781o621778o391108o207704q993685j5716851
1507.1H72633219j2057901n251526l200174k657711l535629n258262p882595p178545
1523.4H25610876l770590j459777Q72314L301620P439614J0450303J1510730J5918672
1539.7H69873762J6757369J1870682R925783Q380652P555425O916880N724848M358947
1556.1I41364348L948271M556298K841890J307011N52595j52350o08384o43552j149177
1574.4I52016950k190888k188623k186239l447056n249202p301569r235144r715497
$$ plain form
1452 916445732 914806008 913149059 912212133 912388563 912438393 912029564 912033260 912546873 912623346 912131548
1472.4 912131548 911890984 912132382 914295375 919626832 925854981 929539442 930168808 928784132 926783085
1490.8 926783085 924912572 921889126 916564345 909942567 903551459 897343755 888350070 872633219
1507.1 872633219 860575318 855323792 852123618 849465907 845930278 840672016 832789421 825610876
1523.4 825610876 821840286 820380509 821252823 824554443 831994057 842444360 853955090 869873762
1539.7 869873762 886631131 898501813 908427596 916808248 924363673 931280553 937005401 941364348
1556.1 941364348 945312619 949868917 952710807 954017818 954570413 954418063 953809679 953166127 952016950
1574.4 952016950 949826062 947637439 945451200 942004144 936754942 929453373 920218229 910502732
1590.7I10502732p383347k787292K229333N652189O622315N768120M151523K341986
1607I27097559P15554J24991P25805K156258M140079M243076K949476J915395R11952
1625.4I44980145P0154m48763n87583j008808j906395j261175O318J19090l77953j158059
1645.8I38426971j188755m23789j003265j839221m52458k19524j035989j715719j643062
1664.1I28905189j415670k200603l089190k700269l457129m941881n204141n620003
1680.5I00276303p810473j2623549j1888027r597063j0053456q382201o770074m397512
1696.8H28753948Q39770N922496P514298Q572340R626568P718801M911602K463281
1713.1H76323104M22656j194238j591385j598417k289951k625525j989663j018822
$$ plain form
1590.7 910502732 903119385 900332093 902561426 908213615 914835930 920604050 924755573 927097559
1607 927097559 927813113 927938104 928663909 930820167 934960246 939203322 942152798 944068193 944980145
1625.4 944980145 945050299 944601536 944013953 943005145 941098750 939837575 939843893 939962983 939585030 938426971
1645.8 938426971 937238216 936814427 935811162 933971941 933519483 933299959 932263970 930548251 928905189
1664.1 928905189 927489519 925288916 922199726 919499457 916042328 911100447 905896306 900276303
1680.5 900276303 892465830 879842281 867954254 858357191 848303735 839921534 833151460 828753948
1696.8 828753948 829593718 835516214 843030512 851602852 861229420 868948221 873859823 876323104
1713.1 876323104 876745760 875551522 873960137 872361720 870071769 867446244 865456581 864437759
1729.4H64437759M86314K717793N229116N959570O835282P880568Q410156R195745
1745.7I11152303R641409J0375679J0613322Q601665O506443N192638L828347K961218
1762I68873024K184272J185655O13988M81963L98815L26156K98202J02043j02877j54317
1782.4I74206924m3928J29640k7716l83616k30610K17616K64705K9683j44065J87517
1802.8I74206150L73601J00017j15991r5963J17660J80125P8320R8408Q404k60055
1823.2I74690676k06173j0073m0173J73509L79502J71364k6107n4538k17378l53218
1843.6I74507391o8485K11537K02059J54674R6262l8982j25944q3625o8486j33574
1864I74652827l27885m76122o8248L86000L05712P2539m2558p8618r0182j10805j58667
$$ plain form
1729.4 864437759 864924073 867641866 872870982 878830552 885665834 893546402 901956558 911152303
1745.7 911152303 920793712 931169391 941782713 950384378 956890821 962083459 965911806 968873024
1762 968873024 971057296 972242951 972856939 973338902 973737717 974063873 974362075 974464118 974361241 974206924
1782.4 974206924 974162996 974292636 974264920 973881304 973650694 973868310 974133015 974162698 974018633 974206150
1802.8 974206150 974579751 974679768 974563777 974467814 974585474 974765599 974843919 974942327 974950731 974690676
1823.2 974690676 974484503 974474430 974434257 974607766 974987268 975158632 975132525 975077987 974860609 974507391
1843.6 974507391 974438906 974650443 974852502 975007176 975103438 975064456 974938512 974854887 974786401 974652827
1864 974652827 974324942 973848820 973780572 974166572 974472284 974544823 974502265 974423647 974333465 974222660 974063993
1886.4I74063993k15948j08481k6822j80304k07185j06395m4524M7385Q4400J5796
1906.8I73321915J4424J34170J51098n1439k32995j15275L7551J31190K54750J63615
1927.2I73809004o616l1710L1412K6226p0155j77264k77102j33634J73986K28763R4592
1949.7I73667502k3126o0320j2696M3929K3484m6253j15335j13189L9279J53959M8101
1972.1I73605335p9096m3511K027j2696K2232K5153o4969j45256k02417j27674P7725
1994.5I73056853J30176R4474J00374M4882o1631o8247L874j9431j11818j36614o9738
2017I72963154L815L6478O2227P6235M4286j3471l5941j2160M173n1678j66535j65462
2041.4I72745121r358Q7380P5281L516o1154o497P9572Q2314K3246q1301j43468m3273
$$ plain form
1886.4 974063993 973848045 973739564 973712742 973532438 973325253 973218858 973174334 973221719 973306119 973321915
1906.8 973321915 973336339 973470509 973621607 973570168 973337173 973221898 973259449 973390639 973645389 973809004
1927.2 973809004 973802388 973770678 973802090 973828316 973758161 973580897 973303795 973170161 973344147 973572910 973667502
1949.7 973667502 973644376 973584056 973571360 973615289 973638773 973592520 973477185 973363996 973403275 973557234 973605335
1972.1 973605335 973526239 973482728 973484755 973472059 973494291 973519444 973454475 973309219 973106802 972979128 973056853
1994.5 973056853 973187029 973281503 973381877 973426759 973365128 973296881 973300755 973281324 973169506 973032892 972963154
2017 972963154 972966969 973003447 973065674 973141909 973186195 973172724 973136783 973124623 973128796 973077118 972910583 972745121
2041.4 972745121 972735763 972823143 972898424 972901940 972840786 972834289 972913861 972996175 973019421 972938120 972794652 972751379
2065.9I72751379R3520J03473L4809p510L8028O3598l1531p0810j7941k1517n6505
2088.3I72878993n5373k3484j6451k3544j2100o020J192J3411Q524l4571o0499K206
2112.8I72672284R4533R7215J5676n7638o6995J1146R3221Q5294K7836N543j4841m8280
2137.3I72914994j8656K682K3305Q6904O5267j9491o6578o4731l1054J431M053k5571
2161.8I72872555n0843n6803l3021M769k4975p0572m2378k4677j8000M0888P6294K2412
2186.2I72695649o8784o4492k8193p5043n6743L5763M0710O139K742J1205N5611O6758
2210.7I72621322j1087o5267n0843j8298J192J8477N9426P2479P451p6294r6977j9371
2235.2I72442210Q3029Q2195P2479J14143M6849n2154l0875l398n2750r4711m1843
$$ plain form
2065.9 972751379 972844899 972948372 972983181 972975671 973013699 973077297 973045766 972974956 972957015 972935498 972878993
2088.3 972878993 972823620 972800136 972783685 972760141 972748041 972742021 972743213 972756624 972765148 972730577 972670078 972672284
2112.8 972672284 972766817 972864032 972879708 972822070 972755075 972766221 972859442 972944736 972972572 972978115 972963274 972914994
2137.3 972914994 972896338 972899020 972922325 973009229 973074496 973055005 972988427 972923696 972892642 972894073 972898126 972872555
2161.8 972872555 972821712 972764909 972731888 972736657 972711682 972641110 972598732 972574055 972556055 972596943 972673237 972695649
2186.2 972695649 972626865 972562373 972534180 972459137 972402394 972438157 972478867 972485006 972487748 972498953 972554564 972621322
2210.7 972621322 972610235 972544968 972494125 972475827 972477019 972495496 972554922 972627401 972634852 972558558 972461581 972442210
2235.2 972442210 972525239 972607434 972679913 972794056 972840905 972788751 972757876 972754478 972701728 972607017 972565174
2257.6I72565174L1352J4126J1027L5405l3497o6102M470K5332m351l9100q6964m7504
2282.1I72409368Q2373J14501j1325j02759p0214m4107r1315j12056J6570P0393j21296
2304.5I72140133k58624j47343N7876J53482J53125J22427N7221M5955J78576L18348
2324.9I72821176K77817J21355J08004L49283M31597K24591N7518j79231m96745n62370
2345.3I73152995k87056J36495M67717O02544N86569K84195j96576j49071J10209k21372
2365.7I74486649o34491o43492n42402l79444j96456j25528j8418K03610K94447J51634
2386.1I72596109L3796Q0526J40071P4803o8366r9480J8418R2566K1696m1545J8895
2408.5I72867489N3882J9908L2604J00017R7036n1618j28924n2095J5915N6266L5942
$$ plain form
2257.6 972565174 972596526 972610652 972621679 972657084 972623587 972557485 972561955 972587287 972582936 972543836 972456872 972409368
2282.1 972409368 972491741 972606242 972594917 972492158 972421944 972377837 972286522 972174466 972191036 972261429 972140133
2304.5 972140133 971881509 971734166 971792042 971945524 972098649 972221076 972278297 972324252 972502828 972821176
2324.9 972821176 973098993 973220348 973328352 973677635 974109232 974333823 974391341 974212110 973715365 973152995
2345.3 973152995 972865939 973002434 973470151 974072695 974659264 974943459 974746883 974597812 974708021 974486649
2365.7 974486649 973852158 973208666 972666264 972286820 972090364 971964836 971946418 972150028 972444475 972596109
2386.1 972596109 972629905 972710431 972850502 972925305 972856939 972757459 972775877 972868443 972890139 972848594 972867489
2408.5 972867489 972921371 972941279 972973883 973073900 973170936 973119318 972990394 972938299 972954214 973010480 973046422
2430.9I73046422p6115j74225j42991J0371J13070P8738L4213P5042Q2076m3929j26302
2453.4I72876370o0976J9551M4286n722r3401j00851n4955n4777n7280P75O7890M9650
2477.9I72630560j7523k4081J2577K3901l4988q2075k9087O020j9491k9623j0074K0683
2502.3I72446799M5538J7107k4557K8133Q9645P0751J9670m828j6332l5048n245j6868
2526.8I72614765q4579m9472N722L2843O1392n126j06096j27375l6299M9293K0981
2549.2I72376049J6033J5915p9930q0109P6354J12951M4524K5392o6817j09673R716
2571.7I72340405R2149M9412o855N4420N7101j14501k22027j55449O378J31368J44482
2594.1I72376883Q3566Q344l0160j0788J6689j6033q0169m9650N9843N4836k2411l8445
$$ plain form
2430.9 973046422 972970307 972796082 972653091 972663462 972776532 972855270 972889483 972964525 973046601 973002672 972876370
2453.4 972876370 972815394 972834945 972879231 972873509 972780108 972679257 972624302 972569525 972512245 972513020 972580910 972630560
2477.9 972630560 972613037 972588956 972601533 972625434 972590446 972508371 972479284 972485304 972465813 972436190 972426116 972446799
2502.3 972446799 972492337 972509444 972484887 972513020 972602665 972673416 972693086 972688258 972671926 972636878 972631633 972614765
2526.8 972614765 972530186 972480714 972486436 972519279 972580671 972575545 972469449 972342074 972305775 972355068 972376049
2549.2 972376049 972392082 972407997 972328067 972247958 972324312 972437263 972481787 972507179 972440362 972330689 972340405
2571.7 972340405 972432554 972481966 972475111 972529531 972586632 972472131 972250104 972094655 972101033 972232401 972376883
2594.1 972376883 972460449 972468793 972438633 972427845 972444534 972428501 972348332 972298682 972358525 972413361 972390950 972352505
2618.6I72352505r6321j68026q2373K3126m351k8133k5273m2736j9968L994l7134l5465
2643I71839845R239k4319k7299L6359O56r9004r0420Q464K4080m530L1889K444k0147
2669.5I71687257J01805J18732k7239j51574k05040j51396l6955J967l0756o9261r0897
2692I71146643n8591j371J1027k384K1219J9133o9022j11163l9637P629m9889j09315
2716.4I70764279q1420k2649o7652j62780r4950K3127J7046o0737j32858p2480O140
2738.9I70115066p9215j47521r9779o2823o6400o9439o9916p9990p2479J2517R7513
2761.3I69477534J2458j42753j18971J0192j1742j42336j33157R895R060j65046k64942
2783.7I68540192k20180j80721k11716j69992o4791r059L2722M4704k7299j21593j22309
$$ plain form
2618.6 972352505 972256184 972088158 972005785 972028911 972024560 971996427 971971154 971928418 971908450 971912444 971875310 971839845
2643 971839845 971849084 971824765 971797466 971833825 971834481 971735477 971645057 971653521 971677601 971673071 971704960 971707404 971687257
2669.5 971687257 971789062 971907794 971880555 971728981 971523941 971372545 971335590 971337557 971306801 971237540 971146643
2692 971146643 971088052 971086681 971097708 971095324 971116543 971135676 971066654 970955491 970915854 970923483 970873594 970764279
2716.4 970764279 970682859 970660210 970592558 970429778 970334828 970357955 970375001 970314264 970181406 970108926 970115066
2738.9 970115066 970035851 969888330 969788551 969725728 969659328 969589889 969519973 969439983 969367504 969380021 969477534
2761.3 969477534 969489992 969347239 969228268 969238460 969226718 969084382 968951225 968961120 968970180 968805134 968540192
2783.7 968540192 968320012 968139291 967927575 967757583 967692792 967683733 967716455 967761159 967733860 967612267 967489958
2806.2I67489958p1466m9889l0756j20402l12209l63350l39329m29451n35131n51104
2826.6I64686871n72324p72000j064062j221478j306891j471520j730501k176285k863288
2844.9I51508522l189146k327562o86943M64081P13408O06239O59883Q04067P50720
2863.3I49303269N82636M89950M85301N47767O98447R12785R66192O93977K44796k01464
2883.7I54723656n89847r46761j344919j630425j604915j393020j050413p36534p17759
2902I44709063p30455p35522j058042j684248k358258k405882j448512j61826O22451
2920.4I34748769P99238P42496N85496L56674K67565L16084L19600L07977L48926M01377
2940.8I39194202L94464K48671m3631m87566r94444j322389j376330j106799l61979
$$ plain form
2806.2 967489958 967418492 967368603 967337847 967217445 966905236 966541886 966202557 965773106 965237975 964686871
2826.6 964686871 964114547 963342547 962278485 961057007 959750116 958278596 956548095 954371810 951508522
2844.9 951508522 948319376 945991814 945304871 945768952 946482360 947088599 947748482 948552549 949303269
2863.3 949303269 949885905 950375855 950861156 951408923 952107370 953020155 953986347 954680324 954925120 954723656
2883.7 954723656 954133809 953187048 951842129 950211704 948606789 947213769 946163356 945426822 944709063
2902 944709063 943978608 943243086 942185044 940500796 938142538 935736656 934288144 934126318 934748769
2920.4 934748769 935548007 936290503 936875999 937232673 937500238 937816322 938135922 938443899 938792825 939194202
2940.8 939194202 939588666 939837337 939793706 939306140 938311696 936989307 935612977 934506178 934144199
2959.1I34144199Q99076K456427L729880M223525M056037L592253L047168K467930
2975.4I58616495J989126J733601J485467J154483R30309Q33035P03036N05448L37302
2993.8I68288302K68519K93315L06248K37525K08497K49445K00272J45614J51992O5029
3014.2I70414758k5034m8638j41859k68995l42787l24726j97828r5367n0843m3392
3034.6I68875289j63913l07143k57790O259K59220K53082J38461J69933J96159R3281
3055I69262838K5928O6460J57594K02358R4175J7405J14083J95980J55151j0669j02222
3077.4I70179081R894N5552R060J7345M1127N7101N5313K8730k265l7849j30296j85192
3101.9I70097601j45971j78755k67803k88606j94848j13606j46091j15395K0981Q5771
$$ plain form
2959.1 934144199 935043275 937499702 941229582 945453107 949509144 953101397 956148565 958616495
2975.4 958616495 960605621 962339222 963824689 964979172 965909481 966742516 967445552 967951000 968288302
2993.8 968288302 968556821 968850136 969156384 969393909 969602406 969851851 970052123 970197737 970349729 970414758
3014.2 970414758 970389724 970341086 970199227 969930232 969587445 969262719 969064891 968969524 968918681 968875289
3034.6 968875289 968711376 968404233 968146443 968152702 968411922 968665004 968803465 968973398 969169557 969262838
3055 969262838 969288766 969355226 969512820 969715178 969809353 969826758 969940841 970136821 970291972 970281303 970179081
3077.4 970179081 970188975 970244527 970253587 970270932 970312059 970369160 970424473 970453203 970450938 970413089 970282793 970097601
3101.9 970097601 969951630 969772875 969505072 969216466 969021618 968908012 968761921 968646526 968667507 968753278
3122.3I68753278Q3208R0182R7335J97947K35915O1631j6987J22189J87397J00076
3142.7I69912171M5658j6809p8201l3796r716j11282j10805m887j09494k01404r3460
3165.1I69187975k4736r8586k28345k23101j02937j36733l06249l31997j93239n5194
3185.5I67486858j6272o0081j20521j36316q6963j1146M3690O4850P4566J4126p0632
3207.9I67182159p6353j02580k29478l18467k50697j39833r7871O56R5248j38104m65512
3230.4I65459168m69089k79307j64151j65820j85013k17140k46942j98841k01344l25561
3250.7I63005960l69489l19362k26498j03533j43230l65913n93006m95851j68085k13981
3271.1I60007012n78940p84457p19547n52356n18561o44505p44283p01427o32882p00653
$$ plain form
3122.3 968753278 968836486 968926668 969024003 969221950 969457865 969519496 969502509 969624698 969812095 969912171
3142.7 969912171 969957829 969941020 969862819 969829023 969819307 969708025 969597220 969592333 969482839 969281435 969187975
3165.1 969187975 969163239 969064653 968836308 968613207 968510270 968373537 968067288 967735291 967542052 967486858
3185.5 967486858 967470586 967410505 967289984 967153668 967066705 967055559 967099249 967164099 967238665 967252791 967182159
3207.9 967182159 967105806 967003226 966773748 966455281 966204584 966064751 965966880 965967536 966062784 965924680 965459168
3230.4 965459168 964990079 964710772 964546621 964380801 964195788 963978648 963731706 963532865 963331521 963005960
3250.7 963005960 962636471 962317109 962090611 961987078 961843848 961477935 960884929 960389078 960220993 960007012
3271.1 960007012 959428072 958643615 957924068 957371712 956853151 956208646 955464363 954762936 954130054 953429401
3291.5I53429401q50380r75251r24587o88314n80907p05421q37922q50559p38501m83215
3311.9I45794344k33710n4002J58906L02434L30687L61025M90487Q20637J302838J551449
3332.3I50825095J377940J155615J062632R25898Q38220Q75593Q29875P07686O78957
3350.7I59277511P11143O96599O19173M81487L56972L72529M99665N90146N52952N11349
3371.1I64669526M91142L04103J05083J89245L14652K27690K18213L43978L27230J77860
3391.5I67368722L0816n5016k9265J88350M23134L36229J60695J89185J78992J19806
3411.9I68911648J56760J64330O7294j4544K1875K9504k5987M1008J34408Q6308J79
3434.3I69572783k5452L1114J95265K94983J37091m5657P9155K54273J37210J8179
$$ plain form
3291.5 953429401 952579021 951603770 950679183 949990869 949409962 948704541 947866619 947016060 946277559 945794344
3311.9 945794344 945560634 945506632 945665538 945967972 946298659 946659684 947150171 947970808 949273646 950825095
3332.3 950825095 952203035 953358650 954421282 955347180 956185400 957060993 957890868 958598554 959277511
3350.7 959277511 959988654 960685253 961304426 961785913 962142885 962515414 963015079 963605225 964158177 964669526
3371.1 964669526 965160668 965464771 965569854 965759099 966073751 966301441 966519654 966863632 967190862 967368722
3391.5 967368722 967399538 967344522 967315257 967503607 967926741 968262970 968423665 968612850 968791842 968911648
3411.9 968911648 969068408 969232738 969300032 969285488 969307363 969336867 969310880 969351888 969486296 969572604 969572783
3434.3 969572783 969547331 969578445 969773710 970068693 970205784 970160127 970239282 970493555 970630765 970648944
3454.7I70648944M4048n364l3319P9870Q4400r4175j04785O6578J81556K29955J05500
3477.1I71203208j11222q9944J11282J63496P4386Q1957J50025L9398p1704M7326K8372
3499.5I71626580j70648r8586P2300J19209K29836K14279P5757O0260M3631j22488
3519.9I72050130l21507k15948J13309K68459K18928J22607Q9049J53482K17020O0142
3540.3I72755671j76430k27452l993L16679K90454K14696L87370K68996j75297l20196
3560.7I73330498l34680p06733m68969P39813J049817N18858K23517K17557K21730
3579.1I74791408J36971j93000p30157o59644L90112O62089L9219j22189J98543K93612
3599.5I74806964K93792K41458j35362m21286k53558k03729j80542R4473J23799K52187
$$ plain form
3454.7 970648944 970692992 970687628 970654309 970734179 970818579 970724404 970619619 970686197 970867753 971097708 971203208
3477.1 971203208 971091986 971002042 971113324 971276820 971351206 971433163 971583188 971622586 971550882 971598208 971626580
3499.5 971626580 971455932 971357346 971429646 971548855 971778691 971992970 972068727 972128987 972172618 972050130
3519.9 972050130 971728623 971512675 971625984 971894443 972113371 972235978 972325027 972478509 972695529 972755671
3540.3 972755671 972579241 972351789 972347796 972664475 972954929 973169625 973556995 973825991 973650694 973330498
3560.7 973330498 972995818 972289085 971820116 972559929 973609746 974128604 974352121 974569678 974791408
3579.1 974791408 974928379 974735379 974005222 973345578 973735690 974397779 974436998 974314809 974513352 974806964
3599.5 974806964 975100756 975342214 975206852 974785566 974532008 974328279 974147737 974242210 974366009 974618196
3619.9I74618196O43254N20885q9407o13272m8638O91057O03497L39686Q4579j13666
3640.3I76636171p6472p1168n12660r19223r477R88364O78242J73270K34008L25561
3660.6I77446616K58803J46329j35600m31359j38879P3850l72171j24335M31895L40044
3681I77495193J13905n9247l33369n23686o6698M01497M32491L33846J47045N2392
3701.4I77993369K86102L31939j7405l82364l21388J39773L15130J64509l7551k57731
3721.8I78214383m41134m2677O44922M25995o41823j183093j33872Q22366N63562n7042
3742.2I78171587l46065n96k0623l59654J4782N65767O23643N07415L67224O4492j98543
3764.7I79389429k31564l60191k09927L58104M48168R6440j20878n6505j46091k03312
$$ plain form
3619.9 974618196 975261450 975782335 975692928 975079656 975031018 975722075 976325572 976665258 976749837 976636171
3640.3 976636171 976559699 976488531 975975871 975056648 975047171 976035535 976713777 976887047 977121055 977446616
3660.6 977446616 977705419 977851748 977716148 977284789 977145910 977219760 976847589 976723254 977155149 977495193
3681 977495193 977609098 977549851 977216482 976692796 976626098 977027595 977460086 977793932 977940977 977993369
3701.4 977993369 978279471 978611410 978594005 978211641 977890253 978030026 978345156 978509665 978472114 978214383
3721.8 978214383 977773249 977730572 978375494 978801489 978159666 976976573 976842701 977665067 978228629 978171587
3742.2 978171587 977825522 977824926 977804303 977444649 977459431 978025198 978648841 979156256 979523480 979587972 979389429
3764.7 979389429 979157865 978797674 978587747 978945851 979394019 979490459 979369581 979313076 979166985 978963673
3785I78963673R6679L00288K83420J2100m15146l48866p3314j07229J83702M74691
3805.4I79369998L47495M2915k66850n21600n69761j70052J6630K54691N92112J24872
3825.8I79220450q9228K66015K63512j34468o31928o33597j62542O3479M40418N71907
3846.2I79174018J04368m36366p65502j50145O48261N52475J24514l29852j93477J65046
3866.6I78893340j96457m15147J20581M45246J51336l69370k25126J86145O974Q344
3887I78605866Q6725l7789K46525M90427k0922p40408p30873j21295M75466P19488
3907.4I78973210O25193L72529j63913p73787o83189Q2553M58061K12670J00076J54555
3927.8I79357958j40786l31700k0385K79844K64764n0724k81751P0631K36929j35720
$$ plain form
3785 978963673 979060352 979360640 979644060 979656160 979241014 978892148 978818834 978711605 978895307 979369998
3805.4 979369998 979717493 979760408 979493558 978971958 978402197 978232145 978248775 978503466 979095578 979220450
3825.8 979220450 979131222 979397237 979660749 979526281 978894353 978260756 978098214 978161693 978602111 979174018
3846.2 979174018 979278386 978842020 978076518 977926373 978574634 979127109 979251623 978921771 978728294 978893340
3866.6 978893340 978696883 978281736 978402317 978847563 978998899 978629529 978404403 978590548 978597522 978605866
3887 978605866 978692591 978654802 978901327 979391754 979370832 978630424 977899551 977778256 978253722 978973210
3907.4 978973210 979598403 979970932 979807019 979033232 978350043 978432596 978890657 979103327 979203403 979357958
3927.8 979357958 979217172 978885472 978865087 979144931 979409695 979358971 979077220 979147851 979384780 979249060
3948.2I79249060j10626K13325K46286J54853J06514k5392j25646k6525K6167n2214
3968.6I79655802m1604J7703p689R358n603l576R9897O7830M3809K13326K37882p153
3993.1I80279982q8930K4378
3997.1I80215430
$$ plain form
3948.2 979249060 979138434 979351759 979598045 979752898 979859412 979834020 979708374 979681849 979708016 979655802
3968.6 979655802 979614198 979631901 979624212 979633570 979627967 979624391 979724288 979792118 979835927 980049253 980287135 980279982
3993.1 980279982 980191052 980215430
3997.1 980215430
##END=$$ End of the data block
