##TITLE=AM 02 $$ Begin of the data block
##JCAMP-DX=5.00 $$ ACD/SpecManager v 10.08
##SPECTROMETER/DATA SYSTEM=Alpha
##DATE=23 Oct 2014 09:00:34
##DATA TYPE=INFRARED SPECTRUM
##DATA CLASS=XYDATA
##ORIGIN=
##OWNER=
##NPOINTS=1667
##FIRSTX=599.57470703
##LASTX=3997.16503906
##MAXX=3997.16503906
##MINX=599.57470703
##MAXY=0.97324365
##MINY=0.66858935
##XFACTOR=1.0000000000
##YFACTOR=1.000000000000000e-9
##FIRSTY=0.74813342
##DELTAX=2.03937006
##XUNITS=1/CM
##YUNITS=ARBITRARY UNITS
##XYDATA=(X++(Y..Y))
599.6G48133421l042042l149748k762199j336336Q54016K791941L921270L756285K400219
617.9G51566827O15120j237094k356291k104342j703680k113819k241552j157045K6345
636.3G39294469j19030r61006j239478q35956k40445J69874N60283J079560J736581
654.6G39444852K432227L032088L430963L504753L260374L970265N656481M831553
671G69563556M150927M246354L870606L465116L143132K804279K408445K068877J929999
689.3G97651291J784265J460731R24349L23236J6808l03805p07209k59757J218796
707.7H02108705K129257J739561R24588j7703q41558j082540r44972j077354j423418
726H01514566j297414o24180l34680q28922j521647k582610m099607n257607n924344
$$ y = [748133421, 745091379, 741941631, 739179432, 737843096, 738697112, 741489053, 745410323, 749166608, 751566827, 752181947, 750944853, 748588562, 746484220, 744780540, 742666721, 740425169, 739268124, 739294469, 739175439, 738214433, 736974955, 736138999, 735898554, 736068428, 736628711, 737708271, 739444852, 741877079, 744909167, 748340130, 751844883, 755105257, 759075522, 764732003, 769563556, 773714483, 777960837, 781831443, 785296559, 788439691, 791243970, 793652415, 795721292, 797651291, 799435556, 800896287, 801820636, 802143872, 802160680, 801856875, 801149666, 800889909, 802108705, 804237962, 805977523, 806902111, 806884408, 806042850, 804960310, 804015338, 802937984, 801514566, 800217152, 799592972, 799258292, 798429370, 796907723, 794325113, 790225506, 784967899, 779043555]
744.4G79043555o428718o108046l939867o01411J865268K974272L016710J160502k528667
762.7G68453598o346881q132041n455434K798080J1189401J1024058L875077p92146
779G76613712L21091K798140J407921l719211p231593n707621r35317L323913M351616
797.4G71222651K312243k0087q41796n21779j07289o68644k285898k682328J344263
815.7G67751336Q446813J2865305J2479365R772360O446838K934695k69592l109575
832.1H17317545n758285p860243q803249q243322o082356k823889P99000M489124P384658
850.4G90418983Q178293O859601M374623J527965p45892j371086R6440L210724O812632
868.8H19362283R276747R847880Q971333P143200N038082L436804K138376O88911k94328
$$ y = [779043555, 772614837, 766506791, 762566924, 761965513, 763830781, 766805053, 769821763, 770982265, 768453598, 762106717, 753974676, 748519242, 751317322, 762506723, 773530781, 777405858, 776613712, 776934803, 779732943, 781140864, 777421653, 770190060, 764482439, 763547122, 766871035, 771222651, 773534894, 773514807, 772673011, 772151232, 772043943, 771375299, 769089401, 766407073, 767751336, 776198149, 789063454, 801542819, 811315179, 817762017, 820696712, 820427120, 817317545, 811559260, 803699017, 794895768, 786652446, 780570090, 777746201, 778545201, 783034325, 790418983, 798597276, 805456877, 809831500, 811359465, 810613573, 809242487, 809338927, 812549651, 819362283, 828639030, 838486910, 847458243, 854601443, 859639525, 863076329, 865214705, 865903616, 865609288]
887.1H65609288o34730j062631j404464j349986j261354j320421j498938j660585j776755
905.5H53639424k006292k255202k324164k080798j255333p2062N99861N04732k75552
923.8H44474614j720190k898515l089428k888560k958298l331899l720463l530025
940.1H20337236k510309j589358j482844j670063j761854j644611j235604q52585m52519
958.5H07137489J79887Q24154J176536J145243J000047Q57234N98729K46584k00987
976.9H12964916o14464p82847o23584k6167P78556Q31366l74675k027154l302991m241109
997.3H02581847n179942o192982p133544p975876q794606r491563r917020r903550
1013.6G37992764q528352m325390K135754O498515M970074m14193m848122o384671
$$ y = [865609288, 864974558, 863911927, 862507463, 861157477, 859896123, 858575702, 857076764, 855416179, 853639424, 851633132, 849377930, 847053766, 844972968, 843717635, 843645573, 844245434, 844750166, 844474614, 842754424, 839855909, 836766481, 833877921, 830919623, 827587724, 823867261, 820337236, 817826927, 816237569, 814754725, 813084662, 811322808, 809678197, 808442593, 807590008, 807137489, 807317376, 808141530, 809318066, 810463309, 811463356, 812320590, 812919319, 813165903, 812964916, 812350452, 811567605, 810944021, 810917854, 811696410, 812527776, 812153101, 810125947, 806822956, 802581847, 797401905, 791208923, 784075379, 776099503, 767304897, 757813334, 747896314, 737992764, 729464412, 725139022, 727274776, 733773291, 738743365, 738329172, 733481050, 727096379]
1029.9G27096379o149709n443633m424989k893269j313329j037359k536416m417718
1046.2F98879957n449533n716622n532086m975200m131794k893686j416683j74999
1062.5F68589354O78300J140356J218796J162112J317740J742661K316057L015816
1078.8F81181192L844798N408347R190261J4674008J7320454J3947308P744074L304243
1095.1G56614685J359820P50721O95765R98199K171278M183412N799770O644130P231056
1113.5G86448836P212103O246984M942298L943622L310144K709448J839280Q34882
1129.8H17487597j2099n48065n82576j78933K73764N99385Q27312P79510K53498o49094
1150.2H18250299j675070k767563l922939m778206m960239m555762l831685k936303
$$ y = [727096379, 720946670, 715503037, 711078048, 708184779, 706871450, 705834091, 703297675, 698879957, 693430424, 687713802, 682181716, 677206516, 673074722, 670181036, 668764353, 668589354, 669267654, 670408010, 671626806, 672788918, 674106658, 675849319, 678165376, 681181192, 685025990, 690434337, 699624598, 714298606, 731619060, 745566368, 753310442, 756614685, 757974505, 758725226, 759420991, 760419190, 762590468, 766773880, 772573650, 779217780, 786448836, 793660939, 799907923, 804850221, 808793843, 812103987, 814813435, 816652715, 817487597, 817475498, 816927433, 816344857, 816165924, 816439688, 817039073, 817866385, 818645895, 818899393, 818250299, 816575229, 813807666, 809884727, 805106521, 800146282, 795590520, 791758835, 788822532]
1166.5G88822532k082527j457155j062453q74757r33409r93550n31018Q2970j09255
1184.9G80861378j096845k287209l344059m002631m293620m590154m659593l835440
1201.2G52751827k277374q97229n55098j685679l640532m701197l777564j569092O51240
1219.5G34299302K230585K934515K767980J978696J011133M24683Q00550K306581M715323
1237.9G53469348P090986P099747L292919k470434o681383o993592l235101K766072
1254.2G54338562Q262933J1285305J2153923J2659729J3474464J3504386J1848808
1268.5H37528110R554743Q112192P583559P285535O798804O049216N133033M115700
1284.8H92160892L039182K026498J035094j83224j745701l572762n269408o182254
$$ y = [788822532, 786740005, 785282850, 784220397, 783345640, 782412231, 781418681, 780887663, 780970633, 780861378, 779764533, 777477324, 774133265, 770130634, 765837014, 761246860, 756587267, 752751827, 750474453, 749577224, 749022126, 747336447, 743695915, 738994718, 735217154, 733648062, 734299302, 736529887, 739464402, 742232382, 744211078, 745222211, 745646894, 746447444, 748754025, 753469348, 760560334, 767660081, 770953000, 768482566, 761801183, 754807591, 751572490, 754338562, 762601495, 773886800, 786040723, 798700452, 812174916, 825679302, 837528110, 847082853, 855195045, 862778604, 870064139, 876862943, 882912159, 888045192, 892160892, 895200074, 897226572, 898261666, 898078442, 896332741, 892759979, 887490571, 881308317]
1301.1H81308317o170094n573094l956735n11110L953696O895244O714999N429805
1317.4H88091028N924463P767618Q349657O827831M803598L606856K798855J660168
1333.8I29830074M27902l94702o02126m92573n82516r05037j348317j768827j987159
1352.1I22176719j993656j788259j362085q59619k15947M19915M99427K90990J86860
1370.5I17354345j3828k05696k30252l34919n86152j085102j835943k645135k710223
1388.8I07707095j899540j526952k280653l539741m466056m571021m418194n456627
1405.1H79548311p451951r187758p489085J99973R545386J6775012K0332336J4029503
1421.5I16301727N879581J742959q61227k662301l108323k560079k156258j316547
$$ y = [881308317, 875138223, 869565129, 865608394, 865097284, 869050980, 875946224, 882661223, 888091028, 894015491, 901783109, 910132766, 916960597, 921764195, 925371051, 928169906, 929830074, 930257976, 929863274, 929261148, 928768575, 928186059, 927281022, 925932705, 924163878, 922176719, 920183063, 918394804, 917032719, 916173100, 915957153, 916377068, 916876495, 917167485, 917354345, 917340517, 917134821, 916904569, 916569650, 915983498, 914898396, 913062453, 910417318, 907707095, 905807555, 904280603, 901999950, 898460209, 893994153, 889423132, 885004938, 879548311, 872096360, 862908602, 855419517, 855619490, 865164876, 881939888, 902272224, 916301727, 922181308, 923924267, 923063040, 920400739, 917292416, 914732337, 912576079, 911259532]
1437.8I11259532k33054r0718n64218j196444j636684j740515j753211j636744j187682
1456.1I01220262o36458l99530m04835k68638K25007M80175K62440J02579J26302j6272
1476.5I00691032J926482N933881P527292M853964J546382n22136j520038j785576
1492.8I18651283k741218m583180n922973o090105o164073q797706j5905439j4483750
1509.1H53962839q957148o896377n523681n701065p118166r512305q766055n073071
1525.5G96414971k140402O62088M110455R963394J2814104J3339997J9756496K1280765
1541.8H76201868J4142990J1228264R344935Q316159P340133N865038M366875L925740
1558.1I40732002L907085J883387P09594K36928k82943o27339p11739j201034k274275
$$ y = [911259532, 911026478, 910935760, 910371542, 909175098, 907538414, 905797899, 904044688, 902407944, 901220262, 900583804, 900184274, 899779439, 899510801, 899735808, 900215983, 900478423, 900581002, 900707304, 900691032, 902617514, 908551395, 916078687, 920932651, 922479033, 921956897, 920436859, 918651283, 915910065, 911326885, 905403912, 899313807, 893149734, 884352028, 868446589, 853962839, 845005691, 838109314, 832585633, 826884568, 819766402, 810254097, 801488042, 796414971, 794274569, 794936657, 799047112, 809010506, 821824610, 835164607, 854921103, 876201868, 890344858, 901573122, 910918057, 919234216, 926574349, 932439387, 936806262, 940732002, 944639087, 946522474, 947232068, 947468996, 947186053, 946558714, 945846975, 944645941, 942371666]
1576.4I42371666k475619k479017l685593n591810p895648j0101975j0770618q262337
1592.8H91109049k971947K805412O582320P564306O498992M468441K261699M35471
1609.1I18753743k71916L27289K216339M902065M892170L268719K130508Q74937j21594
1627.4I36972260p00354r58681j338899j853943r01044L49284N23924J60337m76718
1645.8I31776166q76844o30021r67920j667440r34183p44820j346529j961290k111733
1664.1I20535386k026856k615393l490209l369570m142940n792737o517231p211566
1680.5H85368884r434939j4664054j4795959j2769401j3468087j1726260r189665n625427
1696.8G93695092J206339Q781492R958625J0562122J2405872J0054827O454468L364861
$$ y = [942371666, 939896047, 937417030, 933731437, 928139627, 920243979, 910142004, 899371386, 891109049, 888137102, 890942514, 897524834, 905089140, 911588132, 916056573, 918318272, 918753743, 918481827, 918809116, 921025455, 925927520, 930819690, 934088409, 936218917, 937093854, 936972260, 936271906, 935313225, 933974326, 932120383, 931219339, 931568623, 932092547, 932252884, 931776166, 930899322, 930269301, 929301381, 927633941, 926699758, 925954938, 924608409, 922647119, 920535386, 918508530, 915893137, 912402928, 909033358, 904890418, 899097681, 892580450, 885368884, 875933945, 861269891, 846473932, 833704531, 820236444, 808510184, 799320519, 793695092, 794901431, 803682923, 813641548, 824203670, 836609542, 846664369, 853118837, 856483698]
1713.1H56483698J011610o48916k033353l023743l702462l866553l037811j731038
1729.4H39451432J45257L502547O340623O187737P663906R566724J0072530J0950565
1745.7H93881321J1774778J2933433J2859345R969354P583379O180346M446388L347873
1762I62976217K413333J343727P61807N03599L32296K04921J76668K1756j70112k52068
1782.4I68312144k09033p1764j14322k65062j03831J59323J41204j5080r8169J33276
1802.8I67868686K16007L8803o5029q9526P212O5446j1087j3709k4974j38819p8261
1825.3I67774749K1100p0334o973J86026J77979P9751K384j37269k36452j07944Q5235
1847.7I67768252J13964K6822n8472r0778q2314p9691r5129j19508k65062l66747k5988
$$ y = [856483698, 857495308, 856846392, 854813039, 851789296, 848086834, 844220281, 841182470, 839451432, 839596689, 843099236, 849439859, 855627596, 863291502, 872858226, 882930756, 893881321, 905656099, 918589532, 931448877, 941418231, 949001610, 955181956, 959628344, 962976217, 965389550, 966733277, 967495084, 967998683, 968330979, 968535900, 968712568, 968734324, 968564212, 968312144, 968103111, 968031347, 967917025, 967651963, 967548132, 967707455, 967848659, 967833579, 967735410, 967868686, 968084693, 968123496, 968058467, 967968941, 967976153, 968041599, 968030512, 968016803, 967991829, 967853010, 967774749, 967795849, 967725515, 967718542, 967904568, 968082547, 968162298, 968164682, 968027413, 967790961, 967683017, 967768252, 967882216, 967909038, 967850566, 967759788, 967677474, 967597783, 967502654, 967383146, 967118084, 966751337, 966725349]
1870.1I66725349K87593J55389o0737j00136p2896j12117j37448q4996j00076j45257
1890.5I66354668j94132k79010k01463j46628k04622p5996J40428J68562J20521J72913
1910.9I65855241J65939m9710k42770j65880k7298Q9585J69456N5969m4107m888M5419
1933.3I65846956k980r6560j11461j42812j08600P3552J08421O020m0948m8280o3300
1955.8I65420008j3709Q1002M7028p4744q9168L6478J10864L1174k9326j0788p5400
1978.2I65433419j27435n2929k1219k5571j5735r6679j35839N305J19388J02162K9683
2000.6I65214550n9K324l4987j07706j48773q6367k9087J192N8591O3479m351r5010
2025.1I64833796j01507p331L8326o676m6134n4061p0870p9334o6698l5822K2173M5776
$$ y = [966725349, 967012942, 967168331, 967107594, 967007458, 966934562, 966822445, 966684997, 966600001, 966499925, 966354668, 966160536, 965881526, 965680063, 965533435, 965328813, 965252817, 965393245, 965561807, 965682328, 965855241, 966021180, 965971470, 965728700, 965562820, 965535522, 965625107, 965794563, 965850532, 965806425, 965801537, 965846956, 965843976, 965747416, 965635955, 965493143, 965384543, 965458095, 965566516, 965572536, 965531588, 965483308, 965420008, 965406299, 965487301, 965534329, 965459585, 965370417, 965406895, 965517759, 965548933, 965519607, 965508819, 965433419, 965305984, 965253055, 965231836, 965206265, 965190530, 965093851, 964958012, 964963317, 965082705, 965184867, 965214550, 965214491, 965216815, 965181828, 965074122, 964925349, 964838982, 964809895, 964811087, 964869678, 964933157, 964928806, 964833796, 964732289, 964724958, 964763284, 964756608, 964710474, 964656413, 964585543, 964506209, 964439511, 964403689, 964425862, 964471638]
2049.6I64471638L3915L0160K1219m410n842K8372J9968J9550M3512Q583l6717m6611
2074.1I64583337l2365o020J9550M0949L2663k4498p3909q0884q4638n0843J6808J8776
2098.5I64358926k9445m4703k1220J491J3589K2233j7762n2929Q464M1663j0609o557
2123I64263141N0783O8844M0471Q941K5034K4676m8280p4088k0385M9114Q1659O735
2147.5I64476645m7445J5795K9445l5346m9114k6286k0683n6147r9302l3438O9022
2169.9I64223146P511j14799q8155k9981l7909k1338j6094m1663j6392n304p4923j10746
2194.4I63673353m7862M4465P0929M0114P987k9206p749N7757N5433j0968q0228j06096
2218.9I63667929q0705l4391L3080Q2910N0307k0981p5698p2181l6598l0756L2485
$$ y = [964471638, 964505553, 964535713, 964556932, 964552522, 964546680, 964575052, 964595020, 964614570, 964658082, 964666665, 964629948, 964583337, 964550972, 964544952, 964564502, 964605451, 964638114, 964613616, 964539707, 964458823, 964374185, 964323342, 964340150, 964358926, 964329481, 964284778, 964263558, 964265049, 964278638, 964300871, 964283109, 964230180, 964238644, 964280307, 964269698, 964263141, 964313924, 964382768, 964423239, 964432180, 964457214, 964481890, 964433610, 964359522, 964339137, 964388251, 964469910, 964476645, 964429200, 964444995, 964474440, 964439094, 964389980, 964363694, 964343011, 964286864, 964187562, 964154124, 964223146, 964230657, 964115858, 964027703, 963997722, 963959813, 963938475, 963922381, 963880718, 963864326, 963859022, 963784099, 963673353, 963625491, 963669956, 963740885, 963780999, 963788986, 963759780, 963752031, 963809788, 963865221, 963854253, 963774025, 963667929, 963587224, 963552833, 963585913, 963668823, 963719130, 963698149, 963622451, 963550270, 963513672, 963482916, 963515401]
2241.3I63515401P5579k9803j01208n2393k5570o9022j03593n6804P272R239j252k3186
2265.8I63144660p5877j10268n5433L5048L2902l219m4405j5200J38462J81675N8293
2288.2I63286638n245L2067K0504K921O4671J28388Q8215l6478p2658l218L7491O6459
2312.7I63609755J18852J40428J37389J10030J22070J84894J62602P4505J79649M96924
2333.1I65337098M30524N0306q4757k08200m51743m87268k13087J40071M13358O03736
2353.5I65530038O26087L28600j60932l21567j77086k63512l26872k92539l88086l74079
2373.8I64180052k34842j18196m0233R5784J72079L6299n1736L3676J41502J48415
2394.2I64362800j371p5102N3883J28508M3332o1571j10865q4579N603O4611O8724
$$ y = [963515401, 963590980, 963561177, 963459969, 963407576, 963382006, 963312984, 963209391, 963152587, 963159859, 963169098, 963167846, 963144660, 963068783, 962958515, 962903082, 962938130, 962971032, 962967813, 962923408, 962908208, 963046670, 963228345, 963286638, 963281393, 963313460, 963333964, 963336885, 963401556, 963529944, 963618159, 963581681, 963509023, 963505805, 963543296, 963609755, 963728607, 963869035, 964006424, 964116454, 964238524, 964423418, 964586020, 964660525, 964840174, 965337098, 965767622, 965817928, 965733171, 965524971, 965073228, 964585960, 964372873, 964512944, 964926302, 965530038, 966156125, 966484725, 966323793, 966002226, 965825140, 965561628, 965234756, 964942217, 964554131, 964180052, 963945210, 963827014, 963786781, 963882565, 964054644, 964090943, 964039207, 964072883, 964214385, 964362800, 964361429, 964286327, 964340210, 964468718, 964512050, 964450479, 964339614, 964255035, 964260638, 964325249, 964393973]
2416.7I64393973O2228L9100J8537J5497N723j5140o139l1650j36614j35005q166O6460
2441.1I64268804L5286J6450O8546L1292r6619j12891J5795J03414K4378r0241j05083
2463.6I64159131p5698m4644j2457n6088r0480J8597J07884N6923q941o1393n9843
2486I63932991L6836L9935l5882n4240q2553j13368n8949L5405P5579M4823n901K7835
2510.5I63842511Q1778L9935k1756n1856l0398L2842P5400M9472m4465j02222p3612
2532.9I63797629K5570O4910l4571r8824q3626m4107J5914M7028N4121M9234N126k2650
2557.4I63775754j4782m9353m4763K3127l100j00195p0095J23322K24829Q0764p2777
2579.8I63872731q6904j11699j69754j53124n5015P7605J89006J67370j2994j29819
$$ y = [964393973, 964456201, 964495301, 964513838, 964529335, 964535058, 964519918, 964513779, 964482129, 964345515, 964210510, 964202344, 964268804, 964304090, 964320540, 964389086, 964420378, 964323759, 964210868, 964226663, 964330077, 964354455, 964264214, 964159131, 964083433, 964038789, 964026332, 963970244, 963879764, 963898361, 964006245, 964063168, 964054227, 963992834, 963932991, 963969827, 964009762, 963973880, 963919640, 963837087, 963723719, 963664770, 963700175, 963775754, 963820577, 963814676, 963842511, 963924289, 963964224, 963942468, 963890612, 963860214, 963893056, 963968456, 964017928, 963973463, 963871241, 963797629, 963823199, 963888109, 963853538, 963754714, 963671088, 963626981, 963642895, 963689923, 963744044, 963793278, 963798404, 963775754, 963760972, 963711619, 963666856, 963689983, 963686883, 963586688, 963516593, 963639915, 963864744, 963945508, 963872731, 963785827, 963674128, 963504374, 963351250, 963296235, 963373840, 963562846, 963730216, 963717222, 963587403]
2600.2I63587403p4327j8298k5571m7147n6267j9073J1801L9042M3690m7803j11521
2622.6I63281929o9856j9431K980J9491L695l3796p1764r7334m0352L4511o0n2810
2647.1I62957203M352K0384r1850j05978k1755n7340j49369r0897M0412K7537K4259
2669.5I62556958J26243N9903r3163j25885j33931j17958n4359j9372n2988j15037
2689.9I62030411j34289q0169J8776J2457p6592m3750K3485N424k385p867m6254p6770
2714.4I61622477j54019j86503q5652p7128j62482j27316j5676K9624o6161j86503
2734.8I60590661j14739k9266j19090j24991r656L5763L2126m8339j78873k15173j77026
2757.2I59641397o6280Q3565O2526j24038j75058n6804n5968j61767j43350o0320j26838
$$ y = [963587403, 963513076, 963494778, 963469207, 963422060, 963365793, 963346720, 963358521, 963397563, 963441253, 963393450, 963281929, 963212073, 963192642, 963195622, 963215113, 963218808, 963185012, 963113248, 963015914, 962975562, 963010073, 963010013, 962957203, 962961555, 962981939, 962890089, 962784111, 962762356, 962705016, 962555647, 962464750, 962505162, 962532699, 962556958, 962683201, 962743104, 962649941, 962524056, 962390125, 962272167, 962217808, 962198436, 962145448, 962030411, 961896122, 961815953, 961834729, 961847186, 961770594, 961726844, 961750329, 961755753, 961753368, 961745501, 961699247, 961622477, 961468458, 961281955, 961196303, 961119175, 960956693, 960829377, 960813701, 960843325, 960777164, 960590661, 960475922, 960446656, 960327566, 960202575, 960192919, 960228682, 960260808, 960212469, 960033596, 959818423, 959641397, 959575117, 959658682, 959721208, 959597170, 959422112, 959365308, 959309340, 959147573, 959004223, 958943903, 958817065]
2779.7I58817065k91705l72172l66330l06547k34902j84357j32203j29163j14918k1398
2800.1I56663370J0371l159M7744N3405n3942j36256j70708k88248m26411n03183n95331
2822.5I54597652p19428q55625r74595j109958j377642j691282j942873k219319k588094
2840.8I41118836l235101m146219m405975l002584n67794J057685J295149J058459
2857.2I29172456J012564J100004J080990R61661Q92937Q96931R44197J055360J201689
2875.5I38318789J250148J050949N89907J0908n75364j121521j527250j730144j751125
2893.9I34515297j611769j333177j051843r31263q79943r38237j406252k260447l065646
2912.2I21036720l147363k115488m00365J009584J555204J451075J083791P90000O22213
$$ y = [958817065, 958525360, 958153188, 957786858, 957480311, 957245409, 957061052, 956928849, 956799686, 956684768, 956663370, 956673741, 956670582, 956718326, 956771731, 956717789, 956581533, 956410825, 956122577, 955696166, 955192983, 954597652, 953878224, 953022599, 952048004, 950938046, 949560404, 947869122, 945926249, 943706930, 941118836, 937883735, 933737516, 929331541, 926328957, 925761163, 926818848, 928113997, 929172456, 930185020, 931285024, 932366014, 933327675, 934220612, 935117543, 936061740, 937117100, 938318789, 939568937, 940619886, 941209793, 941220701, 940645337, 939523816, 937996566, 936266422, 934515297, 932903528, 931570351, 930518508, 929587245, 928707302, 927769065, 926362813, 924102366, 921036720, 917889357, 915773869, 915373504, 916383088, 917938292, 919389367, 920473158, 921263158, 921885371]
2930.6I21885371M34518K92897K64943L36289M89295N41389L95715O0737m99010j049101
2951I23153043j381815j529455j288772l24726J271248L062368M531502N189300N052924
2969.3I37735617M503191L755927K980172K398432K007544J694083J444399J191795
2985.6I57711160R11892P17342O23881M80950K91407K74539M03822L70502K30789J99616
3006I62215900J43052P9870O4134K8134M4465K1338j16646k14577k72870l44157l41654
3028.5I61306989k70903j53899p9215j79767l07441k70605m8220K08199K32756J50263
3048.9I60588157K49028L06428Q3268o4075J19805K50101J49906N7339J05203J85191
3069.2I62030351J62184Q9646q464n0426J7524M3929L3974M2737M411o2764p7486n7817
$$ y = [921885371, 922319889, 922612786, 922877729, 923214018, 923703313, 924244702, 924640417, 924701154, 924202144, 923153043, 921771228, 920241773, 918953001, 918628275, 919899523, 922961891, 927493393, 932682693, 937735617, 942238808, 945994735, 948974907, 951373339, 953380883, 955074966, 956519365, 957711160, 958623052, 959340394, 959964275, 960445225, 960736632, 961011171, 961414993, 961785495, 962016284, 962215900, 962358952, 962438822, 962502956, 962531090, 962575555, 962596893, 962480247, 962265670, 961992800, 961648643, 961306989, 961036086, 960882187, 960802972, 960623205, 960315764, 960045159, 959996939, 960205138, 960437894, 960588157, 960837185, 961143613, 961226881, 961162806, 961282611, 961532712, 961682618, 961739957, 961845160, 962030351, 962192535, 962282181, 962273717, 962223291, 962240815, 962284744, 962318718, 962361455, 962365866, 962303102, 962225616, 962167799]
3093.7I62167799n3107k6286k6643q3924j43170k31922k32696j39594j57297k41458
3114.1I60831702k03014q3804j8298M1723J17719J31726J12534J92046K26557O1333
3134.5I61410224l0458R1017J93238J32918K2650n9605j15811j10150j4484M7922l0994
3156.9I61536467j15216k08318k60472l9876J62840l4630l50714m04358k84850k43605
3177.3I59757268k30074j59502j33097j49905j28270m4465J4365k5093q0705j13487
3197.7I58707035r7692L2305J53780J17064l2246j64867k53379l18825k40803j39713
3218.1I57762659j81973j81735l3557M2975j42873l63946l71098l05593k98679k28763
3238.5I55697417j66297k54154k65121j24038j44839l58522m52995l59297k13325k09033
$$ y = [962167799, 962114692, 962088406, 962061763, 961977839, 961834669, 961602747, 961370051, 961230457, 961073160, 960831702, 960628688, 960544884, 960526586, 960568309, 960686028, 960817754, 960930288, 961122334, 961348891, 961410224, 961379766, 961470783, 961664021, 961796939, 961819589, 961759984, 961644173, 961534023, 961519539, 961567461, 961536467, 961421251, 961212933, 960952461, 960912585, 961075425, 961040795, 960690081, 960285723, 960000873, 959757268, 959527194, 959367692, 959234595, 959084690, 958956420, 958911955, 958926320, 958901227, 958820522, 958707035, 958609343, 958641648, 958795428, 958912492, 958880246, 958715379, 958462000, 958143175, 957902372, 957762659, 957580686, 957398951, 957365394, 957408369, 957265496, 956901550, 956530452, 956224859, 955926180, 955697417, 955531120, 955276966, 955011845, 954887807, 954742968, 954384446, 953931451, 953572154, 953358829, 953149796]
3258.9I53149796l33965m06027n03898m97579l18408l17216n59807q19922q71479p24673
3279.3I47796822n95451n91099p45475r26495r58323r85623j138329j208365j122356
3297.7I39525306r72152o99341m97579o12438p96795p31885m59493j78575P1764K51412
3318I34900224K87295K86161L56675N84244R84431J450717J704991J530290J292050
3336.4I43377078J259505J172722J020729R27508Q48591Q72195J007855J026869Q86202
3354.8I52399254P23421N75841M80235M45723M36902N02050N56290N93066N99564L35991
3375.1I57648337Q6248K03073L55840L09944K46405K24233J41144J05858J61588J19686
3395.5I59602356J4842M5359J77621K45750J89603Q4698N6088J35243K09510J64688
$$ y = [953149796, 952815831, 952409804, 951905906, 951408327, 951089919, 950772703, 950212896, 949392974, 948521495, 947796822, 947201371, 946610272, 945864797, 944938302, 943979979, 942994356, 941856027, 940647662, 939525306, 938553154, 937853813, 937356234, 936743796, 935947001, 935215116, 934755623, 934577048, 934648812, 934900224, 935187519, 935473680, 935830355, 936414599, 937399030, 938849747, 940554738, 942085028, 943377078, 944636583, 945809305, 946830034, 947757542, 948606133, 949478328, 950486183, 951513052, 952399254, 953122675, 953698516, 954178751, 954624474, 955061376, 955563426, 956119716, 956712782, 957312346, 957648337, 957734585, 957937658, 958293498, 958603442, 958849847, 959074080, 959215224, 959321082, 959482670, 959602356, 959617198, 959662557, 959840178, 960085928, 960275531, 960360229, 960416317, 960551560, 960761070, 960925758]
3415.9I60925758J08242P7724L6657N1618k3961j01865m76K0444o2346n3227K026J34289
3440.4I61114883K74599K07901J34707K29537K43902J07527k4736m2319R7692J56104
3460.8I62499797p867j09196o3539M351O8605J44780J76907J5437j64926k5570K68638
3483.2I62807417L18825J56582L1769K503n0545j13308Q047J47104Q4996L4094J0371
3505.7I63437855l3378P7963K25722K53260J74761L2425j52170k95222j50204J08421
3526.1I63679433J30951J78933K84851J02460k5391J54435J39654o1512k2948K04206
3546.4I64765072K84314J36912O2466K01284K14220l636j52529k45869m31359j97231
3566.8I64633644N09560O30438L28541K49088L12090K25305J00732o5684m42922l79920
$$ y = [960925758, 961034000, 961111724, 961148381, 961199999, 961176038, 961074173, 961073697, 961094141, 961031795, 960978568, 960980594, 961114883, 961389482, 961597383, 961732090, 961961627, 962205529, 962313056, 962288320, 962246001, 962343693, 962499797, 962491930, 962382734, 962319195, 962323546, 962392151, 962536931, 962713838, 962729275, 962564349, 962538779, 962807417, 963126242, 963282824, 963314593, 963317096, 963266551, 963153243, 963161290, 963308394, 963393390, 963427484, 963437855, 963404477, 963482440, 963708162, 963961422, 964136183, 964168608, 964016438, 963721216, 963571012, 963679433, 963810384, 963989317, 964274168, 964376628, 964351237, 964505672, 964645326, 964583814, 964560866, 964765072, 965049386, 965186298, 965248764, 965450048, 965664268, 965660632, 965508103, 965262234, 964830875, 964633644, 965143204, 965773642, 966102183, 966351271, 966663361, 966888666, 966989398, 966923714, 966480792, 966100872]
3587.2I66100872L83615M39405r4711j71662J75953L76046L55065K80022J1623l67641
3607.6I67488587l76999j75655O318Q8393k1636K38120O69778M37856j07766k93493
3628I67953503J52052M63903L75509J51872j60157k01226R9183N4836m22239m83334
3648.4I67983902L42071P57873L65853L8862J59025K03908K00927L63112K95937n9665
3668.8I70651805k67148k04444q4102J43349J57595J01328P4804k42889o23882m28438
3689.2I69277978J33932K76088K94686L06785J13606P8023L63588L87728J74046m1366
3709.6I71365094j75059j3888J58251J78575J09732r8824j84178J99854N08010J12892
3730I72160459o26386p39812N7160M18961J35959p5341o556J07169m4525k31862q4638
$$ y = [966100872, 966484487, 966923892, 966829181, 966657519, 966833472, 967209518, 967564583, 967844605, 967856228, 967488587, 967111588, 966935933, 966942251, 967030644, 967009008, 967247128, 967916906, 968354762, 968246996, 967953503, 968105555, 968569458, 968944967, 969096839, 968936682, 968735456, 968834639, 968889475, 968467236, 967983902, 968325973, 969083846, 969449699, 969488561, 969647586, 969851494, 970052421, 970415533, 970711470, 970651805, 970384657, 970180213, 970096111, 970239460, 970397055, 970498383, 970573187, 970330298, 969706416, 969277978, 969411910, 969687998, 969982684, 970289469, 970403075, 970481098, 970844686, 971232414, 971406460, 971365094, 971190035, 971176147, 971334398, 971512973, 971622705, 971523881, 971339703, 971539557, 972047567, 972160459, 971534073, 970794261, 970851421, 971270382, 971406341, 971331000, 971324444, 971431613, 971387088, 971155226, 971070588]
3752.4I71070588K77698K98917J19805J58131J69993l4154j01804m3810K8909K38537
3772.8I72182810K56718l0101j99377n8175L3796J1802Q8751J97351J98663M3034j77443
3795.2I72547829k05278j88470k59519N5313L12090J06752n7697J1742l5703k20657
3815.6I72066402j68800q762J92046L27468J19388l039J0311j09851j36912J2159n722
3838.1I72294688k01523j05560J31488J36435j5616k57791l42309J82152M47929K24232
3858.5I72494125r8109l40164J073M24743P6413m19319j66773L57926L30746j81794
3878.9I72478867l58344j28030n0187J38461K58386J57237J76370M5419l95655o62029
3899.2I71660495m05789N7996L72111N03600N10335K97427j41680m68969l97921k5988
$$ y = [971070588, 971348286, 971647203, 971767008, 971925139, 972095132, 972060978, 971959174, 971915364, 971944273, 972182810, 972439528, 972409427, 972210050, 972151875, 972185671, 972197473, 972286224, 972483575, 972682238, 972725272, 972547829, 972342551, 972154081, 971894562, 971949875, 972261965, 972368717, 972311020, 972322762, 972287059, 972066402, 971897602, 971888840, 972080886, 972408354, 972527742, 972524703, 972535014, 972425163, 972288251, 972300410, 972294688, 972093165, 971987605, 972119093, 972255528, 972239912, 971982121, 971639812, 971821964, 972269893, 972494125, 972396016, 972055852, 972056925, 972481668, 972558081, 972138762, 971971989, 972329915, 972660661, 972478867, 972120523, 971992493, 971942306, 972080767, 972339153, 972496390, 972672760, 972718179, 972322524, 971660495, 971254706, 971312702, 971684813, 972188413, 972698748, 972996175, 972854495, 972385526, 971987605, 971961617]
3919.6I71961617K44081J89901J25766O7711k93374l62933R3460K23219L2366l8326
3940I72243488k7895J03950J93060J2278k9146J23083J27137L7968k0921L8683J17839
3962.5I72919524N5015n8592j42276j05500J6749J9193o9261o3777P5579J81079K35617
3984.9I73063350J80304o1333j81735r7871o55P1764
3997.1I72973824
$$ y = [971961617, 972205698, 972395599, 972521365, 972589076, 972295702, 971932769, 972026229, 972249448, 972281814, 972243488, 972215593, 972319543, 972512603, 972524881, 972495735, 972618818, 972745955, 972783923, 972763002, 972801685, 972919524, 972974539, 972915947, 972773671, 972668171, 972684920, 972704113, 972634852, 972571075, 972646654, 972827733, 973063350, 973243654, 973182321, 973000586, 972902715, 972902060, 972973824]
##END=$$ End of the data block
