##TITLE=AM 01 $$ Begin of the data block
##JCAMP-DX=5.00 $$ ACD/SpecManager v 10.08
##SPECTROMETER/DATA SYSTEM=Alpha
##DATE=23 Oct 2014 09:00:34
##DATA TYPE=INFRARED SPECTRUM
##DATA CLASS=XYDATA
##ORIGIN=
##OWNER=
##NPOINTS=1765
##FIRSTX=399.76428223
##LASTX=3997.64306641
##MAXX=3997.64306641
##MINX=399.76428223
##MAXY=0.85661495
##MINY=0.25412238
##XFACTOR=1.0000000000
##YFACTOR=1.000000000000000e-9
##FIRSTY=0.83764082
##DELTAX=2.03961372
##XUNITS=1/CM
##YUNITS=ARBITRARY UNITS
##XYDATA=(X++(Y..Y))
399.8H37640822J315474J256705R62257P19547M54903L75688M85897J54138k27332
418.1H43138099L4570J729j15573L16679L74138l14474p48992l86119R1553J99855
438.5H42591465L37302O78897Q50260P97391L89457k70128n19097j75774L48151K77698
458.9H45305622m20273q22365q59439p91192n76020m57644p41244j303136k071381
477.3H37262928k832710k564729j372933p79390r36508j216412j772642k810538m302859
495.6H18674207o093979q729696j5003384k6112973l1513155j9448340j797616M710257
511.9G14685321M423022K864957P169485K0567894K6970327K0484030J1881471O226718
528.3H15273225K692998R77218K84374j61231k33531K25723O06835O05523N01395L20136
$$ plain form
399.8 837640822 838956296 840213001 841175258 841894805 842349708 842725396 843211293 843365431 843138099
418.1 843138099 843172669 843174398 843058825 843375504 843749642 843435168 842686176 842300057 842391610 842591465
438.5 842591465 842928767 843607664 844457924 845255315 845644772 845374644 844855547 844679773 845027924 845305622
458.9 845305622 844885349 844062984 843203545 842412353 841836333 841378689 840637445 839334309 837262928
477.3 837262928 834430218 831865489 830492556 829713166 828776658 827560246 825787604 822977066 818674207
495.6 818674207 812580228 803850532 788847148 762734175 731221020 711772680 709975064 714685321
511.9 714685321 719108343 721973300 729142785 749710679 776681006 797165036 809046507 815273225
528.3 815273225 817966223 818943441 819227815 819066584 818833053 819058776 819665611 820271134 820772529 821092665
548.7H21092665J42873o9142m16994n80668n88835q65757j095057j114249j382768
567H15122068k079487k597570k797246l260732l682077l402770k573370j770974j086533
585.4G91871309m31239N3048P5519k68757p07865j217485j985609l480435n586147
603.7G78322339p596374q286356o677628k794385J516581L593027K865553J029313
620G61972070l91424j453459k443791l519296m819930n994379n893827m547000l844797
638.4G29064167m572034n683899o424666o845414o792844o165385n161881l856719
654.7F83561325k483427j369298m49836J89781O62029K400756M519820L599882L959119
673.1F94590151N780101O856263P268846P095933O501317N818188N229473M725158
$$ plain form
548.7 821092665 821235538 821166396 820749402 820168734 819579899 818714142 817619085 816504836 815122068
567 815122068 813042581 810445011 807647765 804387033 800704956 797302186 794728816 792957842 791871309
585.4 791871309 791440070 791493118 791568637 791299880 790592015 789374530 787388921 783908486 778322339
603.7 778322339 770725965 762439609 755761981 752967596 754484177 758077204 760942757 761972070
620 761972070 761580646 760127187 757683396 754164100 749344170 743349791 737455964 732908964 729064167
638.4 729064167 724492133 718808234 712383568 705538154 698745310 692579925 687418044 683561325
654.7 683561325 681077898 679708600 679258764 679448545 680110574 682511330 687031150 690631032 694590151
673.1 694590151 700370252 707226515 714495361 721591294 728092611 733910799 739140272 743865430
689.4G43865430M097104L452957L091455K491653J366615L6597j176834j383901J9789
707.7G55860865J552045K248884K660989K283037J186192P7546r67860j772642k207459
726.1G60921597k264082k140880k327859k795637l212571l863692n084395o675184
742.4G32557297q183062r587705j0582090q694649k204239N246401Q986950P977247
758.7G15516150K689958n392015j4237523k1941662k4639547j5252412N118549J8056691
775.1F59918189J2493849J819491K701462J6362965K8751969K7971387J8629432J0160982
791.4G78809726N034864J336754k646387o302059q045614q190989q529902r908735
807.7G41557658j3169647j9703030k5904298j9518137K902031K2874653K6595295K0839453
$$ plain form
689.4 743865430 747962534 751415491 754506946 756998599 758365214 758401811 757224977 755841076 755860865
707.7 755860865 757412910 759661794 762322783 764605820 765792012 765869558 764901698 763129056 760921597
726.1 760921597 758657515 756516635 754188776 751393139 748180568 744316876 739232481 732557297
742.4 732557297 724374235 714786530 704204440 695509791 693305552 698551953 707538903 715516150
758.7 715516150 718206108 712814093 698576570 676634908 651995361 636742949 641861498 659918189
775.1 659918189 672412038 674231529 676932991 693295956 722047925 750019312 768648744 778809726
791.4 778809726 783844590 785181344 782534957 776232898 768187284 759996295 751466393 741557658
807.7 741557658 728388011 708684981 682780683 663262546 666164577 689039230 715634525 736473978
824G36473978J4108479Q696854N055427K722085J027882l08395j316845k656400m969657
842.4G58833408p657349r055078o637633M173O370961Q670509P714510N103648J805484
860.7G65152633q24153j061023K202333P540345J0915816J0125219P494986N538464
877H07084620L987730K379775J246214O81221L09706o3122m23789q20875j290142j658857
897.4H11432481j998782k628863l567517m618704n749524o879568p594884p263898
913.7G71130741n478144k590418M20868K575875L022671J428365j213312l201902l747344
932.1G62347400l585219l988564n400598o413043m935741k073586p33137q40962r94325
950.5G33382225j035929j209557j521766j798928j622915m58181J180172K022743J855016
$$ plain form
824 736473978 750582457 759279311 764334738 767056823 768084705 767776310 766459465 763803065 758833408
842.4 758833408 751176059 742120981 735483348 735487521 741858482 750528991 758243501 763347149 765152633
860.7 765152633 764328480 763267457 765469790 773010135 783925951 794051170 801546156 807084620
877 807084620 811072350 813452125 814698339 815379560 815689266 815626144 815202355 814381480 813091338 811432481
897.4 811432481 809433699 806804836 803237319 798618615 792869091 785989523 778394639 771130741
913.7 771130741 765652597 763062179 763483047 766058922 769081593 770509958 769296646 766094744 762347400
932.1 762347400 758762181 754773617 749373019 742959976 738024235 735950649 735217512 734376550 733382225
950.5 733382225 732346296 731136739 729614973 727816045 726193130 725734949 726915121 728937864 730792880
968.8G30792880J403511J042246O79136J84476n92291j648963k315104j245916J889527
987.2G30189502M764498M794895K560973K44916j157105j874566k406776k891362l406107
1005.5G30818868m425824o468356j0063827j5796125k1765709k1477997r300113Q570731
1021.8F50091648J7094195J1019945q42571r373903j3040960j4273107j4349997j2259066
1038.2F14066184p209123j888275n75006l704726q088470j1627793j4208794j5992105
1054.5E50771892j6944408j6766012j5160978j2374490r255141o878764o024420o626278
1070.8D60741401p845015q741557q619249p550865o937415p742822m917204J2395262
1087.1D20782536M2359472O2554091N9127390M2676985K6539147J3727606L053903
$$ plain form
968.8 730792880 732196391 733238637 733917773 734102249 733509958 731860995 729545891 728299975 730189502
987.2 730189502 734954000 739748895 742309868 742554784 741397679 739523113 737116337 734224975 730818868
1005.5 730818868 726393044 719924688 709860861 694064736 672299027 650821030 641520917 650091648
1021.8 650091648 667185843 678205788 677363217 667989314 654948354 640675247 626325250 614066184
1038.2 614066184 606857061 604968786 604393780 600689054 592600584 580972791 566763997 550771892
1054.5 550771892 533827484 517061472 501900494 489526004 480270863 473392099 467367679 460741401
1070.8 460741401 452896386 444154829 435535580 427984715 421047300 413304478 408387274 420782536
1087.1 420782536 463142008 525696099 584823489 627500474 654039621 667767227 670821130
1101.4F70821130n489528r612083p846356l489613j52290K012849J631796k740443
1117.7F45135462q834004j3647676j6148626j7121792j7924965j8896758j9342602
1132E33219039j8612921j6375929j2714684q191675l615737L00288L086150M349470
1148.3D81444001L720969J167059k631545o634921j0033548j2297004j3097555j2406677
1164.6D29230779j0461330p919341n507708l441334j782179q06659m92543K33412K123475
1183D01176572L890902M062742K922654J338482j08362j440256l604830o726950q939296
1201.3C92571658q594811o208003l658652l196180n884111r976297j2398184j1805802
1217.7C30849618r125024n833567k947241r96381j47789k90603j280695k748340l759742
$$ plain form
1101.4 670821130 665331602 655719519 647873163 644383550 644231260 646244109 647875905 645135462
1117.7 645135462 636301458 622653782 606505156 589383364 571458399 552561641 533219039
1132 533219039 514606118 498230189 485515505 477323830 473708093 474008381 477094531 481444001
1148.3 481444001 485164970 486332029 483700484 477065563 467032015 454735011 441637456 429230779
1164.6 429230779 418769449 410850108 405342400 401901066 400118887 399312228 398819685 399053097 401176572
1183 401176572 405067474 409130216 412052870 413391352 413282990 411842734 408237904 401510954 392571658
1201.3 392571658 383976847 377768844 374110192 370914012 365029901 355053604 342655420 330849618
1217.7 330849618 321724594 315891027 312943786 311947405 311799616 311509013 310228318 307479978 303720236
1236C03720236k391756L497333J2562751J8691779J6942352Q960485k37614o721943
1252.3C55023623p463038k13176J2696385K3232192K5308102K0889580J5039921J0638446
1268.6D55152035R417265J1596173J4405936J4664025J2088954Q475006N361437L358901
1285E34519732K412736K023459J363516n48542m449785j0246753j6435921k0497740
1301.3D88140702k1681308k1660448j9878834j2475610N93275J1627316J3608844J0944575
1317.6D49218512J3576567K3285746L1445504L1060457K6208162K2421301J7610430
1331.9F14826679J0620237M547536R80079q21888j831055k646565l545225m359543
1348.2F17770255m630685m284263l467500k085030j60396K239763M981876O425917
$$ plain form
1236 303720236 301328480 304825813 317388564 336080343 353022695 361983180 361745566 355023623
1252.3 355023623 347560585 347347409 360043794 383275986 408584088 429473668 444513589 455152035
1268.6 455152035 464569300 476165473 490571409 505235434 517324388 525799394 531160831 534519732
1285 534519732 536932468 538955927 540319443 539770901 535321116 525074363 508638442 488140702
1301.3 488140702 466459394 444798946 424920112 412444502 413037777 424665093 438273937 449218512
1317.6 449218512 462795079 486080825 517526329 548586786 574794948 597216249 614826679
1331.9 614826679 625446916 629994452 630974531 630152643 628321588 625675023 622129798 617770255
1348.2 617770255 613139570 608855307 605387807 603302777 603142381 605382144 610364020 616789937
1364.5F16789937O328166O404638O106496N267143M155755K052963l95715k832056
1380.8F43877327n812346r306252j2968421j3348461p640659Q41736P432401Q007408
1397.1F11082733N490541J224280o925643k0894289l8377762n2545667n3320378l1743764
1413.5D13990051J865476L8282812O8756461O0754180L7625074K2365630R169936o40273
1429.8F52169347o665409q815825q789480o293535j623273K275706L597438J614988
1446.1F27469957j418889l708541m853189m636645j498461K377391J486122J073182
1462.4F16290927M018247O791711N706727L942609K210200m198790j1878252l987193
1478.7F18896186K0621539L6056935K8247834J4929175O118536o30558m920303q303464
$$ plain form
1364.5 616789937 623118103 629522741 635629237 640896380 645052135 647105098 646709383 643877327
1380.8 643877327 638064981 628758729 615790308 602441847 594801188 595642924 603075325 611082733
1397.1 611082733 616573274 617797554 610871911 589977622 551599860 499054193 445733815 413990051
1413.5 413990051 415855527 454138339 522894800 583648980 621274054 643639684 652809620 652169347
1429.8 652169347 645503938 636688113 627898633 621605098 619981825 622257531 625854969 627469957
1446.1 627469957 626051068 622342527 617489338 612852693 611354232 613731623 615217745 616290927
1462.4 616290927 620309174 627100885 632807612 636750221 638960421 634761631 622883379 618896186
1478.7 618896186 639517725 675574660 703822494 718751669 724870205 724239647 719319344 711015880
1495G11015880j2526691j5830874j7007828j7973483k4355292m0005207m0891349l4692288
1511.4E07732868l0995995k4513930k0542353k2032559k8528214k8649568k3265988
1525.6C29204261j9675940j5637696j1641085n941152l30806P478237K8926641M5887977
1542C58270437M3568640M4228048M5834273M9849570M8603236M1863084L4027815L4733295
1558.3G00978398L4103036J5753687Q814215P430017N159319K963662K22266k291024
1574.6G73133576n065680p616639j0944366j7601729k7086198l8446605m9624801n4651976
1590.9E62095582m6891152k7298630k915203J8221676L0636788L2209515K5054753
1605.2E91113329J4131248L470659l114879k185702R160816K7954519L1782747K6944994
$$ plain form
1495 711015880 698489189 682658315 665650487 647677004 623321712 583316505 542425156 507732868
1511.4 507732868 476736873 452222943 431680590 409648031 381119817 352470249 329204261
1525.6 329204261 309528321 293890625 282249540 276308388 275977582 283455819 312382460 358270437
1542 358270437 401839077 446067125 491901398 541750968 590354204 632217288 666245103 700978398
1558.3 700978398 735081434 750835121 759649336 767079353 772238672 775202334 775424600 773133576
1574.6 773133576 768067896 760451257 749506891 731905162 704818964 666372359 616747558 562095582
1590.9 562095582 515204430 487905800 484990597 503212273 533849061 566058576 591113329
1605.2 591113329 605244577 608715236 605600357 603414655 612575471 640529990 672312737 699257731
1621.5F99257731K4411917J6662419Q883238M705071J581371o79433k056122j608968
1637.8G51157224K32637J261532J118005P14957R597j262963k570152l939390m809201
1656.2G41912246o127835q125305r753346r623647q544981r665311j1920392j2133420
1672.5F66018009j4381587j8226803k0256221k2657752k9265344m1717351m1109919
1686.8D78403032l8293094m1619718l8891613l5625100k9502541j6993702o624996
1701.1B70852268k565861J185656O113916P105857N385131L250688J614482Q40336
1717.4B93782473k028317o269663p865399p826031o811946n448252l410489J458586
1733.7B55580962M860878M255235R533822J8394918K6408672L7176460N0349385O5524965
$$ plain form
1621.5 699257731 723669648 740332067 749215305 753920376 755501747 754822314 752766192 751157224
1637.8 751157224 751389861 752651393 753769398 754484355 754493952 753230989 750660837 746721447 741912246
1656.2 741912246 735784411 727659106 717905760 708282113 699737132 690071821 678151429 666018009
1672.5 666018009 651636422 633409619 613153398 590495646 561230302 519512951 478403032
1686.8 478403032 440109938 398490220 359598607 323973507 294470966 277477264 270852268
1701.1 270852268 268286407 269472063 275585979 282691836 288076967 291327655 292942137 293782473
1717.4 293782473 291754156 285484493 277619094 269793063 262981117 257532865 254122376 255580962
1733.7 255580962 260441840 264697075 274230897 292625815 319034487 356210947 406560332 472085297
1750D72085297O9151223N5859029M6556950M0199935L0232132K4091005J7716706J1988342
1766.3G67880619R677708P930338P038415N539655L601253K712369K407015J994371
1782.6H08781743J920760K005994J798391J799882K236008K163053J782358J870811
1799H24359000K060592K010345J678467J502991J492798J571119J529694J388311J379192
1817.3H38972509J375258J310527J292408J423835J333356J401842J487017J172661
1833.6H49769413R53019R23216P82133N76198O52492P36475N81920M47035L93569K74837
1854H56090307K03848J59621N6982k1815r8407k38776l18587k65837l97921n93543
1874.4H54575872o84976o25730m28557j71125q8930k72036n57959q61227j209915j746118
$$ plain form
1750 472085297 541236520 597095549 643652499 683852434 714084566 738175571 755892277 767880619
1766.3 767880619 777558327 785488665 792527080 798066735 801667988 804380357 806787372 808781743
1782.6 808781743 810702503 812708497 814506888 816306770 818542778 820705831 822488189 824359000
1799 824359000 826419592 828429937 830108404 831611395 833104193 834675312 836205006 837593317 838972509
1817.3 838972509 840347767 841658294 842950702 844374537 845707893 847109735 848596752 849769413
1833.6 849769413 850722432 851645648 852427781 853003979 853656471 854392946 854974866 855421901 855815470 856090307
1854 856090307 856294155 856453776 856510758 856488943 856390536 856151760 855833173 855567336 855169415 854575872
1874.4 854575872 853890896 853265166 852836609 852665484 852576554 852304518 851746559 850885332 849675417 847929299
1894.8H47929299k388835k835453k317547n63562J342952K302050K392889K088964
1911.1H47950757J662373J303434J117945J002252P36296N89133M99546L32058K65240
1929.5H55459034K73347K18511J07169O1095M4286N5730J06812J31249J01269N6445
1949.9H56614947n066m0531p7069j39892j46926j12593r0182n3227J4008l1054j15157
1972.3H55817258j15871j11044j60932j76728j47402j95205k32816j71900j01864q3566
1992.7H54319930j05560j56820j81794j90854j87337j67608j54794j43170j42753j29819
2013.1H52759421j07348r8407j07766j03354j21593j49131j51337j76370j90198j58131
2033.5H51395786j55628k38776l02494k51412j24276k0385L8684J08361K11537K83420
$$ plain form
1894.8 847929299 845540464 842705011 840387464 839823902 841166854 843468904 845861793 847950757
1911.1 847950757 849613130 850916564 852034509 853036761 853773057 854362190 854861736 855193794 855459034
1929.5 855459034 855732381 855950892 856058061 856119156 856163442 856219172 856325984 856457233 856558502 856614947
1949.9 856614947 856609881 856569350 856492281 856352389 856205463 856092870 856002688 855949461 855963469 855932415 855817258
1972.3 855817258 855701387 855590343 855429411 855252683 855105281 854910076 854677260 854505360 854403496 854319930
1992.7 854319930 854214370 854057550 853875756 853684902 853497565 853329957 853175163 853031993 852889240 852759421
2013.1 852759421 852652073 852553666 852445900 852342546 852220953 852071822 851920485 851744115 851553917 851395786
2033.5 851395786 851240158 851001382 850698888 850447476 850323200 850302815 850341499 850449860 850661397 850944817
2053.9H50944817L12090L11434K38359J75894J92999J76907Q0466J133m4704p5757
2074.3H52313638p6592n9784m2617m6134p7844r4354p9751q9288q8334n7339p7367
2096.8H51524234q9944m1127l2782n5731m7266K801O4850Q6367Q8394R8765J06573
2119.2H51705134J13428J41680J67191J72019J81913J99676J78516J56402J73569J25766
2139.6H53315294M0889N185j0371R358L6776N126m4107p8440r0063j17838j66893j81556
2164.1H52723360j98722k06470j77980j74522k03550k00808j74582j89126k24828k28525
2184.5H50744247k38359k41816k33948l00884l27826k20418j16348o6757K8253J35839
2204.8H49161983J43349R7215J12831J74702J76310J23859R8645J06633R5010O8724
$$ plain form
2053.9 850944817 851256907 851568341 851806700 851982594 852175593 852352500 852432966 852434099 852389395 852313638
2074.3 852313638 852237046 852177262 852134645 852088511 852010667 851916313 851836562 851747274 851658940 851601601 851524234
2096.8 851524234 851434290 851393163 851360381 851304650 851257384 851260185 851325035 851411402 851499796 851598561 851705134
2119.2 851705134 851818562 851960242 852127433 852299452 852481365 852681041 852859557 853015959 853189528 853315294
2139.6 853315294 853356183 853361368 853350997 853360355 853397131 853402257 853358150 853279710 853189647 853071809 852904916 852723360
2164.1 852723360 852524638 852318168 852140188 851965666 851762116 851561308 851386726 851197600 850972772 850744247
2184.5 850744247 850505888 850264072 850030124 849729240 849401414 849180996 849064648 848997891 849026144 849161983
2204.8 849161983 849305332 849402547 849515378 849690080 849866390 849990249 850088894 850195527 850290537 850359261
2225.2H50359261N1200O4910J08421J40786J31488N9843k9624p5698n9604q1301j89662
2247.7H50480020k90632l49283l83437l36945k29597j95325j98960j37687r4354j17600
2268.1H48146200j23739j40309j68920j69456j84953k10822j84417j15692p8917m9770
2288.5H46719205N603N1618R1374J90556L35216M41194N12957N21660M35770M16160
2308.9H49721313N44667O25312N72026N33998N24700M36842L15607K07245J29521J40071
2329.3H53751302J13725o5565j86503r8288k3424j06812j75953k75790l76642q4162
2349.7H52471888N67198J081228J040638O80446L33131J25169p3552l76224o00934
2368H55248988o96779p36236p54893o88136n23805l88921k99632j69695l0934L0040
$$ plain form
2225.2 850359261 850410461 850475371 850583792 850724578 850856066 850915909 850886285 850810587 850750983 850669682 850480020
2247.7 850480020 850189388 849840105 849456668 849119723 848890126 848694801 848495841 848358154 848263800 848146200
2268.1 848146200 848022461 847882152 847713232 847543776 847358823 847148001 846963584 846847892 846768975 846719205
2288.5 846719205 846724808 846776426 846867800 847058356 847393572 847834766 848347723 848869383 849305153 849721313
2308.9 849721313 850265980 850891292 851463318 851997316 852522016 852958858 853274465 853481710 853611231 853751302
2329.3 853751302 853865027 853799462 853612959 853514671 853491247 853384435 853208482 852932692 852556050 852471888
2349.7 852471888 853039086 854120314 855160952 855841398 856174529 856299698 856226146 855849922 855248988
2368 855248988 854552209 853815973 853061080 852372944 851849139 851460218 851160586 850990891 850959957 850989997
2388.4H50989997P8440J74940K40802K42711K52306K68579K30729J96994K01761J53423
2408.8H53030682O2525J7404l516k5094O318M7267Q106o8724r9600n1796M351J4723
2433.3H52942646N36j6332J490o616p7843j24991j31607j25170r3579o4910p0155j20222
2457.8H52113247j86682j72436j11699j42217k22206k19226j68085j36673j42813j74821
2478.1H50436389j23143J073K5034l6955m9889l1710l5405o0677o5029n4955m5002
2500.6H49959731o080J7822K3484M4704N8711O0617R0599J22130R1851O0082P8261
2523H50601912R9122J03176R3102P6354L0100o1035j19031j30772j63675k06351k17974
2545.5H50104928k14338k26200k33352k02715j43946q3804n9068p4983o4611q404M2915
$$ plain form
2388.4 850989997 851068437 851243377 851484179 851726890 851979196 852247775 852478504 852675498 852877259 853030682
2408.8 853030682 853093207 853110611 853107095 853082001 853088319 853135586 853143692 853074968 852975368 852923572 852927923 852942646
2433.3 852942646 852943182 852926850 852928340 852921724 852843881 852718890 852587283 852462113 852368534 852303624 852233469 852113247
2457.8 852113247 851926565 851754129 851642430 851500213 851278007 851058781 850890696 850754023 850611210 850436389
2478.1 850436389 850313246 850314319 850339353 850302398 850252509 850220799 850185394 850124717 850059688 850004733 849959731
2500.6 849959731 849953651 849971473 849994957 850039661 850098372 850158989 850249588 850371718 850463569 850523651 850601912
2523 850601912 850701034 850804210 850897312 850973666 851003766 850942731 850823700 850692928 850529253 850322902 850104928
2545.5 850104928 849890590 849664390 849431038 849228323 849084377 849000573 848941505 848866522 848801911 848793507 848836422
2567.9H48836422P8142J00076J00255P9870M2260j0252o0022j04845j87575k48015
2588.3H48626316k53737k81036k33949o2882J34885L09169L66330K67744J57774R5904
2608.7H49126518L7849J6987J7405j9074p5757q0347q3268j75357k48015k20239k08020
2631.1H48088682k61545k53022j95980j74582j21296m8041k6643j2160M6730Q7202
2651.5H47129345P9930P9393P5221K9326l2902p2479j05858j79947k30729k04265j96040
2673.9H46370995k53856l42310l98516l42965k67864k84195k89380k46704k22683k37643
2694.3H43484879k66612k18689j52529j56283j69456j92642k45810l18527l86477m40538
2714.7H40937316n05447n91516o64473o71983o15299n38766n30004o12140p27952p95424
$$ plain form
2567.9 848836422 848914564 849014640 849114895 849194765 849237025 849226773 849166751 849061906 848874331 848626316
2588.3 848626316 848372579 848091543 847857594 847794712 847929597 848238766 848605096 848872840 849030614 849126518
2608.7 849126518 849164367 849181354 849198759 849179685 849103928 849023581 848940313 848764956 848516941 848296702 848088682
2631.1 848088682 847827137 847574115 847378135 847203553 847082257 847034216 847007573 846995413 847042143 847129345
2651.5 847129345 847209275 847288668 847363889 847393215 847360313 847287834 847181976 847002029 846771300 846567035 846370995
2673.9 846370995 846117139 845774829 845376313 845033348 844765484 844481289 844191909 843945205 843722522 843484879
2694.3 843484879 843218267 842999578 842847049 842690766 842521310 842328668 842082858 841764331 841377854 840937316
2714.7 840937316 840431869 839840353 839175880 838503897 837888598 837349832 836819828 836207688 835479736 834684312
2735.1H34684312p94947q53479r68396r80854q71301p69556p13229o56545n90801m93825
2755.5H26991379l14772q3089R6441J92999K76328M00364M97341N25594N57721O42180
2775.9H29782486O88195O14345M76182L52502K53975J49369J17958J62899Q3566j20044
2796.3H32561433j94490j28984j34945k74956n55158q87751j119912j316309j589120
2814.7H26359808j882076k101183k243101k410591k667725k964020l305197l775775
2831H05010140m277408m482508m157483l475786l228426m267275o507278q435487p971764
2849.3G58206725n421340l547013l439665l959656m371166m778147n347550n984068
2865.7G21358120o490588o681323o171822m350663q80599L345430O062568N413413
$$ plain form
2735.1 834684312 833889365 833035886 832067490 831086636 830215335 829445779 828732550 828076005 827485204 826991379
2755.5 826991379 826676607 826593518 826689959 826882958 827159286 827559650 828056991 828582585 829140306 829782486
2775.9 829782486 830470681 831085026 831561208 831913710 832167685 832317054 832435012 832597911 832681477 832561433
2796.3 832561433 832366943 832237959 832103014 831828058 831272900 830385149 829265237 827948928 826359808
2814.7 826359808 824477732 822376549 820133448 817722857 815055132 812091112 808785915 805010140
2831 805010140 800732732 796250224 792092741 788616955 785388529 781121254 774613976 766178489 758206725
2849.3 758206725 752785385 749238372 745798707 741839051 737467885 732689738 727342188 721358120
2865.7 721358120 714867532 708186209 702014387 697663724 696783125 700128555 706191123 711604536
2882G11604536J755058l113508p851958j1757255j3819813j2769282q700431m046738
2898.3F51300609j278102m84586o29664j389145k793312m669548o414771o717980n024969
2916.6F21898532k720475j302421r78172j427651k383530l608703m905820o244183
2933E98327577p471859p769943o547808m833699m124283m383147m743576m994512n455732
2951.3E48003018o283224p128000p034242m868865l0339P367790J5521228K1054745
2967.6E66602111K2620737K1920085K0466984J8623352J6726494J5092015J3814390
2981.9F95866168J2825191J1934995J0996819R952187Q856476P779300O676912N656243
2998.2G70544291M873156M295647L839672L348946K735138K107859J677513J544595
$$ plain form
2882 711604536 713359594 710246086 702394128 690636873 676817060 664047778 655347347 651300609
2898.3 651300609 650022507 649537921 648908257 647519112 644725800 640056252 633641481 626923501 621898532
2916.6 621898532 619178057 617875636 616897464 615469813 613086283 609477580 604571760 598327577
2933 598327577 590855718 583085775 576537967 571704268 567579985 563196838 558453262 553458750 548003018
2951.3 548003018 541719794 534591794 527557552 522688687 522658348 530026138 545547366 566602111
2967.6 566602111 589222848 611142933 631609917 650233269 666959763 682051778 695866168
2981.9 695866168 708691359 720626354 731623173 741575360 750431836 758211136 764888048 770544291
2998.2 770544291 775417447 779713094 783552766 786901712 789636850 791744709 793422222 794966817
3014.5G94966817J439631J043260K43843q91924k090693l062665l568530l587425l399789
3032.9G81092525l294945l416717l438533k556979n06759J924634L733397M518330
3049.2G78054953M487395M002392L268540K570570K277553K461731K868176L107190
3065.5H03098500L068447K945244K754748K385497J895666J553417J436054J343668
3081.9H20481241J203358J001418O56902K32101r4950m03703q62836j317263j515031
3100.2H19381237j567960j742601j972795k107203k215385k352536k356768k077817
3116.5H02988172j457394n29646M08291J138389J748682K249956K604365K858996K911091
3134.9H14920902K725780K463281K189160J842081J436770J084626P65801M71174K97666
$$ plain form
3014.5 794966817 796406448 797449708 797693551 796801627 794710934 791648269 788079739 784492314 781092525
3032.9 781092525 777797580 774380863 770942330 768385351 767878592 769803226 773536623 778054953
3049.2 778054953 782542348 786544740 789813280 792383850 794661403 797123134 799991310 803098500
3065.5 803098500 806166947 809112191 811866939 814252436 816148102 817701519 819137573 820481241
3081.9 820481241 821684599 822686017 823342919 823575020 823480070 823076367 822213531 820896268 819381237
3100.2 819381237 817813277 816070676 814097881 811990678 809775293 807422757 805065989 802988172
3116.5 802988172 801530778 801001132 801409423 802547812 804296494 806546450 809150815 812009811 814920902
3134.9 814920902 817646682 820109963 822299123 824141204 825577974 826662600 827428401 827899575 828197241
3153.2H28197241J65522k3902j85430l51369n47171p16447r26197j182556j506865
3171.6H22922826j905441k206684k402603k542019k445281k107382j742899j324236
3187.9H06246281p21038r9539L61561O93441Q93652R18985P40528M12464O5923k32041
3208.3H09280217n29647q62062j140058j346708j490891j587510j748204j963794k095163
3226.7G96516180k146661k294243k408146k278150k220392k385914k508164k613365
3243G77661145k792061k935290l034234l143609l350794l673851l971100m205287m430711
3261.3G46124208m722536n133450n609095o069302o486774o952107p548451q263827
3277.7F95338666q988261r635150j0278523j0970593j1649489j2191415j2582958j2968421
$$ plain form
3153.2 828197241 828362763 828338861 828153431 827802062 827254891 826538444 825612247 824429691 822922826
3171.6 822922826 821017385 818810701 816408098 813866079 811420798 809313416 807570517 806246281
3187.9 806246281 805525243 805425704 805787265 806480706 807374358 808293343 809033871 809446335 809512258 809280217
3208.3 809280217 808750570 807888508 806748450 805401742 803910851 802323341 800575137 798611343 796516180
3226.7 796516180 794369519 792075276 789667130 787388980 785168588 782782674 780274510 777661145
3243 777661145 774869084 771933794 768899560 765755951 762405157 758731306 754760206 750554919 746124208
3261.3 746124208 741401672 736268222 730659127 724589825 718103051 711150944 703602493 695338666
3277.7 695338666 686350405 676715255 666436732 655466139 643816650 631625235 619042277 606073856
3294F06073856j3310134j3419569j3492643j4000118j5126169j6614973j7664135j7117500
3310.3D85328615j4259756r692818n265266k769649k642035l589958l217131L40611
3326.6D44232613O748736J3720065J8742710K0785243K0343721J8450916J6269505
3340.9E59293509J4440774J3062835J2127936J1429846J0868729J0574340J0434568
3355.2F42232537J0216356R979546R850382R664000R319722Q980692Q722663Q470416
3371.5G17436314Q034348P430911O912470O474435O003023N530297N100668M598319
3387.8G67520785M030407L770292L762245L572941L171086K840459K901614L087401
3404.1G94657230K871156K457857K166748J902342J729071J686514J575231J380146
$$ plain form
3294 606073856 592763722 579344153 565851510 551851392 536725223 520110250 502446115 485328615
3310.3 485328615 471068859 461376041 456110775 453341126 450699091 447109133 443892002 444232613
3326.6 444232613 450981349 464701414 483444124 504229367 524573088 543024004 559293509
3340.9 559293509 573734283 586797118 598925054 610354900 621223629 631797969 642232537
3355.2 642232537 652448893 662428439 672278821 681942821 691262543 700243235 708965898 717436314
3371.5 717436314 725470662 732901573 739814043 746288478 752291501 757821798 762922466 767520785
3387.8 767520785 771551192 775321484 779083729 782656670 785827756 788668215 791569829 794657230
3404.1 794657230 797528386 799986243 802152991 804055333 805784404 807470918 809046149 810426295
3420.4H10426295J123130P61509M13716K97189L82185L29077P2956K5451K87891M34517
3440.8H14553916L62456L91841O01530P98941R30667J013279R63628P96020O85990
3459.2H21098268P98941Q41260N27978L43799N28693O63519N67317L40700O7950m7148
3479.6H25731277J35959J82211o5982p5937M1366j39594l35515l02672k68757k85268
3500H24617088j45793M3690n6684k44737k61783l19541l57926k19583q1480q8274j60515
3522.4H22724462j57834o1035L7551N1558M17k7179J9789J24216J23202k8789J05858
3544.8H22912216M94480M95315L93033N00679L88503J77801K78294M05192L44157N27919
3565.2H26917589Q84235O60002K34306K33829M25338N23091M38690K32816j6272l4511
$$ plain form
3420.4 810426295 811549425 812310934 812724650 813021839 813404024 813733101 813806057 813831508 814119399 814553916
3440.8 814553916 814916372 815308213 815909743 816708684 817639351 818652630 819616258 820412278 821098268
3459.2 821098268 821897209 822738469 823266447 823610246 824138939 824802458 825369775 825710475 825778425 825731277
3479.6 825731277 825867236 826049447 825983465 825907528 825948894 825809300 825473785 825171113 824902356 824617088
3500 824617088 824471295 824514985 824458301 824213564 823951781 823632240 823274314 823054731 822973251 822884977 822724462
3522.4 822724462 822566628 822505593 822543144 822594702 822595119 822567940 822587729 822711945 822835147 822806358 822912216
3544.8 822912216 823406696 823902011 824295044 824795723 825184226 825362027 825640321 826045513 826389670 826917589
3565.2 826917589 827801824 828461826 828696132 828929961 829355299 829878390 830317080 830549896 830533624 830499113
3585.6H30499113N72025Q19147K15530K444K36392K71619K13921J72913M6313L3974
3606H33083391J86742R0003r2566P331K2173K00391O26623M34578j17660k91824M98831
3628.5H34648013J136720M70043J87039L77238M20868L33488J59621o1869J03652J186788
3648.8H38961601J769781P43211K60472P51615P45356M07219L37243J67548P0930O16729
3669.2H44831705J047015N95928Q92639J163006M89234K94090K81930J22070L28779
3687.6H50046396R16243Q27432K74777O0618J9193O1154L22163K83241j49250l12447
3708H52349520p8202M02630L99053j4067j91748j58608L7611J86503J55031j5139k45750
3730.4H52826834k38657R9599K85924r0123n79476m53293L09229K04145l32355J31071
$$ plain form
3585.6 830499113 831071138 831890285 832105815 832108259 832344651 832616270 832830191 833003104 833049417 833083391
3606 833083391 833270133 833360136 833267570 833274901 833297074 833497465 834124088 834558666 834441006 834149182 834648013
3628.5 834648013 835784733 836254776 836441815 836819053 837239921 837573409 837733030 837671161 837774813 838961601
3648.8 838961601 840731382 841474593 841735065 842486680 843232036 843639255 843976498 844144046 844214976 844831705
3669.2 844831705 845878720 846474648 847367287 848530293 849019527 849313617 849595547 849717617 850046396
3687.6 850046396 850962639 851790071 852064848 852125466 852144659 852205813 852527976 852811217 852661967 852349520
3708 852349520 852271318 852673948 853073001 853058934 852867186 852708578 852746189 852932692 853087723 853072584 852826834
3730.4 852826834 852588177 852687776 852973700 852883577 852304101 851850808 852160037 852364182 852031827 852162898
3750.8H52162898N27799J44064j06513K4914P4089j86622j46926P0572J53959K10047
3771.2H52928281J0431j88709j14262J47820J81436j5318m6551j13666j72615j10746
3791.6H52506101j68145j72853q4460k6464K40206J6809k75791J01567J6987m69327
3812H51684630m53830R3103J51038k2292K97367n007l73363k04444n2273o0618j68920
3834.4H50885391j16527K35796K43008l8385j30415k18630l74079n14269m3094P11024
3854.8H50639820J10865m10021k72810L278R8527j35720j17123J48654j6868j38998
3875.2H49909604k40803j88530J65344O3598r716M8936j55867o3002J1325l02493l74735
3897.7H48863661l9816J66417J60038J23501q9824j32263n4479k09152k20478L0518
$$ plain form
3750.8 852162898 852690697 852834761 852728248 852753162 852827251 852640629 852493703 852564275 852718234 852928281
3771.2 852928281 852938712 852750003 852635741 852783561 852964997 852949679 852903128 852789462 852616847 852506101
3791.6 852506101 852337956 852165103 852080643 852054179 852294385 852311194 852035403 852136970 852153957 851684630
3812 851684630 851230800 851323903 851474941 851452649 851750016 851745009 851371646 851167202 851114929 851054311 850885391
3834.4 850885391 850768864 851004660 851247668 851209283 851078868 850860238 850486159 849971890 849928796 850639820
3854.8 850639820 850750685 850340664 850067854 850071132 850169659 850033939 849916816 850065470 850048602 849909604
3875.2 849909604 849668801 849480271 849645615 849709213 849699497 849748433 849592566 849529564 849540889 849238396 848863661
3897.7 848863661 848823845 848990262 849150300 849273801 849183977 849051714 848997235 848788083 848567605 848598123
3918.1H48598123M9054j61230j43588o974j21236j60515L9697P9453p3016k00927l04937
3940.5H47593904k58387q3327J8358R3162M4763j29401j70410j16408j25348j11997
3960.9H46754909o7771j00315j70230k25664j83761j00732j45375k40326k58625k02298
3981.3H45059812j37925j27673j47283j61648j25766r6798j59860j96516
3997.6H43906343
$$ plain form
3918.1 848598123 848647177 848485947 848342359 848335385 848214149 848053634 848093331 848172784 848099768 847898841 847593904
3940.5 847593904 847335517 847252190 847270548 847363710 847408473 847279072 847108662 846992254 846866906 846754909
3960.9 846754909 846687138 846586823 846416593 846190929 846007168 845906436 845761061 845520735 845262110 845059812
3981.3 845059812 844921887 844794214 844646931 844485283 844359517 844262719 844102859 843906343
3997.6 843906343
##END=$$ End of the data block
